Fluorene
- Formula: C13H10
- Molecular weight: 166.2185
- IUPAC Standard InChIKey: NIHNNTQXNPWCJQ-UHFFFAOYSA-N
- CAS Registry Number: 86-73-7
- Chemical structure:
View 3d structure (requires JavaScript / HTML 5) - Other names: 9H-Fluorene; o-Biphenylenemethane; Diphenylenemethane; Methane, diphenylene-; 2,2'-Methylenebiphenyl; 2,3-Benzindene; o-Biphenylmethane

Gas phase thermochemistry data

Data compiled as indicated in comments:
DRB - Donald R. Burgess, Jr.
ALS - Hussein Y. Afeefy, Joel F. Liebman, and Stephen E. Stein
GT - Glushko Thermocenter, Russian Academy of Sciences, Moscow
Quantity | Value | Units | Method | Reference | Comment |
---|---|---|---|---|---|
ΔfH°gas | 42.23 ± 0.74 | kcal/mol | Review | Roux, Temprado, et al., 2008 | There are sufficient literature values to make a qualified recommendation where the suggested value is in good agreement with values predicted using thermochemical cycles or from reliable estimates. In general, the evaluated uncertainty limits are on the order of (2 to 4) kJ/mol.; DRB |
ΔfH°gas | 41.83 ± 0.35 | kcal/mol | Ccr | Rakus, Verevkin, et al., 1994 | ALS |
ΔfH°gas | 39.89 ± 0.98 | kcal/mol | Ccb | Sabbah, 1991 | see Sabbah and Antipine, 1987; ALS |
Constant pressure heat capacity of gas
Cp,gas (cal/mol*K) | Temperature (K) | Reference | Comment |
---|---|---|---|
9.477 | 50. | Dorofeeva O.V., 1989 | Recommended values are also reproduced in the reference book [ Frenkel M., 1994]. These statistically calculated S(T) values agree with experimental ones within 1 J/mol*K.; GT |
13.84 | 100. | ||
19.47 | 150. | ||
26.267 | 200. | ||
37.457 | 273.15 | ||
41.37 ± 0.24 | 298.15 | ||
41.661 | 300. | ||
56.410 | 400. | ||
68.709 | 500. | ||
78.518 | 600. | ||
86.348 | 700. | ||
92.694 | 800. | ||
97.916 | 900. | ||
102.27 | 1000. | ||
105.93 | 1100. | ||
109.03 | 1200. | ||
111.67 | 1300. | ||
113.93 | 1400. | ||
115.88 | 1500. |

Condensed phase thermochemistry data

Data compiled as indicated in comments:
DRB - Donald R. Burgess, Jr.
ALS - Hussein Y. Afeefy, Joel F. Liebman, and Stephen E. Stein
DH - Eugene S. Domalski and Elizabeth D. Hearing
Quantity | Value | Units | Method | Reference | Comment |
---|---|---|---|---|---|
ΔfH°solid | 21.6 ± 0.67 | kcal/mol | Review | Roux, Temprado, et al., 2008 | There are sufficient literature values to make a qualified recommendation where the suggested value is in good agreement with values predicted using thermochemical cycles or from reliable estimates. In general, the evaluated uncertainty limits are on the order of (2 to 4) kJ/mol.; DRB |
ΔfH°solid | 21.48 ± 0.33 | kcal/mol | Ccr | Rakus, Verevkin, et al., 1994 | ALS |
ΔfH°solid | 20.7 ± 0.98 | kcal/mol | Ccb | Sabbah, 1991 | see Sabbah and Antipine, 1987; ALS |
Quantity | Value | Units | Method | Reference | Comment |
ΔcH°solid | -1585.71 ± 0.26 | kcal/mol | Ccr | Rakus, Verevkin, et al., 1994 | Corresponding ΔfHºsolid = 21.47 kcal/mol (simple calculation by NIST; no Washburn corrections); ALS |
ΔcH°solid | -1585.0 ± 0.96 | kcal/mol | Ccb | Sabbah, 1991 | see Sabbah and Antipine, 1987; Corresponding ΔfHºsolid = 20.7 kcal/mol (simple calculation by NIST; no Washburn corrections); ALS |
Quantity | Value | Units | Method | Reference | Comment |
S°solid,1 bar | 49.551 | cal/mol*K | N/A | Finke, Messerly, et al., 1977 | crystaline, I phase; DH |
Constant pressure heat capacity of solid
Cp,solid (cal/mol*K) | Temperature (K) | Reference | Comment |
---|---|---|---|
48.549 | 298.15 | Finke, Messerly, et al., 1977 | crystaline, I phase; T = 10 to 440 K.; DH |
45.29 | 298.1 | Eibert, 1944 | T = 25 to 200°C, equations only, in t°C. Cp(c) = 0.2479 + 0.001233t cal/g*K (25 to 70°C); Cp(liq) = 0.320 + 0.00845t cal/g*K (114 to 200°C).; DH |

Phase change data

Data compiled as indicated in comments:
BS - Robert L. Brown and Stephen E. Stein
TRC - Thermodynamics Research Center, NIST Boulder Laboratories, Chris Muzny director
AC - William E. Acree, Jr., James S. Chickos
DRB - Donald R. Burgess, Jr.
ALS - Hussein Y. Afeefy, Joel F. Liebman, and Stephen E. Stein
DH - Eugene S. Domalski and Elizabeth D. Hearing
Quantity | Value | Units | Method | Reference | Comment |
---|---|---|---|---|---|
Tboil | 571.2 | K | N/A | Aldrich Chemical Company Inc., 1990 | BS |
Tboil | 567.2 | K | N/A | Weast and Grasselli, 1989 | BS |
Tboil | 569.55 | K | N/A | Lecat, 1943 | Uncertainty assigned by TRC = 0.5 K; TRC |
Quantity | Value | Units | Method | Reference | Comment |
Tfus | 388. ± 2. | K | AVG | N/A | Average of 13 values; Individual data points |
Quantity | Value | Units | Method | Reference | Comment |
Ttriple | 355.51 | K | N/A | Sabbah, 1991 | Uncertainty assigned by TRC = 0.03 K; TRC |
Ttriple | 387.94 | K | N/A | Finke, Messerly, et al., 1977, 2 | Crystal phase 1 phase; Uncertainty assigned by TRC = 0.02 K; C2 - C1 is a second order transition; TRC |
Ttriple | 387.94 | K | N/A | Osborn and Douslin, 1975 | Uncertainty assigned by TRC = 0.02 K; TRC |
Quantity | Value | Units | Method | Reference | Comment |
ΔvapH° | 17.3 ± 0.41 | kcal/mol | CGC | Hanshaw, Nutt, et al., 2008 | AC |
ΔvapH° | 17.8 ± 0.29 | kcal/mol | GC | Haftka, Parsons, et al., 2006 | Based on data from 373. to 423. K.; AC |
ΔvapH° | 17.3 | kcal/mol | CGC | Chickos, Hesse, et al., 1998 | AC |
ΔvapH° | 17.3 | kcal/mol | CGC | Chickos, Hosseini, et al., 1995 | Based on data from 403. to 453. K.; AC |
ΔvapH° | 15.7 | kcal/mol | B | Rakus, Verevkin, et al., 1994 | Based on data from 323. to 363. K.; AC |
Quantity | Value | Units | Method | Reference | Comment |
ΔsubH° | 20. ± 1. | kcal/mol | AVG | N/A | Average of 9 values; Individual data points |
Enthalpy of vaporization
ΔvapH (kcal/mol) | Temperature (K) | Method | Reference | Comment |
---|---|---|---|---|
16.0 | 398. | GC | Lei, Chankalal, et al., 2002 | Based on data from 323. to 473. K.; AC |
15.1 | 398. | N/A | Sasse, Jose, et al., 1988 | Based on data from 383. to 427. K.; AC |
13.0 | 417. | A | Stephenson and Malanowski, 1987 | Based on data from 402. to 568. K.; AC |
13.5 | 498. | I | Mortimer and Murphy, 1923 | Based on data from 423. to 573. K.; AC |
Antoine Equation Parameters
log10(P) = A − (B / (T + C))
P = vapor pressure (atm)
T = temperature (K)
View plot Requires a JavaScript / HTML 5 canvas capable browser.
Temperature (K) | A | B | C | Reference | Comment |
---|---|---|---|---|---|
434. to 573.6 | 5.24532 | 3011.076 | 3.857 | Mortimer and Murphy, 1923 | Coefficents calculated by NIST from author's data. |
Enthalpy of sublimation
ΔsubH (kcal/mol) | Temperature (K) | Method | Reference | Comment |
---|---|---|---|---|
20.3 | 383. | GS | Nass, Lenoir, et al., 1995 | Based on data from 313. to 453. K.; AC |
20.3 ± 0.1 | 343. | GS | Rakus, Verevkin, et al., 1994 | Based on data from 323. to 363. K.; AC |
20.8 ± 0.24 | 318. | PG | Sasse, Jose, et al., 1988 | Based on data from 318. to 333. K.; AC |
18.9 | 363. | A | Stephenson and Malanowski, 1987 | Based on data from 348. to 388. K.; AC |
22.0 | 320. | T | Hansen and Eckert, 1986 | Based on data from 298. to 343. K.; AC |
19.9 | 328. | GS | SATO, INOMATA, et al., 1986 | Based on data from 308. to 347. K.; AC |
21.1 ± 0.1 | 303. | GS | Sonnefeld, Zoller, et al., 1983 | Based on data from 283. to 323. K.; AC |
19.9 ± 0.31 | 350. to 388. | N/A | Finke, Messerly, et al., 1977 | See also Osborn and Douslin, 1975, 2.; AC |
19.6 | 388. | B | Osborn and Douslin, 1975, 2 | AC |
19.2 ± 0.2 | 293. | TE | Budurov, 1960 | Based on data from 286. to 300. K.; AC |
19.8 | 306. to 322. | N/A | Bradley and Cleasby, 1953 | See also Jones, 1960.; AC |
19.8 | 315. | N/A | Bradley and Cleasby, 1953, 2 | Based on data from 306. to 323. K. See also Stephenson and Malanowski, 1987.; AC |
19.800 | 306.30 | V | Bradley and Cleasby, 1953, 3 | ALS |
Enthalpy of fusion
ΔfusH (kcal/mol) | Temperature (K) | Method | Reference | Comment |
---|---|---|---|---|
4.57 | 387.7 | DSC | Lisicki and Jamróz, 2000 | AC |
4.680 | 387.9 | N/A | Domalski and Hearing, 1996 | AC |
4.7490 | 387.0 | N/A | Eibert, 1944 | DH |
Entropy of fusion
ΔfusS (cal/mol*K) | Temperature (K) | Reference | Comment |
---|---|---|---|
12.3 | 387.0 | Eibert, 1944 | DH |
Temperature of phase transition
Ttrs (K) | Initial Phase | Final Phase | Reference | Comment |
---|---|---|---|---|
288. | crystaline, II | crystaline, I | Finke, Messerly, et al., 1977 | Second order transition.; DH |
Enthalpy of phase transition
ΔHtrs (kcal/mol) | Temperature (K) | Initial Phase | Final Phase | Reference | Comment |
---|---|---|---|---|---|
4.67930 | 387.94 | crystaline, I | liquid | Finke, Messerly, et al., 1977 | DH |
Entropy of phase transition
ΔStrs (cal/mol*K) | Temperature (K) | Initial Phase | Final Phase | Reference | Comment |
---|---|---|---|---|---|
12.06 | 387.94 | crystaline, I | liquid | Finke, Messerly, et al., 1977 | DH |

Reaction thermochemistry data

Data compiled as indicated in comments:
B - John E. Bartmess
M - Michael M. Meot-Ner (Mautner) and Sharon G. Lias
ALS - Hussein Y. Afeefy, Joel F. Liebman, and Stephen E. Stein
Individual Reactions
C13H9- + =
By formula: C13H9- + H+ = C13H10
Quantity | Value | Units | Method | Reference | Comment |
---|---|---|---|---|---|
ΔrH° | 350.5 ± 2.0 | kcal/mol | D-EA | Römer, Janaway, et al., 1997 | gas phase; B |
ΔrH° | 351.7 ± 2.1 | kcal/mol | G+TS | Taft and Bordwell, 1988 | gas phase; B |
ΔrH° | 353.3 ± 2.6 | kcal/mol | G+TS | Cumming and Kebarle, 1978 | gas phase; B |
Quantity | Value | Units | Method | Reference | Comment |
ΔrG° | 342.7 ± 2.1 | kcal/mol | H-TS | Römer, Janaway, et al., 1997 | gas phase; B |
ΔrG° | 344.0 ± 2.0 | kcal/mol | IMRE | Taft and Bordwell, 1988 | gas phase; B |
ΔrG° | 345.5 ± 2.0 | kcal/mol | IMRE | Cumming and Kebarle, 1978 | gas phase; B |
By formula: C10H8+ + C13H10 = (C10H8+ • C13H10)
Bond type: Charge transfer bond (positive ion)
Quantity | Value | Units | Method | Reference | Comment |
---|---|---|---|---|---|
ΔrH° | 14.6 | kcal/mol | PHPMS | Meot-Ner (Mautner), 1980 | gas phase; Entropy change calculated or estimated; M |
Quantity | Value | Units | Method | Reference | Comment |
ΔrS° | 28. | cal/mol*K | N/A | Meot-Ner (Mautner), 1980 | gas phase; Entropy change calculated or estimated; M |
Free energy of reaction
ΔrG° (kcal/mol) | T (K) | Method | Reference | Comment |
---|---|---|---|---|
6.0 | 307. | PHPMS | Meot-Ner (Mautner), 1980 | gas phase; Entropy change calculated or estimated; M |
By formula: C12H8+ + C13H10 = (C12H8+ • C13H10)
Bond type: Charge transfer bond (positive ion)
Quantity | Value | Units | Method | Reference | Comment |
---|---|---|---|---|---|
ΔrH° | 13.3 | kcal/mol | PHPMS | Meot-Ner (Mautner), 1980 | gas phase; Entropy change calculated or estimated; M |
Quantity | Value | Units | Method | Reference | Comment |
ΔrS° | 28. | cal/mol*K | N/A | Meot-Ner (Mautner), 1980 | gas phase; Entropy change calculated or estimated; M |
Free energy of reaction
ΔrG° (kcal/mol) | T (K) | Method | Reference | Comment |
---|---|---|---|---|
5.4 | 283. | PHPMS | Meot-Ner (Mautner), 1980 | gas phase; Entropy change calculated or estimated; M |
By formula: C13H10+ + C13H10 = (C13H10+ • C13H10)
Bond type: Charge transfer bond (positive ion)
Quantity | Value | Units | Method | Reference | Comment |
---|---|---|---|---|---|
ΔrH° | 16.5 | kcal/mol | PHPMS | Meot-Ner (Mautner), 1980 | gas phase; Entropy change calculated or estimated; M |
Quantity | Value | Units | Method | Reference | Comment |
ΔrS° | 28. | cal/mol*K | N/A | Meot-Ner (Mautner), 1980 | gas phase; Entropy change calculated or estimated; M |
Free energy of reaction
ΔrG° (kcal/mol) | T (K) | Method | Reference | Comment |
---|---|---|---|---|
7.2 | 331. | PHPMS | Meot-Ner (Mautner), 1980 | gas phase; Entropy change calculated or estimated; M |
By formula: C13H11+ + C13H10 = (C13H11+ • C13H10)
Quantity | Value | Units | Method | Reference | Comment |
---|---|---|---|---|---|
ΔrH° | 14.4 | kcal/mol | PHPMS | Meot-Ner (Mautner), 1980 | gas phase; Entropy change calculated or estimated; M |
Quantity | Value | Units | Method | Reference | Comment |
ΔrS° | 28. | cal/mol*K | N/A | Meot-Ner (Mautner), 1980 | gas phase; Entropy change calculated or estimated; M |
Quantity | Value | Units | Method | Reference | Comment |
ΔrG° | 6.1 | kcal/mol | PHPMS | Meot-Ner (Mautner), 1980 | gas phase; Entropy change calculated or estimated; M |
By formula: 3H2 + C13H10 = C13H16
Quantity | Value | Units | Method | Reference | Comment |
---|---|---|---|---|---|
ΔrH° | -42. | kcal/mol | Eqk | Frye and Weitkamp, 1969 | gas phase; ALS |

Henry's Law data

Data compiled by: Rolf Sander
Henry's Law constant (water solution)
kH(T) = k°H exp(d(ln(kH))/d(1/T) ((1/T) - 1/(298.15 K)))
k°H = Henry's law constant for solubility in water at 298.15 K (mol/(kg*bar))
d(ln(kH))/d(1/T) = Temperature dependence constant (K)
k°H (mol/(kg*bar)) | d(ln(kH))/d(1/T) (K) | Method | Reference |
---|---|---|---|
9.9 | X | N/A | |
8.4 | 3000. | X | N/A |
12. | L | N/A | |
10. | M | N/A |

Gas phase ion energetics data

Data evaluated as indicated in comments:
HL - Edward P. Hunter and Sharon G. Lias
L - Sharon G. Lias
Data compiled as indicated in comments:
B - John E. Bartmess
MM - Michael M. Meot-Ner (Mautner)
LLK - Sharon G. Lias, Rhoda D. Levin, and Sherif A. Kafafi
RDSH - Henry M. Rosenstock, Keith Draxl, Bruce W. Steiner, and John T. Herron
Quantity | Value | Units | Method | Reference | Comment |
---|---|---|---|---|---|
IE (evaluated) | 7.91 ± 0.02 | eV | N/A | N/A | L |
Quantity | Value | Units | Method | Reference | Comment |
Proton affinity (review) | 198.7 | kcal/mol | N/A | Hunter and Lias, 1998 | HL |
Quantity | Value | Units | Method | Reference | Comment |
Gas basicity | 192.1 | kcal/mol | N/A | Hunter and Lias, 1998 | HL |
Electron affinity determinations
EA (eV) | Method | Reference | Comment |
---|---|---|---|
<0.278 ± 0.026 | ECD | Wojnarovits and Foldiak, 1981 | EA is an upper limit: Chen and Wentworth, 1989. G3MP2B3 calculations indicate an EA of ca. -0.1 eV, anion unbound.; B |
Proton affinity at 298K
Proton affinity (kcal/mol) | Reference | Comment |
---|---|---|
197.9 | Aue, Guidoni, et al., 2000 | Experimental literature data re-evaluated by the authors using ab initio protonation entropies; MM |
Gas basicity at 298K
Gas basicity (review) (kcal/mol) | Reference | Comment |
---|---|---|
191.4 | Aue, Guidoni, et al., 2000 | Experimental literature data re-evaluated by the authors using ab initio protonation entropies; MM |
Ionization energy determinations
IE (eV) | Method | Reference | Comment |
---|---|---|---|
7.88 ± 0.05 | EQ | Mautner(Meot-Ner), 1980 | LLK |
8.52 | EI | Terlouw, Heerma, et al., 1974 | LLK |
7.89 ± 0.03 | PI | Potapov, Kardash, et al., 1972 | LLK |
7.93 ± 0.01 | PE | Dewar, Haselbach, et al., 1970 | RDSH |
8.42 | CTS | Mukherjee, 1969 | RDSH |
7.78 | CTS | Slifkin and Allison, 1967 | RDSH |
7.91 | PE | Ruscic, Kovac, et al., 1978 | Vertical value; LLK |
7.93 ± 0.02 | PE | Maier and Turner, 1972 | Vertical value; LLK |
Appearance energy determinations
Ion | AE (eV) | Other Products | Method | Reference | Comment |
---|---|---|---|---|---|
C13H9+ | 12.5 ± 0.1 | H | EI | Rapp, Staab, et al., 1970 | RDSH |
De-protonation reactions
C13H9- + =
By formula: C13H9- + H+ = C13H10
Quantity | Value | Units | Method | Reference | Comment |
---|---|---|---|---|---|
ΔrH° | 350.5 ± 2.0 | kcal/mol | D-EA | Römer, Janaway, et al., 1997 | gas phase; B |
ΔrH° | 351.7 ± 2.1 | kcal/mol | G+TS | Taft and Bordwell, 1988 | gas phase; B |
ΔrH° | 353.3 ± 2.6 | kcal/mol | G+TS | Cumming and Kebarle, 1978 | gas phase; B |
Quantity | Value | Units | Method | Reference | Comment |
ΔrG° | 342.7 ± 2.1 | kcal/mol | H-TS | Römer, Janaway, et al., 1997 | gas phase; B |
ΔrG° | 344.0 ± 2.0 | kcal/mol | IMRE | Taft and Bordwell, 1988 | gas phase; B |
ΔrG° | 345.5 ± 2.0 | kcal/mol | IMRE | Cumming and Kebarle, 1978 | gas phase; B |

Ion clustering data

Data compiled by: Michael M. Meot-Ner (Mautner) and Sharon G. Lias
Clustering reactions
By formula: C10H8+ + C13H10 = (C10H8+ • C13H10)
Bond type: Charge transfer bond (positive ion)
Quantity | Value | Units | Method | Reference | Comment |
---|---|---|---|---|---|
ΔrH° | 14.6 | kcal/mol | PHPMS | Meot-Ner (Mautner), 1980 | gas phase; Entropy change calculated or estimated |
Quantity | Value | Units | Method | Reference | Comment |
ΔrS° | 28. | cal/mol*K | N/A | Meot-Ner (Mautner), 1980 | gas phase; Entropy change calculated or estimated |
Free energy of reaction
ΔrG° (kcal/mol) | T (K) | Method | Reference | Comment |
---|---|---|---|---|
6.0 | 307. | PHPMS | Meot-Ner (Mautner), 1980 | gas phase; Entropy change calculated or estimated |
By formula: C12H8+ + C13H10 = (C12H8+ • C13H10)
Bond type: Charge transfer bond (positive ion)
Quantity | Value | Units | Method | Reference | Comment |
---|---|---|---|---|---|
ΔrH° | 13.3 | kcal/mol | PHPMS | Meot-Ner (Mautner), 1980 | gas phase; Entropy change calculated or estimated |
Quantity | Value | Units | Method | Reference | Comment |
ΔrS° | 28. | cal/mol*K | N/A | Meot-Ner (Mautner), 1980 | gas phase; Entropy change calculated or estimated |
Free energy of reaction
ΔrG° (kcal/mol) | T (K) | Method | Reference | Comment |
---|---|---|---|---|
5.4 | 283. | PHPMS | Meot-Ner (Mautner), 1980 | gas phase; Entropy change calculated or estimated |
By formula: C13H10+ + C13H10 = (C13H10+ • C13H10)
Bond type: Charge transfer bond (positive ion)
Quantity | Value | Units | Method | Reference | Comment |
---|---|---|---|---|---|
ΔrH° | 16.5 | kcal/mol | PHPMS | Meot-Ner (Mautner), 1980 | gas phase; Entropy change calculated or estimated |
Quantity | Value | Units | Method | Reference | Comment |
ΔrS° | 28. | cal/mol*K | N/A | Meot-Ner (Mautner), 1980 | gas phase; Entropy change calculated or estimated |
Free energy of reaction
ΔrG° (kcal/mol) | T (K) | Method | Reference | Comment |
---|---|---|---|---|
7.2 | 331. | PHPMS | Meot-Ner (Mautner), 1980 | gas phase; Entropy change calculated or estimated |
By formula: C13H11+ + C13H10 = (C13H11+ • C13H10)
Quantity | Value | Units | Method | Reference | Comment |
---|---|---|---|---|---|
ΔrH° | 14.4 | kcal/mol | PHPMS | Meot-Ner (Mautner), 1980 | gas phase; Entropy change calculated or estimated |
Quantity | Value | Units | Method | Reference | Comment |
ΔrS° | 28. | cal/mol*K | N/A | Meot-Ner (Mautner), 1980 | gas phase; Entropy change calculated or estimated |
Quantity | Value | Units | Method | Reference | Comment |
ΔrG° | 6.1 | kcal/mol | PHPMS | Meot-Ner (Mautner), 1980 | gas phase; Entropy change calculated or estimated |

Lee's RI, non-polar column, temperature ramp

Data compiled by: NIST Mass Spectrometry Data Center, William E. Wallace, director

Column type CapillaryCapillaryCapillaryCapillaryCapillary
Active phase DB-5MSPE-5HP-5HP-55 % Phenyl methyl siloxane
Column length (m) 30.20.30.30.
Carrier gas   HeliumHe
Substrate
Column diameter (mm) 0.250.180.300.3
Phase thickness (μm) 0.250.180.250.25
Tstart (C) 50.50.50.50.50.
Tend (C) 300.345.200.200.250.
Heat rate (K/min) 6.8.5.5.2.
Initial hold (min) 2.1.55.5.
Final hold (min) 16. 15.15.
I 270.24270.1270.8271.268.17
ReferenceSun, Zhou, et al., 2008Jamoussi, Kanzari, et al., 2007Wang, Hou, et al., 2007Shao, Wang, et al., 2006Skrbic and Onjia, 2006
Comment MSDC-RI MSDC-RI MSDC-RI MSDC-RI MSDC-RI
Column type CapillaryCapillaryCapillaryCapillaryCapillary
Active phase 5 % Phenyl methyl siloxaneHP-5HP-5HP-5DB-5MS
Column length (m)  30.60.60.30.
Carrier gas  HeliumHeHe
Substrate
Column diameter (mm)  0.250.250.250.25
Phase thickness (μm)  0.250.250.250.5
Tstart (C) 80.50.35.35.40.
Tend (C) 300.310.300.300.310.
Heat rate (K/min) 8.6.3.3.10.
Initial hold (min) 2.1.5  1.
Final hold (min) 10.10.
I 269.60270.32269.94269.94270.57
ReferenceSkrbic and Onjia, 2006Pedersen, Durant, et al., 2005Marynowski, Pieta, et al., 2004Marynowski, Pieta, et al., 2004Chen, Keeran, et al., 2002
Comment MSDC-RI MSDC-RI MSDC-RI MSDC-RI MSDC-RI
Column type CapillaryCapillaryCapillaryCapillaryCapillary
Active phase DB-5MSPTE-5HP-5HP-5HP-5
Column length (m) 30.30.
Carrier gas
Substrate
Column diameter (mm) 0.250.25
Phase thickness (μm) 0.50.25
Tstart (C) 40.60.50.50.50.
Tend (C) 310.300.310.310.310.
Heat rate (K/min) 4.8.5.5.5.
Initial hold (min) 1.1.52.2.2.
Final hold (min)  12.5
I 270.28270.23270.16270.24270.26
ReferenceChen, Keeran, et al., 2002Wang, Jia, et al., 2000Miao and Wu, 1999Miao and Wu, 1999Miao and Wu, 1999
Comment MSDC-RI MSDC-RI MSDC-RI MSDC-RI MSDC-RI
Column type CapillaryCapillaryCapillaryCapillaryCapillary
Active phase HP-5HP-5HP-5HP-5HP-5
Column length (m)
Carrier gas
Substrate
Column diameter (mm)
Phase thickness (μm)
Tstart (C) 50.50.50.50.50.
Tend (C) 310.310.310.310.310.
Heat rate (K/min) 5.5.5.5.5.
Initial hold (min) 2.2.2.2.2.
Final hold (min)
I 270.30270.58270.66270.68270.73
ReferenceMiao and Wu, 1999Miao and Wu, 1999Miao and Wu, 1999Miao and Wu, 1999Miao and Wu, 1999
Comment MSDC-RI MSDC-RI MSDC-RI MSDC-RI MSDC-RI
Column type CapillaryCapillaryCapillaryCapillaryCapillary
Active phase HP-5HP-5DB-5DB-5HT-5
Column length (m) 30.30.30.30.25.
Carrier gas
Substrate
Column diameter (mm) 0.250.250.250.250.32
Phase thickness (μm) 0.250.250.250.25
Tstart (C) 50.50.50.50.40.
Tend (C) 280.280.300.300.400.
Heat rate (K/min) 4.4.15.15.5.
Initial hold (min) 2.2.  8.
Final hold (min) 20.20.  20.
I 270.01270.32268.2268.2270.49
ReferencePiao, Chu, et al., 1999Piao, Chu, et al., 1999Durlak, Biswas, et al., 1998Durlak, Biswas, et al., 1998Williams and Williams, 1998
Comment MSDC-RI MSDC-RI MSDC-RI MSDC-RI MSDC-RI
Column type CapillaryCapillaryCapillaryCapillaryCapillary
Active phase SE-52SE-54DB-5DB-5SE-52
Column length (m) 30.30.25.30.30.
Carrier gas   HeH2
Substrate
Column diameter (mm) 0.300.250.30.320.25
Phase thickness (μm)    0.25
Tstart (C) 40.50.60.80.40.
Tend (C) 250.300.270.270.300.
Heat rate (K/min) 4.4.5.4.4.
Initial hold (min)   2.2.2.
Final hold (min)    5.20.
I 269.55267.40269.92268.37270.18
ReferenceWang, Peng, et al., 1997Chen, 1996Williams and Horne, 1995Andersson and Weis, 1994Shaogang and Xiaobai, 1994
Comment MSDC-RI MSDC-RI MSDC-RI MSDC-RI MSDC-RI
Column type CapillaryCapillaryCapillaryCapillaryCapillary
Active phase DB-5DB-5CP Sil 8 CBSE-54SE-52
Column length (m) 30.30.50.20.25.
Carrier gas HeHeHeHe
Substrate
Column diameter (mm) 0.320.320.250.220.25
Phase thickness (μm) 0.250.250.250.20
Tstart (C) 50.40.80.50.130.
Tend (C) 300.285.300.300.260.
Heat rate (K/min) 6.8.4.4.3.
Initial hold (min) 2.3.
Final hold (min)  29.5
I 270.30270.4269.9270.00268.23
ReferenceWang, Fingas, et al., 1994Donnelly, Abdel-Hamid, et al., 1993Bundt, Herbel, et al., 1991Guillén, Blanco, et al., 1989Hasegawa, Muragishi, et al., 1988
Comment MSDC-RI MSDC-RI MSDC-RI MSDC-RI MSDC-RI
Column type CapillaryCapillaryCapillaryCapillaryCapillary
Active phase DB-5DB-5SE-52DB-5DB-5
Column length (m) 30.30.12.30.30.
Carrier gas   HydrogenHeHe
Substrate
Column diameter (mm) 0.320.25 0.260.25
Phase thickness (μm) 0.250.25 0.25
Tstart (C) 80.40.120.50.90.
Tend (C) 290.280.285.300.325.
Heat rate (K/min) 3.4.3.6.4.
Initial hold (min) 1.2. 4.
Final hold (min)  5. 20.
I 267.45269.94268.17270.77267.04
ReferenceSye, Lin, et al., 1988Wise, Benner, et al., 1988Boenke and Ballschmiter, 1987Rostad and Pereira, 1986Tong, Centen, et al., 1985
Comment MSDC-RI MSDC-RI MSDC-RI MSDC-RI MSDC-RI
Column type CapillaryCapillaryCapillary
Active phase DB-5SE-52SE-52
Column length (m) 30.20.12.
Carrier gas HeliumH2He
Substrate
Column diameter (mm) 0.320.300.3
Phase thickness (μm)  0.250.34
Tstart (C) 90.40.50.
Tend (C) 250.265.250.
Heat rate (K/min) 4.4.2.
Initial hold (min)  2.
Final hold (min)
I 266.2269.73268.17
ReferenceViau, Studak, et al., 1984Vassilaros, Kong, et al., 1982Lee, Vassilaros, et al., 1979
Comment MSDC-RI MSDC-RI MSDC-RI

Kovats' RI, polar column, isothermal

Data compiled by: NIST Mass Spectrometry Data Center, William E. Wallace, director

Column type Packed
Active phase Carbowax 20M
Column length (m) 2.
Carrier gas
Substrate
Column diameter (mm)
Phase thickness (μm)
Temperature (C) 220.
I 2374.
ReferenceSellier, Tersac, et al., 1981
Comment MSDC-RI

Normal alkane RI, non-polar column, isothermal

Data compiled by: NIST Mass Spectrometry Data Center, William E. Wallace, director

Column type CapillaryCapillaryCapillaryCapillaryPacked
Active phase OV-101Polidimethyl siloxanePolidimethyl siloxaneSE-30Polydimethyl siloxane
Column length (m)    25.
Carrier gas    N2
Substrate
Column diameter (mm)    0.33
Phase thickness (μm)
Temperature (C) 120.130.130.200.147.
I 1552.1542.1544.1617.1558.
ReferenceNabivach and Gerasimenko, 1996Nabivach and Gerasimenko, 1996Nabivach and Gerasimenko, 1996Korhonen and Lind, 1985Ferrand, 1962
Comment MSDC-RI MSDC-RI MSDC-RI MSDC-RI MSDC-RI
Column type Packed
Active phase Polydimethyl siloxane
Column length (m)
Carrier gas
Substrate
Column diameter (mm)
Phase thickness (μm)
Temperature (C) 183.
I 1580.
ReferenceFerrand, 1962
Comment MSDC-RI

References

Roux, Temprado, et al., 2008
Roux, M.V.; Temprado, M.; Chickos, J.S.; Nagano, Y.,
Critically Evaluated Thermochemical Properties of Polycyclic Aromatic Hydrocarbons,
J. Phys. Chem. Ref. Data, 2008, 37, 4, 1855-1996. [all data]
Rakus, Verevkin, et al., 1994
Rakus, K.; Verevkin, S.P.; Schatzer, J.; Beckhaus, H.-D.; Ruchardt, C.,
Thermochemistry and thermal decomposition of 9,9'-bifluorenyl and 9,9'-dimethyl-9,9'-bifluorenyl - the stabilization energy of 9-fluorenyl radicals,
Chem. Ber., 1994, 127, 1095-1103. [all data]
Sabbah, 1991
Sabbah, R.,
Thermodynamic study of fluorene and dibenzofuran,
Bull. Soc. Chim. Fr., 1991, 128, 350. [all data]
Sabbah and Antipine, 1987
Sabbah, R.; Antipine, I.,
Thermodynamic study on four polycycles. Relationship between their energy values and their structure,
Bull. Soc. Chim. Fr., 1987, 392-400. [all data]
Dorofeeva O.V., 1989
Dorofeeva O.V.,
Thermodynamic Properties of Gaseous Polycyclic Aromatic Hydrocarbons Containing Five-Membered Rings. Institute for High Temperatures, USSR Academy of Sciences, Preprint No.1-263 (in Russian), Moscow, 1989. [all data]
Frenkel M., 1994
Frenkel M.,
Thermodynamics of Organic Compounds in the Gas State, Vol. I, II, Thermodynamics Research Center, College Station, Texas, 1994, 1994. [all data]
Finke, Messerly, et al., 1977
Finke, H.L.; Messerly, J.F.; Lee, S.H.; Osborn, A.G.; Douslin, D.R.,
Comprehensive thermodynamic studies of seven aromatic hydrocarbons,
J. Chem. Thermodyn., 1977, 9, 937-956. [all data]
Eibert, 1944
Eibert, J.,
Thesis Washington University (St. Louis), 1944. [all data]
Aldrich Chemical Company Inc., 1990
Aldrich Chemical Company Inc.,
Catalog Handbook of Fine Chemicals, Aldrich Chemical Company, Inc., Milwaukee WI, 1990, 1. [all data]
Weast and Grasselli, 1989
CRC Handbook of Data on Organic Compounds, 2nd Editon, Weast,R.C and Grasselli, J.G., ed(s)., CRC Press, Inc., Boca Raton, FL, 1989, 1. [all data]
Lecat, 1943
Lecat, M.,
Azeotropes of Ethyl Urethane and other Azeotropes,
C. R. Hebd. Seances Acad. Sci., 1943, 217, 273. [all data]
Finke, Messerly, et al., 1977, 2
Finke, H.L.; Messerly, J.F.; Lee, S.H.; Osborn, A.G.; Douslin, D.R.,
Comprehensive thermodynamic studies of seven aromatic hydrocarbons,
J. Chem. Thermodyn., 1977, 9, 937. [all data]
Osborn and Douslin, 1975
Osborn, A.G.; Douslin, D.R.,
Vapor Pressure and Derived Enthalpies of Vaporization for Some Condensed Ring Hydrocarbons,
J. Chem. Eng. Data, 1975, 20, 229-31. [all data]
Hanshaw, Nutt, et al., 2008
Hanshaw, William; Nutt, Marjorie; Chickos, James S.,
Hypothetical Thermodynamic Properties. Subcooled Vaporization Enthalpies and Vapor Pressures of Polyaromatic Hydrocarbons,
J. Chem. Eng. Data, 2008, 53, 8, 1903-1913, https://doi.org/10.1021/je800300x
. [all data]
Haftka, Parsons, et al., 2006
Haftka, Joris J.H.; Parsons, John R.; Govers, Harrie A.J.,
Supercooled liquid vapour pressures and related thermodynamic properties of polycyclic aromatic hydrocarbons determined by gas chromatography,
Journal of Chromatography A, 2006, 1135, 1, 91-100, https://doi.org/10.1016/j.chroma.2006.09.050
. [all data]
Chickos, Hesse, et al., 1998
Chickos, James; Hesse, Donald; Hosseini, Sarah; Nichols, Gary; Webb, Paul,
Sublimation enthalpies at 298.15K using correlation gas chromatography and differential scanning calorimetry measurements,
Thermochimica Acta, 1998, 313, 2, 101-110, https://doi.org/10.1016/S0040-6031(97)00432-2
. [all data]
Chickos, Hosseini, et al., 1995
Chickos, James S.; Hosseini, Sarah; Hesse, Donald G.,
Determination of vaporization enthalpies of simple organic molecules by correlations of changes in gas chromatographic net retention times,
Thermochimica Acta, 1995, 249, 41-62, https://doi.org/10.1016/0040-6031(95)90670-3
. [all data]
Lei, Chankalal, et al., 2002
Lei, Ying Duan; Chankalal, Raymond; Chan, Anita; Wania, Frank,
Supercooled Liquid Vapor Pressures of the Polycyclic Aromatic Hydrocarbons,
J. Chem. Eng. Data, 2002, 47, 4, 801-806, https://doi.org/10.1021/je0155148
. [all data]
Sasse, Jose, et al., 1988
Sasse, Karim; Jose, Jacques; Merlin, Jean-Claude,
A static apparatus for measurement of low vapor pressures. Experimental results on high molecular-weight hydrocarbons,
Fluid Phase Equilibria, 1988, 42, 287-304, https://doi.org/10.1016/0378-3812(88)80065-7
. [all data]
Stephenson and Malanowski, 1987
Stephenson, Richard M.; Malanowski, Stanislaw,
Handbook of the Thermodynamics of Organic Compounds, 1987, https://doi.org/10.1007/978-94-009-3173-2
. [all data]
Mortimer and Murphy, 1923
Mortimer, F. Spencer.; Murphy, Ray v.,
The Vapor Pressures of Some Substances Found in Coal Tar.,
Ind. Eng. Chem., 1923, 15, 11, 1140-1142, https://doi.org/10.1021/ie50167a012
. [all data]
Nass, Lenoir, et al., 1995
Nass, Karen; Lenoir, Dieter; Kettrup, Antonius,
Calculation of the Thermodynamic Properties of Polycyclic Aromatic Hydrocarbons by an Incremental Procedure,
Angew. Chem. Int. Ed. Engl., 1995, 34, 16, 1735-1736, https://doi.org/10.1002/anie.199517351
. [all data]
Hansen and Eckert, 1986
Hansen, Philip C.; Eckert, Charles A.,
An improved transpiration method for the measurement of very low vapor pressures,
J. Chem. Eng. Data, 1986, 31, 1, 1-3, https://doi.org/10.1021/je00043a001
. [all data]
SATO, INOMATA, et al., 1986
SATO, NOBUYUKI; INOMATA, HIROSHI; ARAI, KUNIO; SAITO, SHOZABURO,
Measurement of vapor pressures for coal-related aromatic compounds by gas saturation method.,
J. Chem. Eng. Japan / JCEJ, 1986, 19, 2, 145-147, https://doi.org/10.1252/jcej.19.145
. [all data]
Sonnefeld, Zoller, et al., 1983
Sonnefeld, W.J.; Zoller, W.H.; May, W.E.,
Dynamic coupled-column liquid-chromatographic determination of ambient-temperature vapor pressures of polynuclear aromatic hydrocarbons,
Anal. Chem., 1983, 55, 2, 275-280, https://doi.org/10.1021/ac00253a022
. [all data]
Osborn and Douslin, 1975, 2
Osborn, Ann G.; Douslin, Donald R.,
Vapor pressures and derived enthalpies of vaporization for some condensed-ring hydrocarbons,
J. Chem. Eng. Data, 1975, 20, 3, 229-231, https://doi.org/10.1021/je60066a022
. [all data]
Budurov, 1960
Budurov, S.,
Izv. Khim. Inst. Bulg. Akad. Nauk, 1960, 7, 281. [all data]
Bradley and Cleasby, 1953
Bradley, R.S.; Cleasby, T.G.,
346. The vapour pressure and lattice energy of hydrogen-bonded crystals. Part I. Oxamide, oxamic acid, and rubeanic acid,
J. Chem. Soc., 1953, 1681, https://doi.org/10.1039/jr9530001681
. [all data]
Jones, 1960
Jones, A.H.,
Sublimation Pressure Data for Organic Compounds.,
J. Chem. Eng. Data, 1960, 5, 2, 196-200, https://doi.org/10.1021/je60006a019
. [all data]
Bradley and Cleasby, 1953, 2
Bradley, R.S.; Cleasby, T.G.,
349. The vapour pressure and lattice energy of some aromatic ring compounds,
J. Chem. Soc., 1953, 1690, https://doi.org/10.1039/jr9530001690
. [all data]
Bradley and Cleasby, 1953, 3
Bradley, R.S.; Cleasby, T.G.,
The vapour pressure and lattice energy of some aromatic ring compounds,
J. Am. Chem. Soc., 1953, 1690-16. [all data]
Lisicki and Jamróz, 2000
Lisicki, Zygmunt; Jamróz, Malgorzata E.,
(Solid + liquid) equilibria in (polynuclear aromatic+ tertiary amide) systems,
The Journal of Chemical Thermodynamics, 2000, 32, 10, 1335-1353, https://doi.org/10.1006/jcht.2000.0685
. [all data]
Domalski and Hearing, 1996
Domalski, Eugene S.; Hearing, Elizabeth D.,
Heat Capacities and Entropies of Organic Compounds in the Condensed Phase. Volume III,
J. Phys. Chem. Ref. Data, 1996, 25, 1, 1, https://doi.org/10.1063/1.555985
. [all data]
Römer, Janaway, et al., 1997
Römer, B.; Janaway, G.; Brauman, J.I.,
Cyclopentadienyl, Indenyl, and Fluorenyl Anions: Gas-Phase and Solvation Energy Contributions to Electron Detachment Energies,
J. Am. Chem. Soc., 1997, 119, 9, 2249, https://doi.org/10.1021/ja961947x
. [all data]
Taft and Bordwell, 1988
Taft, R.W.; Bordwell, F.G.,
Structural and Solvent Effects Evaluated from Acidities Measured in Dimethyl Sulfoxide and in the Gas Phase,
Acc. Chem. Res., 1988, 21, 12, 463, https://doi.org/10.1021/ar00156a005
. [all data]
Cumming and Kebarle, 1978
Cumming, J.B.; Kebarle, P.,
Summary of gas phase measurements involving acids AH. Entropy changes in proton transfer reactions involving negative ions. Bond dissociation energies D(A-H) and electron affinities EA(A),
Can. J. Chem., 1978, 56, 1. [all data]
Meot-Ner (Mautner), 1980
Meot-Ner (Mautner), M.,
Dimer Cations of Polycyclic Aromatics: Experimental Bonding Energies and Resonance Stabilization,
J. Phys. Chem., 1980, 84, 21, 2724, https://doi.org/10.1021/j100458a012
. [all data]
Frye and Weitkamp, 1969
Frye, C.G.; Weitkamp, A.W.,
Equilibrium hydrogenations of multi-ring aromatics,
J. Chem. Eng. Data, 1969, 14, 372-376. [all data]
Hunter and Lias, 1998
Hunter, E.P.; Lias, S.G.,
Evaluated Gas Phase Basicities and Proton Affinities of Molecules: An Update,
J. Phys. Chem. Ref. Data, 1998, 27, 3, 413-656, https://doi.org/10.1063/1.556018
. [all data]
Wojnarovits and Foldiak, 1981
Wojnarovits, L.; Foldiak, G.,
Electron capture detection of aromatic hydrocarbons,
J. Chromatogr. Sci., 1981, 206, 511. [all data]
Chen and Wentworth, 1989
Chen, E.C.M.; Wentworth, W.E.,
Experimental Determination of Electron Affinities of Organic Molecules,
Mol. Cryst. Liq. Cryst., 1989, 171, 271. [all data]
Aue, Guidoni, et al., 2000
Aue, D.H.; Guidoni, M.; Betowski, L.D.,
Ab initio calculated gas-phase basicities of polynuclear aromatic hydrocarbons,
Int. J. Mass Spectrom., 2000, 201, 283. [all data]
Mautner(Meot-Ner), 1980
Mautner(Meot-Ner), M.,
Ion thermochemistry of low volatility compounds in the gas phase. 3. Polycyclic aromatics: Ionization energies, proton, and hydrogen affinities. Extrapolations to graphite,
J. Phys. Chem., 1980, 84, 2716. [all data]
Terlouw, Heerma, et al., 1974
Terlouw, J.K.; Heerma, W.; Frintrop, P.C.M.; Dijkstra, G.; Meinema, H.A.,
Electron-impact induced fragmentation of some heterocyclic-tin compounds,
J. Organomet. Chem., 1974, 64, 205. [all data]
Potapov, Kardash, et al., 1972
Potapov, V.K.; Kardash, I.E.; Sorokin, V.V.; Sokolov, S.A.; Evlasheva, T.I.,
Photoionization of heteroaromatic compounds,
Khim. Vys. Energ., 1972, 6, 392. [all data]
Dewar, Haselbach, et al., 1970
Dewar, M.J.S.; Haselbach, E.; Worley, S.D.,
Calculated and observed ionization potentials of unsaturated polycyclic hydrocarbons; calculated heats of formation by several semiempirical s.c.f. m.o. methods,
Proc. Roy. Soc. (London), 1970, A315, 431. [all data]
Mukherjee, 1969
Mukherjee, T.K.,
Charge-transfer donor abilities of o,o'bridged biphenyls,
J. Phys. Chem., 1969, 73, 3442. [all data]
Slifkin and Allison, 1967
Slifkin, M.A.; Allison, A.C.,
Measurement of ionization potentials from contact charge transfer spectra,
Nature, 1967, 215, 949. [all data]
Ruscic, Kovac, et al., 1978
Ruscic, B.; Kovac, B.; Klasinc, L.; Gusten, H.,
Photoelectron spectroscopy of J. Heterocycl. Chem.. Fluorene analogues,
Z. Naturforsch. A:, 1978, 33, 1006. [all data]
Maier and Turner, 1972
Maier, J.P.; Turner, D.W.,
Steric inhibition of resonance studied by molecular photoelectron spectroscopy. Part I. Biphenyls,
Faraday Discuss. Chem. Soc., 1972, 54, 149. [all data]
Rapp, Staab, et al., 1970
Rapp, U.; Staab, H.A.; Wunsche, C.,
Skelettumlagerungen unter Elektronenbeschuss-IV: zur Struktur der C13H9- und C12H9N-Ionen bei Benzylidenaminobenztriazolen,
Org. Mass Spectrom., 1970, 3, 45. [all data]