1-Naphthalenamine, N,N-dimethyl-
- Formula: C12H13N
- Molecular weight: 171.2383
- IUPAC Standard InChIKey: AJUXDFHPVZQOGF-UHFFFAOYSA-N
- CAS Registry Number: 86-56-6
- Chemical structure:
View 3d structure (requires JavaScript / HTML 5) - Other names: 1-Naphthylamine, N,N-dimethyl-; α-Dimethylaminonaphthalene; α-Dimethylnaphthylamine; Dimethyl-α-naphthylamine; N,N-Dimethyl-α-naphthylamine; N,N-Dimethyl-1-naphthalenamine; N,N-Dimethyl-1-naphthylamine; 1-(Dimethylamino)naphthalene; N,N-Dimethyl-1-napthylamine; N,N-Dimethyl-1-naftylamin; Dimethyl(1-naphthyl)amine; NSC 8713; N,N-Dimethylnaphthylamine

Phase change data

Data compiled as indicated in comments:
BS - Robert L. Brown and Stephen E. Stein
AC - William E. Acree, Jr., James S. Chickos
Quantity | Value | Units | Method | Reference | Comment |
---|---|---|---|---|---|
ΔvapH° | 66.9 ± 0.2 | kJ/mol | GS | Verevkin, Georgieva, et al., 2007 | Based on data from 283. to 334. K.; AC |
Reduced pressure boiling point
Tboil (K) | Pressure (bar) | Reference | Comment |
---|---|---|---|
412.7 | 0.017 | Weast and Grasselli, 1989 | BS |

Gas phase ion energetics data

Data compiled by: Sharon G. Lias, Rhoda D. Levin, and Sherif A. Kafafi
Ionization energy determinations
IE (eV) | Method | Reference | Comment |
---|---|---|---|
7.00 ± 0.02 | PE | Maier, 1974 | |
7.59 | PE | Utsunomiya, Kobayashi, et al., 1975 | Vertical value |

Normal alkane RI, polar column, custom temperature program

Data compiled by: NIST Mass Spectrometry Data Center, William E. Wallace, director

Column type Capillary
Active phase DB-Wax
Column length (m)
Carrier gas
Substrate
Column diameter (mm)
Phase thickness (μm)
Program not specified
I 2100.
ReferencePeng, Yang, et al., 1991
Comment MSDC-RI

References

Verevkin, Georgieva, et al., 2007
Verevkin, Sergey P.; Georgieva, Miglena; Melkhanova, Svetlana V.,
Vapor Pressures and Phase Transitions of a Series of the Aminonaphthalenes,
J. Chem. Eng. Data, 2007, 52, 1, 286-290, https://doi.org/10.1021/je060394v
. [all data]
Weast and Grasselli, 1989
CRC Handbook of Data on Organic Compounds, 2nd Editon, Weast,R.C and Grasselli, J.G., ed(s)., CRC Press, Inc., Boca Raton, FL, 1989, 1. [all data]
Maier, 1974
Maier, J.P.,
Photoelectron spectroscopy of peri- amino naphthalenes,
Helv. Chim. Acta, 1974, 57, 994. [all data]
Utsunomiya, Kobayashi, et al., 1975
Utsunomiya, C.; Kobayashi, T.; Nagakura, S.,
Photoelectron spectra of substituted naphthalenes,
Bull. Chem. Soc. Jpn., 1975, 48, 1852. [all data]