1,2,3-Triazine, 4,5-dimethyl-
- Formula: C5H7N3
- Molecular weight: 109.1292
- IUPAC Standard InChIKey: ZPYMZPIUKRLHEA-UHFFFAOYSA-N
- CAS Registry Number: 86402-31-5
- Chemical structure:
View 3d structure (requires JavaScript / HTML 5) - Permanent link for this species. Use this link for bookmarking this species for future reference.

Gas phase ion energetics data

Data compiled as indicated in comments:
LBLHLM - Sharon G. Lias, John E. Bartmess, Joel F. Liebman, John L. Holmes, Rhoda D. Levin, and W. Gary Mallard
Ionization energy determinations
IE (eV) | Method | Reference | Comment |
---|---|---|---|
9.5 | PE | Gleiter, Spanget-Larsen, et al., 1983 | Vertical value; LBLHLM |

References

Gleiter, Spanget-Larsen, et al., 1983
Gleiter, R.; Spanget-Larsen, J.; Bartetzko, R.; Neunhoeffer, H.; Clausen, M.,
Photoelectron spectra of 1,2,3-triazine and its methyl derivatives,
Chem. Phys. Lett., 1983, 97, 94. [all data]