Phosphine, tris(4-methoxyphenyl)-
- Formula: C21H21O3P
- Molecular weight: 352.3634
- IUPAC Standard InChIKey: UYUUAUOYLFIRJG-UHFFFAOYSA-N
- CAS Registry Number: 855-38-9
- Chemical structure:
View 3d structure (requires JavaScript / HTML 5) - Other names: Tris(4-methoxyphenyl)phosphine; Tris(p-methoxyphenyl)phosphine; Phosphorus tri-(p-methoxyphenyl); tri-(4-Methoxyphenyl)phosphine; Phosphine, tris(p-methoxyphenyl)-; Tri-p-anisylphosphine; Trianisylphosphine; Tris(p-anisyl)phosphine; Tri(p-methoxyphenyl)phosphine; NSC 136458; Tris(4-anisyl)phosphine

Gas phase ion energetics data

Data compiled by: Sharon G. Lias, Rhoda D. Levin, and Sherif A. Kafafi
Ionization energy determinations
IE (eV) | Method | Reference | Comment |
---|---|---|---|
7.48 | PE | Weiner, Lattman, et al., 1975 | Vertical value |

References

Weiner, Lattman, et al., 1975
Weiner, M.A.; Lattman, M.; Grim, S.O.,
Ultraviolet photoelectron spectra of some substituted triarylphosphines,
J. Org. Chem., 1975, 40, 1292. [all data]
Goetz, et al., 1970
Goetz, H., et al.,
Ann, Chem. Liebigs, 1970, 737, 132. [all data]