Dicobalt, μ2-carbonyl-bis(η5-pentamethylcyclopentadienyl)-μ2nitrosyl-
- Formula: C21H30Co2NO2
- Molecular weight: 446.3348
- CAS Registry Number: 85529-65-3

Gas phase ion energetics data

Data compiled by: Sharon G. Lias, John E. Bartmess, Joel F. Liebman, John L. Holmes, Rhoda D. Levin, and W. Gary Mallard
Ionization energy determinations
IE (eV) | Method | Reference | Comment |
---|---|---|---|
5.4 | PE | Dudeney, Green, et al., 1984 | |
5.68 | PE | Dudeney, Green, et al., 1984 | Vertical value |

References

Dudeney, Green, et al., 1984
Dudeney, N.; Green, J.C.; Kirchner, O.N.; Smallwood, F.S.J.,
A study of the electronic structure of the dimers [Co2(η-C5Me5)2(CO)2], [Rh2(η-C5Me5)2], [Co2(η-C5Me5)2(NO)2] and [Co2(η-C5Me5)2(CO)(NO)] by He-I and He-II photoelectron spectroscopy,
J. Chem. Soc. Dalton Trans., 1984, 1883. [all data]