Methanone, bis(pentafluorophenyl)-
- Formula: C13F10O
- Molecular weight: 362.1225
- IUPAC Standard InChIKey: WWQLXRAKBJVNCC-UHFFFAOYSA-N
- CAS Registry Number: 853-39-4
- Chemical structure:
View 3d structure (requires JavaScript / HTML 5) - Other names: Benzophenone, decafluoro-; Decafluorobenzophenone; Perfluorobenzophenone

Gas phase ion energetics data

Data compiled as indicated in comments:
LL - Sharon G. Lias and Joel F. Liebman
B - John E. Bartmess
Electron affinity determinations
EA (eV) | Method | Reference | Comment |
---|---|---|---|
1.52 ± 0.11 | IMRE | Dillow and Kebarle, 1989 | ΔGea(423 K) = -36.6±1.0 kcal/mol , assumed entropy = 3.5 eu; B |
Ionization energy determinations
IE (eV) | Method | Reference | Comment |
---|---|---|---|
10.15 | PE | Petrachenko, Vovna, et al., 1992 | Vertical value; LL |

References

Dillow and Kebarle, 1989
Dillow, G.W.; Kebarle, P.,
Substituent Effects on the Electron Affinities of Perfluorobenzenes C6F5X,
J. Am. Chem. Soc., 1989, 111, 15, 5592, https://doi.org/10.1021/ja00197a014
. [all data]
Petrachenko, Vovna, et al., 1992
Petrachenko, N.E.; Vovna, V.I.; Furin, G.G.,
He(I) photoelectron spectra of fluorine-substituted derivatives of benzoic acid,
Zh. Org. Khim., 1992, 28, 1218. [all data]
Vorozhtsov, Barhash, et al., 1964
Vorozhtsov, N.N.; Barhash, V.a.; Ivanova, N.G.; Anichkina, S.A.; Andrievskaya, O.I.,
Synthesis and reactions of pentaflluorophenyl- and heptafluoronaphthyl magnesiumchlorides,
Dokl. Akad. Nauk SSSR, 1964, 159, 1, 125-128. [all data]