Butanedinitrile, 2,3-bis(1-methylethyl)-
- Formula: C10H16N2
- Molecular weight: 164.2474
- IUPAC Standard InChIKey: YARJDFPTJLOMJC-UHFFFAOYSA-N
- CAS Registry Number: 85298-04-0
- Chemical structure:
View 3d structure (requires JavaScript / HTML 5) - Permanent link for this species. Use this link for bookmarking this species for future reference.

Gas phase ion energetics data

Data compiled by: Sharon G. Lias, John E. Bartmess, Joel F. Liebman, John L. Holmes, Rhoda D. Levin, and W. Gary Mallard
Appearance energy determinations
Ion | AE (eV) | Other Products | Method | Reference | Comment |
---|---|---|---|---|---|
C4H4N2+ | 12.0 ± 0.25 | 2C3H6 | EI | Chess, Lapp, et al., 1982 |

References

Chess, Lapp, et al., 1982
Chess, E.K.; Lapp, R.L.; Gross, M.L.,
The question of tautomerism of alkylnitrile and isonitrile radical cations,
Org. Mass Spectrom., 1982, 17, 475. [all data]