1,2,4,5-1',2',4',5'-[2.2.2.2]Cyclooctatetraenocyclophane
- Formula: C22H22
- Molecular weight: 286.4101
- IUPAC Standard InChIKey: PNGMPACZUFTVCX-JBVUJCTDSA-N
- CAS Registry Number: 84954-89-2
- Chemical structure:
View 3d structure (requires JavaScript / HTML 5) - Permanent link for this species. Use this link for bookmarking this species for future reference.

Gas phase ion energetics data

Data compiled by: Sharon G. Lias, John E. Bartmess, Joel F. Liebman, John L. Holmes, Rhoda D. Levin, and W. Gary Mallard
Ionization energy determinations
IE (eV) | Method | Reference |
---|---|---|
7.35 | PE | Zhong-Zhi, Heilbronner, et al., 1984 |

References

Zhong-Zhi, Heilbronner, et al., 1984
Zhong-Zhi, Y.; Heilbronner, E.; Boekelheide, V.; Garbe, J.,
The He(Ia) PE spectra of cyclophanes containing a cyclooctatetraene ring,
Int. J. Mass Spectrom. Ion Processes, 1984, 58, 233. [all data]