Tricyclo[8.2.2.2<sup>4,7</sup>]octadeca-4,6,10,12,13,15,17-heptaene-
- Formula: C18H18
- Molecular weight: 234.3355
- IUPAC Standard InChIKey: VRGLNGRQXLSACG-IGWMJARQSA-N
- CAS Registry Number: 84954-88-1
- Chemical structure:
View 3d structure (requires JavaScript / HTML 5) - Other names: [2.2]1,6-Cyclooctatetraenyl-1,4-cyclophane; Tricyclo[8.2.2.24,7]octadeca-4,6,10,12,13,15,17-heptaene-

Gas phase ion energetics data

Data compiled as indicated in comments:
LBLHLM - Sharon G. Lias, John E. Bartmess, Joel F. Liebman, John L. Holmes, Rhoda D. Levin, and W. Gary Mallard
Ionization energy determinations
IE (eV) | Method | Reference | Comment |
---|---|---|---|
7.3 | PE | Zhong-Zhi, Heilbronner, et al., 1984 | LBLHLM |
7.65 | PE | Zhong-Zhi, Heilbronner, et al., 1984 | Vertical value; LBLHLM |

References

Zhong-Zhi, Heilbronner, et al., 1984
Zhong-Zhi, Y.; Heilbronner, E.; Boekelheide, V.; Garbe, J.,
The He(Ia) PE spectra of cyclophanes containing a cyclooctatetraene ring,
Int. J. Mass Spectrom. Ion Processes, 1984, 58, 233. [all data]