Anthraflavic acid
- Formula: C14H8O4
- Molecular weight: 240.2109
- IUPAC Standard InChIKey: APAJFZPFBHMFQR-UHFFFAOYSA-N
- CAS Registry Number: 84-60-6
- Chemical structure:
View 3d structure (requires JavaScript / HTML 5) - Other names: 2,6-Dihydroxyanthraquinone; 9,10-Anthracenedione, 2,6-dihydroxy-; Anthraflavin; Anthraquinone, 2,6-dihydroxy-; NSC-33531

Phase change data

Data compiled by: William E. Acree, Jr., James S. Chickos
Enthalpy of sublimation
ΔsubH (kJ/mol) | Temperature (K) | Reference | Comment |
---|---|---|---|
173.8 | 498. | Hoyer and Peperle, 1958 | Based on data from 463. to 533. K. See also Stephenson and Malanowski, 1987. |

Gas phase ion energetics data

Data compiled by: Sharon G. Lias, Rhoda D. Levin, and Sherif A. Kafafi
Ionization energy determinations
IE (eV) | Method | Reference |
---|---|---|
8.65 ± 0.05 | PI | Potapov and Sorokin, 1971 |

References

Hoyer and Peperle, 1958
Hoyer, H.; Peperle, W.,
Z. Elektrochem., 1958, 62, 61. [all data]
Stephenson and Malanowski, 1987
Stephenson, Richard M.; Malanowski, Stanislaw,
Handbook of the Thermodynamics of Organic Compounds, 1987, https://doi.org/10.1007/978-94-009-3173-2
. [all data]
Potapov and Sorokin, 1971
Potapov, V.K.; Sorokin, V.V.,
Photoionization and ion-molecule reactions in quinones and alcohols,
High Energy Chem., 1971, 5, 435, In original 487. [all data]