3-Thiabicyclo[3.2.0]hept-6-ene 3,3-dioxide
- Formula: C6H8O2S
- Molecular weight: 144.192
- IUPAC Standard InChIKey: AOTYWRMIFZIYNX-UHFFFAOYSA-N
- CAS Registry Number: 84451-42-3
- Chemical structure:
View 3d structure (requires JavaScript / HTML 5) - Permanent link for this species. Use this link for bookmarking this species for future reference.

Gas phase ion energetics data

Data compiled by: Sharon G. Lias, John E. Bartmess, Joel F. Liebman, John L. Holmes, Rhoda D. Levin, and W. Gary Mallard
Ionization energy determinations
IE (eV) | Method | Reference | Comment |
---|---|---|---|
≤9.6 | PE | Aitken, Gosney, et al., 1984 | |
10.25 | PE | Aitken, Gosney, et al., 1984 | Vertical value |

References

Aitken, Gosney, et al., 1984
Aitken, R.A.; Gosney, I.; Farries, H.; Palmer, M.H.; Simpson, I.; Cadogan, J.I.G.; Tinley, E.J.,
Chemical repercussions of orbital interactions through bond and through space. The reactivity of the double bond in unsaturated cyclic sulphones towards aziridine formation and epoxidation,
Tetrahedron, 1984, 40, 2487. [all data]