Cyclobutanol, 1-ethyl-
- Formula: C6H12O
- Molecular weight: 100.1589
- IUPAC Standard InChIKey: ZQXBPTKCIMXYMS-UHFFFAOYSA-N
- CAS Registry Number: 84256-19-9
- Chemical structure:
View 3d structure (requires JavaScript / HTML 5) - Permanent link for this species. Use this link for bookmarking this species for future reference.

Gas phase ion energetics data

Data compiled by: Sharon G. Lias, John E. Bartmess, Joel F. Liebman, John L. Holmes, Rhoda D. Levin, and W. Gary Mallard
Appearance energy determinations
Ion | AE (eV) | Other Products | Method | Reference | Comment |
---|---|---|---|---|---|
C2H3O+ | 11.0 ± 0.1 | C2H5+C2H4 | EI | Lifshitz, Berger, et al., 1983 |

References

Lifshitz, Berger, et al., 1983
Lifshitz, C.; Berger, P.; Tzidony, E.,
Kinetic energy release distributions (KERDs) for the dissociation of metastable enol ions,
Chem. Phys. Lett., 1983, 95, 109. [all data]