Aluminum,triphenyl-
- Formula: C18H15Al
- Molecular weight: 258.2932
- IUPAC Standard InChIKey: JQPMDTQDAXRDGS-UHFFFAOYSA-N
- CAS Registry Number: 841-76-9
- Chemical structure:
View 3d structure (requires JavaScript / HTML 5) - Permanent link for this species. Use this link for bookmarking this species for future reference.

Phase change data

Data compiled by: William E. Acree, Jr., James S. Chickos
Enthalpy of sublimation
ΔsubH (kJ/mol) | Temperature (K) | Method | Reference | Comment |
---|---|---|---|---|
172. ± 5. | 455. | ME,TE | Govorchin and Kana'an, 1984 | Based on data from 432. to 477. K. |

Gas phase ion energetics data

Data compiled by: Sharon G. Lias, Rhoda D. Levin, and Sherif A. Kafafi
Ionization energy determinations
IE (eV) | Method | Reference |
---|---|---|
8.53 ± 0.03 | PI | Rodionov, Potapov, et al., 1973 |

References

Govorchin and Kana'an, 1984
Govorchin, Steven W.; Kana'an, Adli S.,
Sublimation study of triphenyl aluminum,
The Journal of Chemical Thermodynamics, 1984, 16, 5, 437-443, https://doi.org/10.1016/0021-9614(84)90200-3
. [all data]
Rodionov, Potapov, et al., 1973
Rodionov, A.N.; Potapov, V.K.; Rogozhin, K.L.,
Photoionization of certain aromatic heteroorganic compounds,
High Energy Chem., 1973, 7, 249, In original 278. [all data]