Azulene,1,3-diacetyl-4,6,8-trimethyl-
- Formula: C17H18O2
- Molecular weight: 254.3236
- IUPAC Standard InChIKey: XXBLTMPMMXJBFB-UHFFFAOYSA-N
- CAS Registry Number: 841-71-4
- Chemical structure:
View 3d structure (requires JavaScript / HTML 5) - Permanent link for this species. Use this link for bookmarking this species for future reference.

Gas phase ion energetics data

Data compiled by: Sharon G. Lias, Rhoda D. Levin, and Sherif A. Kafafi
Ionization energy determinations
IE (eV) | Method | Reference | Comment |
---|---|---|---|
7.5 | PE | Dougherty, Lewis, et al., 1980 | Vertical value |

References

Dougherty, Lewis, et al., 1980
Dougherty, D.; Lewis, J.; Nauman, R.V.; McGlynn, S.P.,
Photoelectron spectroscopy of azulenes,
J. Electron Spectrosc. Relat. Phenom., 1980, 19, 21. [all data]