Ethyl-3, 4-dihydro-2, -h-pyran carboxylate
- Formula: C8H12O3
- Molecular weight: 156.1791
- IUPAC Standard InChIKey: HXBSUCZDAYLJDO-UHFFFAOYSA-N
- CAS Registry Number: 83568-11-0
- Chemical structure:

Gas phase ion energetics data

Data compiled as indicated in comments:
LBLHLM - Sharon G. Lias, John E. Bartmess, Joel F. Liebman, John L. Holmes, Rhoda D. Levin, and W. Gary Mallard
Ionization energy determinations
IE (eV) | Method | Reference | Comment |
---|---|---|---|
~8.6 | PE | Morizur, Mercier, et al., 1982 | LBLHLM |

References

Morizur, Mercier, et al., 1982
Morizur, J.-P.; Mercier, J.; Sarraf, M.,
2-Substituted-2,3-dihydro-4H-pyrans: Competition between 'Retro Diels-Alder' fragmentation and substituent loss,
Org. Mass Spectrom., 1982, 17, 327. [all data]