Benzene, 1-methoxy-4-(phenylmethyl)-
- Formula: C14H14O
- Molecular weight: 198.2604
- IUPAC Standard InChIKey: GQLYCRTUQGSDSM-UHFFFAOYSA-N
- CAS Registry Number: 834-14-0
- Chemical structure:
View 3d structure (requires JavaScript / HTML 5) - Other names: Anisole, p-benzyl-; p-Benzylanisole; 1-Benzyl-4-methoxybenzene; p-Methoxydiphenylmethane; p-Methoxyphenylphenylmethane; 4-Methoxydiphenylmethane

Phase change data

Data compiled by: Thermodynamics Research Center, NIST Boulder Laboratories, Chris Muzny director
Quantity | Value | Units | Method | Reference | Comment |
---|---|---|---|---|---|
Tboil | 565. | K | N/A | Foeldi, 1928 | Uncertainty assigned by TRC = 10. K |

Gas phase ion energetics data

Data compiled by: Sharon G. Lias, Rhoda D. Levin, and Sherif A. Kafafi
Ionization energy determinations
IE (eV) | Method | Reference |
---|---|---|
8.20 ± 0.05 | EI | Pignataro, Mancini, et al., 1972 |
Appearance energy determinations
Ion | AE (eV) | Other Products | Method | Reference | Comment |
---|---|---|---|---|---|
C8H9O+ | 11.9 ± 0.1 | C6H5 | EI | Innorta, Torroni, et al., 1973 | |
C13H11+ | 11.6 ± 0.1 | OCH3 | EI | Innorta, Torroni, et al., 1973 | |
C13H11O+ | 11.9 ± 0.1 | CH3 | EI | Innorta, Torroni, et al., 1973 |

References

Foeldi, 1928
Foeldi, Z.,
Introduction of the Benzyk Group into the Benzene Nucleus with the Aid of Sulfonic Acid Esters,
Chem. Ber., 1928, 61B, 1609-16. [all data]
Pignataro, Mancini, et al., 1972
Pignataro, S.; Mancini, V.; Innorta, G.; Distefano, G.,
Ionization energies and ring orbital interaction in diarylmethanes and diaryleth,
Z. Naturforsch., 1972, 27, 534. [all data]
Innorta, Torroni, et al., 1973
Innorta, G.; Torroni, S.; Pignataro, S.; Mancini, V.,
The activation energy as guiding factor in the fragmentation of substituted diphenylmethanes,
Org. Mass Spectrom., 1973, 7, 1399. [all data]