Acenaphthene
- Formula: C12H10
- Molecular weight: 154.2078
- IUPAC Standard InChIKey: CWRYPZZKDGJXCA-UHFFFAOYSA-N
- CAS Registry Number: 83-32-9
- Chemical structure:
View 3d structure (requires JavaScript / HTML 5) - Isotopologues:
- Other names: Acenaphthylene, 1,2-dihydro-; Peri-Ethylenenaphthalene; Naphthyleneethylene; 1,2-Dihydroacenaphthylene; 1,8-Ethylenenaphthalene; Acenaphtene

Gas phase ion energetics data

Data evaluated as indicated in comments:
HL - Edward P. Hunter and Sharon G. Lias
L - Sharon G. Lias
Data compiled as indicated in comments:
B - John E. Bartmess
MM - Michael M. Meot-Ner (Mautner)
LLK - Sharon G. Lias, Rhoda D. Levin, and Sherif A. Kafafi
RDSH - Henry M. Rosenstock, Keith Draxl, Bruce W. Steiner, and John T. Herron
Quantity | Value | Units | Method | Reference | Comment |
---|---|---|---|---|---|
IE (evaluated) | 7.75 ± 0.05 | eV | N/A | N/A | L |
Quantity | Value | Units | Method | Reference | Comment |
Proton affinity (review) | 851.7 | kJ/mol | N/A | Hunter and Lias, 1998 | HL |
Quantity | Value | Units | Method | Reference | Comment |
Gas basicity | 821.0 | kJ/mol | N/A | Hunter and Lias, 1998 | HL |
Proton affinity at 298K
Proton affinity (kJ/mol) | Reference | Comment |
---|---|---|
849.8 | Aue, Guidoni, et al., 2000 | Experimental literature data re-evaluated by the authors using ab initio protonation entropies; MM |
Gas basicity at 298K
Gas basicity (review) (kJ/mol) | Reference | Comment |
---|---|---|
821.7 | Aue, Guidoni, et al., 2000 | Experimental literature data re-evaluated by the authors using ab initio protonation entropies; MM |
Ionization energy determinations
IE (eV) | Method | Reference | Comment |
---|---|---|---|
7.68 ± 0.05 | EQ | Mautner(Meot-Ner), 1980 | LLK |
7.73 ± 0.01 | PE | Dewar, Haselbach, et al., 1970 | RDSH |
7.66 | CTS | Kinoshita, 1962 | RDSH |
7.76 ± 0.03 | PE | Heilbronner, Hoshi, et al., 1976 | Vertical value; LLK |
7.82 ± 0.04 | PE | Boschi, Clar, et al., 1974 | Vertical value; LLK |
De-protonation reactions
C12H9- + =
By formula: C12H9- + H+ = C12H10
Quantity | Value | Units | Method | Reference | Comment |
---|---|---|---|---|---|
ΔrH° | 1559. ± 10. | kJ/mol | TDEq | Meot-ner and Kafafi, 1988 | gas phase; acenaphthene: 1,8-(1,2-ethano)naphthalene; B |
Quantity | Value | Units | Method | Reference | Comment |
ΔrG° | 1531. ± 8.4 | kJ/mol | TDEq | Meot-ner and Kafafi, 1988 | gas phase; acenaphthene: 1,8-(1,2-ethano)naphthalene; B |

Condensed phase thermochemistry data

Data compiled as indicated in comments:
DRB - Donald R. Burgess, Jr.
ALS - Hussein Y. Afeefy, Joel F. Liebman, and Stephen E. Stein
DH - Eugene S. Domalski and Elizabeth D. Hearing
Quantity | Value | Units | Method | Reference | Comment |
---|---|---|---|---|---|
ΔfH°solid | 72. ± 3.1 | kJ/mol | Review | Roux, Temprado, et al., 2008 | There are sufficient literature values to make a qualified recommendation where the suggested value is in good agreement with values predicted using thermochemical cycles or from reliable estimates. In general, the evaluated uncertainty limits are on the order of (2 to 4) kJ/mol.; DRB |
ΔfH°solid | 70. ± 3. | kJ/mol | Ccb | Boyd, Christensen, et al., 1965 | ALS |
Quantity | Value | Units | Method | Reference | Comment |
ΔcH°solid | -6222. ± 3. | kJ/mol | Ccb | Boyd, Christensen, et al., 1965 | Corresponding ΔfHºsolid = 70.3 kJ/mol (simple calculation by NIST; no Washburn corrections); ALS |
Quantity | Value | Units | Method | Reference | Comment |
S°solid,1 bar | 188.87 | J/mol*K | N/A | Finke, Messerly, et al., 1977 | DH |
Constant pressure heat capacity of solid
Cp,solid (J/mol*K) | Temperature (K) | Reference | Comment |
---|---|---|---|
190.37 | 298.15 | Finke, Messerly, et al., 1977 | T = 10 to 440 K.; DH |
185.8 | 298. | Sadowska, Stepniewska, et al., 1969 | T = 20 to 93°C, equation only; liquid, 93 to 200°C, equation only.; DH |
210.5 | 298.1 | Eibert, 1944 | T = 25 to 200°C, equations only in t°C. Cp(c) = 0.2756 + 0.001854t cal/g*K (25 to 60°C); Cp(liq) = 0.409 + 0.000598t cal/g*K (95 to 200°C).; DH |

Gas phase thermochemistry data

Data compiled as indicated in comments:
DRB - Donald R. Burgess, Jr.
ALS - Hussein Y. Afeefy, Joel F. Liebman, and Stephen E. Stein
GT - Glushko Thermocenter, Russian Academy of Sciences, Moscow
Quantity | Value | Units | Method | Reference | Comment |
---|---|---|---|---|---|
ΔfH°gas | 37.48 ± 0.74 | kcal/mol | Review | Roux, Temprado, et al., 2008 | There are sufficient literature values to make a qualified recommendation where the suggested value is in good agreement with values predicted using thermochemical cycles or from reliable estimates. In general, the evaluated uncertainty limits are on the order of (2 to 4) kJ/mol.; DRB |
ΔfH°gas | 37.4 ± 0.9 | kcal/mol | Ccb | Boyd, Christensen, et al., 1965 | ALS |
Constant pressure heat capacity of gas
Cp,gas (cal/mol*K) | Temperature (K) | Reference | Comment |
---|---|---|---|
9.254 | 50. | Dorofeeva O.V., 1989 | GT |
13.20 | 100. | ||
18.48 | 150. | ||
24.811 | 200. | ||
35.136 | 273.15 | ||
38.76 ± 0.24 | 298.15 | ||
39.022 | 300. | ||
52.784 | 400. | ||
64.426 | 500. | ||
73.815 | 600. | ||
81.372 | 700. | ||
87.536 | 800. | ||
92.629 | 900. | ||
96.886 | 1000. | ||
100.47 | 1100. | ||
103.51 | 1200. | ||
106.10 | 1300. | ||
108.32 | 1400. | ||
110.23 | 1500. |

Phase change data

Data compiled as indicated in comments:
BS - Robert L. Brown and Stephen E. Stein
TRC - Thermodynamics Research Center, NIST Boulder Laboratories, Chris Muzny director
AC - William E. Acree, Jr., James S. Chickos
DRB - Donald R. Burgess, Jr.
ALS - Hussein Y. Afeefy, Joel F. Liebman, and Stephen E. Stein
DH - Eugene S. Domalski and Elizabeth D. Hearing
Quantity | Value | Units | Method | Reference | Comment |
---|---|---|---|---|---|
Tboil | 552.2 | K | N/A | Weast and Grasselli, 1989 | BS |
Tboil | 552. | K | N/A | Buckingham and Donaghy, 1982 | BS |
Tboil | 502.65 | K | N/A | Perkin, 1896 | Uncertainty assigned by TRC = 1. K; TRC |
Quantity | Value | Units | Method | Reference | Comment |
Tfus | 367. ± 4. | K | AVG | N/A | Average of 13 values; Individual data points |
Quantity | Value | Units | Method | Reference | Comment |
Ttriple | 366.56 | K | N/A | Finke, Messerly, et al., 1977, 2 | Uncertainty assigned by TRC = 0.02 K; TRC |
Ttriple | 366.55 | K | N/A | Osborn and Douslin, 1975 | Uncertainty assigned by TRC = 0.02 K; TRC |
Quantity | Value | Units | Method | Reference | Comment |
ΔvapH° | 16.3 | kcal/mol | CGC | Zhao, Unhannanant, et al., 2008 | AC |
ΔvapH° | 16.8 ± 0.26 | kcal/mol | GC | Haftka, Parsons, et al., 2006 | Based on data from 363. to 423. K.; AC |
ΔvapH° | 15.8 | kcal/mol | CGC | Chickos, Hesse, et al., 1998 | AC |
ΔvapH° | 15.8 | kcal/mol | N/A | Ruuzicka, Mokbel, et al., 1998 | See also Hanshaw, Nutt, et al., 2008.; AC |
ΔvapH° | 15.9 ± 0.31 | kcal/mol | N/A | Mokbel, Guetachew, et al., 1995 | See also Hanshaw, Nutt, et al., 2008.; AC |
Quantity | Value | Units | Method | Reference | Comment |
ΔsubH° | 20.3 ± 0.1 | kcal/mol | Review | Roux, Temprado, et al., 2008 | There are sufficient high-quality literature values to make a good evaluation with a high degree of confidence. In general, the evaluated uncertainty limits are on the order of (0.5 to 2.5) kJ/mol.; DRB |
ΔsubH° | 20.2 | kcal/mol | CGC-DSC | Chickos, Hesse, et al., 1998 | AC |
ΔsubH° | 19.9 ± 0.24 | kcal/mol | N/A | Osborn and Douslin, 1975, 2 | See also Finke, Messerly, et al., 1977.; AC |
ΔsubH° | 20.6 ± 0.3 | kcal/mol | V | Boyd, Christensen, et al., 1965 | ALS |
ΔsubH° | 20.6 | kcal/mol | N/A | Boyd, Christensen, et al., 1965 | DRB |
Enthalpy of vaporization
ΔvapH (kcal/mol) | Temperature (K) | Method | Reference | Comment |
---|---|---|---|---|
15.3 | 398. | GC | Lei, Chankalal, et al., 2002 | Based on data from 323. to 473. K.; AC |
14.6 | 366. | N/A | Ruuzicka, Mokbel, et al., 1998 | See also Hanshaw, Nutt, et al., 2008.; AC |
14.5 | 378. | N/A | Mokbel, Guetachew, et al., 1995 | See also Hanshaw, Nutt, et al., 2008.; AC |
13. | 403. | A | Stephenson and Malanowski, 1987 | Based on data from 368. to 552. K.; AC |
14.4 | 383. | A | Stephenson and Malanowski, 1987 | Based on data from 368. to 413. K. See also Osborn and Douslin, 1975, 2 and Boublik, Fried, et al., 1984.; AC |
14.7 | 395. | I | Cramer, 1943 | AC |
13.0 | 466. | I | Mortimer and Murphy, 1923 | Based on data from 413. to 561. K.; AC |
13.2 | 435. | N/A | Mortimer and Murphy, 1923 | Based on data from 420. to 561. K. See also Boublik, Fried, et al., 1984.; AC |
Antoine Equation Parameters
log10(P) = A − (B / (T + C))
P = vapor pressure (atm)
T = temperature (K)
View plot Requires a JavaScript / HTML 5 canvas capable browser.
Temperature (K) | A | B | C | Reference | Comment |
---|---|---|---|---|---|
368. to 413. | 4.31665 | 2062.099 | -73.146 | Osborn and Douslin, 1975, 2 | Coefficents calculated by NIST from author's data. |
420.4 to 560.9 | 4.92546 | 2611.29 | -20.227 | Mortimer and Murphy, 1923 | Coefficents calculated by NIST from author's data. |
Enthalpy of sublimation
ΔsubH (kcal/mol) | Temperature (K) | Method | Reference | Comment |
---|---|---|---|---|
19.9 | 383. | GS | Nass, Lenoir, et al., 1995 | Based on data from 313. to 453. K.; AC |
18.4 | 318. | GS | SATO, INOMATA, et al., 1986 | Based on data from 293. to 342. K.; AC |
20.7 ± 0.2 | 303. | GS | Sonnefeld, Zoller, et al., 1983 | Based on data from 283. to 323. K.; AC |
19.7 | 366. | B | Osborn and Douslin, 1975, 2 | AC |
20.24 ± 0.64 | 283. | V | Radchenko and Kitaigorodskii, 1974 | ALS |
20.6 ± 0.2 | 290. to 340. | ME | Boyd, Christensen, et al., 1965 | See also Cox and Pilcher, 1970.; AC |
19.63 ± 0.10 | 368. | V | Aihara, 1959 | crystal phase; ALS |
19.6 ± 0.1 | 300. | V | Aihara, 1959, 2 | Based on data from 291. to 310. K. See also Stephenson and Malanowski, 1987.; AC |
19.5 | 258. to 308. | N/A | Hoyer and Peperle, 1958 | AC |
Enthalpy of fusion
ΔfusH (kcal/mol) | Temperature (K) | Method | Reference | Comment |
---|---|---|---|---|
5.12959 | 366.56 | N/A | Finke, Messerly, et al., 1977 | DH |
5.02 | 367. | DSC | Sharma, Gupta, et al., 2008 | AC |
5.129 | 366.6 | N/A | Domalski and Hearing, 1996 | AC |
4.8358 | 366.4 | N/A | Sadowska, Stepniewska, et al., 1969 | DH |
5.9990 | 367.8 | N/A | Eibert, 1944 | DH |
Entropy of fusion
ΔfusS (cal/mol*K) | Temperature (K) | Reference | Comment |
---|---|---|---|
13.99 | 366.56 | Finke, Messerly, et al., 1977 | DH |
13.20 | 366.4 | Sadowska, Stepniewska, et al., 1969 | DH |
16.3 | 367.8 | Eibert, 1944 | DH |

Reaction thermochemistry data

Data compiled as indicated in comments:
M - Michael M. Meot-Ner (Mautner) and Sharon G. Lias
B - John E. Bartmess
ALS - Hussein Y. Afeefy, Joel F. Liebman, and Stephen E. Stein
Individual Reactions
By formula: C12H10+ + C12H10 = (C12H10+ • C12H10)
Bond type: Charge transfer bond (positive ion)
Quantity | Value | Units | Method | Reference | Comment |
---|---|---|---|---|---|
ΔrH° | 17.0 | kcal/mol | PHPMS | Meot-Ner (Mautner), 1980 | gas phase; Entropy change calculated or estimated; M |
Quantity | Value | Units | Method | Reference | Comment |
ΔrS° | 28. | cal/mol*K | N/A | Meot-Ner (Mautner), 1980 | gas phase; Entropy change calculated or estimated; M |
Free energy of reaction
ΔrG° (kcal/mol) | T (K) | Method | Reference | Comment |
---|---|---|---|---|
8.1 | 283. | PHPMS | Meot-Ner (Mautner), 1980 | gas phase; Entropy change calculated or estimated; M |
By formula: C12H8+ + C12H10 = (C12H8+ • C12H10)
Bond type: Charge transfer bond (positive ion)
Quantity | Value | Units | Method | Reference | Comment |
---|---|---|---|---|---|
ΔrH° | 14.2 | kcal/mol | PHPMS | Meot-Ner (Mautner), 1980 | gas phase; Entropy change calculated or estimated; M |
Quantity | Value | Units | Method | Reference | Comment |
ΔrS° | 28. | cal/mol*K | N/A | Meot-Ner (Mautner), 1980 | gas phase; Entropy change calculated or estimated; M |
Free energy of reaction
ΔrG° (kcal/mol) | T (K) | Method | Reference | Comment |
---|---|---|---|---|
6.3 | 283. | PHPMS | Meot-Ner (Mautner), 1980 | gas phase; Entropy change calculated or estimated; M |
By formula: C12H11+ + C12H10 = (C12H11+ • C12H10)
Quantity | Value | Units | Method | Reference | Comment |
---|---|---|---|---|---|
ΔrH° | 14.8 | kcal/mol | PHPMS | Meot-Ner (Mautner), 1980 | gas phase; Entropy change calculated or estimated; M |
Quantity | Value | Units | Method | Reference | Comment |
ΔrS° | 28. | cal/mol*K | N/A | Meot-Ner (Mautner), 1980 | gas phase; Entropy change calculated or estimated; M |
Free energy of reaction
ΔrG° (kcal/mol) | T (K) | Method | Reference | Comment |
---|---|---|---|---|
5.6 | 330. | PHPMS | Meot-Ner (Mautner), 1980 | gas phase; Entropy change calculated or estimated; M |
C12H9- + =
By formula: C12H9- + H+ = C12H10
Quantity | Value | Units | Method | Reference | Comment |
---|---|---|---|---|---|
ΔrH° | 372.5 ± 2.5 | kcal/mol | TDEq | Meot-ner and Kafafi, 1988 | gas phase; acenaphthene: 1,8-(1,2-ethano)naphthalene; B |
Quantity | Value | Units | Method | Reference | Comment |
ΔrG° | 365.8 ± 2.0 | kcal/mol | TDEq | Meot-ner and Kafafi, 1988 | gas phase; acenaphthene: 1,8-(1,2-ethano)naphthalene; B |
By formula: C6H7N+ + C12H10 = (C6H7N+ • C12H10)
Bond type: Charge transfer bond (positive ion)
Quantity | Value | Units | Method | Reference | Comment |
---|---|---|---|---|---|
ΔrH° | 17.5 | kcal/mol | PHPMS | Meot-Ner (Mautner) and El-Shall, 1986 | gas phase; M |
Quantity | Value | Units | Method | Reference | Comment |
ΔrS° | 27.6 | cal/mol*K | PHPMS | Meot-Ner (Mautner) and El-Shall, 1986 | gas phase; M |
By formula: 2H2 + C12H10 = hexahydroacenaphthylene
Quantity | Value | Units | Method | Reference | Comment |
---|---|---|---|---|---|
ΔrH° | -27. | kcal/mol | Eqk | Frye and Weitkamp, 1969 | gas phase; ALS |

Henry's Law data

Data compiled by: Rolf Sander
Henry's Law constant (water solution)
kH(T) = k°H exp(d(ln(kH))/d(1/T) ((1/T) - 1/(298.15 K)))
k°H = Henry's law constant for solubility in water at 298.15 K (mol/(kg*bar))
d(ln(kH))/d(1/T) = Temperature dependence constant (K)
k°H (mol/(kg*bar)) | d(ln(kH))/d(1/T) (K) | Method | Reference |
---|---|---|---|
6.4 | X | N/A | |
4.1 | 2800. | X | N/A |
4.2 | L | N/A | |
0.65 | M | N/A | |
6.8 | M | Mackay, Shiu, et al., 1979 | |
13. | V | N/A |

Ion clustering data

Data compiled by: Michael M. Meot-Ner (Mautner) and Sharon G. Lias
Clustering reactions
By formula: C6H7N+ + C12H10 = (C6H7N+ • C12H10)
Bond type: Charge transfer bond (positive ion)
Quantity | Value | Units | Method | Reference | Comment |
---|---|---|---|---|---|
ΔrH° | 17.5 | kcal/mol | PHPMS | Meot-Ner (Mautner) and El-Shall, 1986 | gas phase |
Quantity | Value | Units | Method | Reference | Comment |
ΔrS° | 27.6 | cal/mol*K | PHPMS | Meot-Ner (Mautner) and El-Shall, 1986 | gas phase |
By formula: C12H8+ + C12H10 = (C12H8+ • C12H10)
Bond type: Charge transfer bond (positive ion)
Quantity | Value | Units | Method | Reference | Comment |
---|---|---|---|---|---|
ΔrH° | 14.2 | kcal/mol | PHPMS | Meot-Ner (Mautner), 1980 | gas phase; Entropy change calculated or estimated |
Quantity | Value | Units | Method | Reference | Comment |
ΔrS° | 28. | cal/mol*K | N/A | Meot-Ner (Mautner), 1980 | gas phase; Entropy change calculated or estimated |
Free energy of reaction
ΔrG° (kcal/mol) | T (K) | Method | Reference | Comment |
---|---|---|---|---|
6.3 | 283. | PHPMS | Meot-Ner (Mautner), 1980 | gas phase; Entropy change calculated or estimated |
By formula: C12H10+ + C12H10 = (C12H10+ • C12H10)
Bond type: Charge transfer bond (positive ion)
Quantity | Value | Units | Method | Reference | Comment |
---|---|---|---|---|---|
ΔrH° | 17.0 | kcal/mol | PHPMS | Meot-Ner (Mautner), 1980 | gas phase; Entropy change calculated or estimated |
Quantity | Value | Units | Method | Reference | Comment |
ΔrS° | 28. | cal/mol*K | N/A | Meot-Ner (Mautner), 1980 | gas phase; Entropy change calculated or estimated |
Free energy of reaction
ΔrG° (kcal/mol) | T (K) | Method | Reference | Comment |
---|---|---|---|---|
8.1 | 283. | PHPMS | Meot-Ner (Mautner), 1980 | gas phase; Entropy change calculated or estimated |
By formula: C12H11+ + C12H10 = (C12H11+ • C12H10)
Quantity | Value | Units | Method | Reference | Comment |
---|---|---|---|---|---|
ΔrH° | 14.8 | kcal/mol | PHPMS | Meot-Ner (Mautner), 1980 | gas phase; Entropy change calculated or estimated |
Quantity | Value | Units | Method | Reference | Comment |
ΔrS° | 28. | cal/mol*K | N/A | Meot-Ner (Mautner), 1980 | gas phase; Entropy change calculated or estimated |
Free energy of reaction
ΔrG° (kcal/mol) | T (K) | Method | Reference | Comment |
---|---|---|---|---|
5.6 | 330. | PHPMS | Meot-Ner (Mautner), 1980 | gas phase; Entropy change calculated or estimated |

Normal alkane RI, non-polar column, temperature ramp

Data compiled by: NIST Mass Spectrometry Data Center, William E. Wallace, director

Column type CapillaryCapillaryCapillaryCapillaryCapillary
Active phase HP-5 MSHP-5 MSHP-5 MSHP-5 MSHP-5 MS
Column length (m) 30.25.25.25.25.
Carrier gas HeliumHeliumHeliumHeliumHelium
Substrate
Column diameter (mm) 0.250.200.200.200.20
Phase thickness (μm) 0.250.330.330.330.33
Tstart (C) 35.40.40.40.40.
Tend (C) 300.280.280.280.280.
Heat rate (K/min) 3.10.10.10.10.
Initial hold (min) 5.
Final hold (min) 15.
I 1472.1518.1520.1523.1523.
ReferenceKotowska, Zalikowski, et al., 2012Ukolova and Zenkevich, 2011Ukolova and Zenkevich, 2011Ukolova and Zenkevich, 2011Ukolova and Zenkevich, 2011
Comment MSDC-RI MSDC-RI MSDC-RI MSDC-RI MSDC-RI
Column type CapillaryCapillaryCapillaryCapillaryCapillary
Active phase HP-5 MSHP-5 MSHP-5 MSHP-5 MSHP-5 MS
Column length (m) 25.25.25.25.25.
Carrier gas HeliumHeliumHeliumHeliumHelium
Substrate
Column diameter (mm) 0.200.200.200.200.20
Phase thickness (μm) 0.330.330.330.330.33
Tstart (C) 40.40.40.40.40.
Tend (C) 280.280.280.280.280.
Heat rate (K/min) 10.10.10.10.10.
Initial hold (min)
Final hold (min)
I 1523.1523.1523.1523.1523.
ReferenceUkolova and Zenkevich, 2011Ukolova and Zenkevich, 2011Ukolova and Zenkevich, 2011Ukolova and Zenkevich, 2011Ukolova and Zenkevich, 2011
Comment MSDC-RI MSDC-RI MSDC-RI MSDC-RI MSDC-RI
Column type CapillaryCapillaryCapillaryCapillaryCapillary
Active phase HP-5 MSHP-5 MSHP-5 MSDB-5HP-5
Column length (m) 25.25.25.30.30.
Carrier gas HeliumHeliumHelium Helium
Substrate
Column diameter (mm) 0.200.200.200.250.32
Phase thickness (μm) 0.330.330.330.250.25
Tstart (C) 40.40.40.40.40.
Tend (C) 280.280.280.280.240.
Heat rate (K/min) 10.10.10.5.4.
Initial hold (min)
Final hold (min)    10.5.
I 1523.1525.1526.1496.1503.
ReferenceUkolova and Zenkevich, 2011Ukolova and Zenkevich, 2011Ukolova and Zenkevich, 2011Grung, Lichtenthaler, et al., 2007Miyazawa and Kawata, 2006
Comment MSDC-RI MSDC-RI MSDC-RI MSDC-RI MSDC-RI
Column type CapillaryCapillaryCapillaryCapillaryCapillary
Active phase C103H208C103H208HP-5HP-5HP-5
Column length (m)   30.30.30.
Carrier gas H2H2
Substrate
Column diameter (mm)   0.320.320.32
Phase thickness (μm) 0.250.250.250.250.25
Tstart (C) 80.100.50.50.50.
Tend (C) 275.275.310.310.310.
Heat rate (K/min) 5.4.5.5.5.
Initial hold (min)   2.2.2.
Final hold (min)
I 1492.1494.1483.1483.1485.
ReferenceDumitrescu, Buda, et al., 2000Dumitrescu, Buda, et al., 2000Miao and Wu, 1999Miao and Wu, 1999Miao and Wu, 1999
Comment MSDC-RI MSDC-RI MSDC-RI MSDC-RI MSDC-RI
Column type CapillaryCapillaryCapillaryCapillaryCapillary
Active phase HP-5HP-5HP-5HP-5HP-5
Column length (m) 30.30.30.30.30.
Carrier gas
Substrate
Column diameter (mm) 0.320.320.320.320.32
Phase thickness (μm) 0.250.250.250.250.25
Tstart (C) 50.50.50.50.50.
Tend (C) 310.310.310.310.310.
Heat rate (K/min) 5.5.5.5.5.
Initial hold (min) 2.2.2.2.2.
Final hold (min)
I 1485.1485.1486.1491.1491.
ReferenceMiao and Wu, 1999Miao and Wu, 1999Miao and Wu, 1999Miao and Wu, 1999Miao and Wu, 1999
Comment MSDC-RI MSDC-RI MSDC-RI MSDC-RI MSDC-RI
Column type CapillaryCapillaryCapillary
Active phase Ultra-1Ultra-1SE-54
Column length (m) 50.25.25.
Carrier gas H2HeHe
Substrate
Column diameter (mm) 0.20.320.32
Phase thickness (μm) 0.330.25
Tstart (C) 60.80.50.
Tend (C) 300.260.250.
Heat rate (K/min) 3.3.8.
Initial hold (min)   2.
Final hold (min) 35. 12.
I 1460.1437.1474.
ReferenceElizalde-González, Hutfliess, et al., 1996Okumura, 1991Harland, Cumming, et al., 1986
Comment MSDC-RI MSDC-RI MSDC-RI

Van Den Dool and Kratz RI, non-polar column, custom temperature program

Data compiled by: NIST Mass Spectrometry Data Center, William E. Wallace, director

Column type CapillaryCapillaryCapillaryCapillaryCapillary
Active phase HP-1HP-5DB-5OV-1015 % Phenyl methyl siloxane
Column length (m) 30.30.30.15.25.
Carrier gas   HeHeHe
Substrate
Column diameter (mm) 0.250.250.250.250.31
Phase thickness (μm) 0.250.250.250.250.52
Program 60C => 7C/min => 225C => 15C/min => 300C(11.43min)60C => 7C/min => 225C => 15C/min => 300C(11.43min)60 0C 7 0C/min -> 130 0C 5 0C/min -> 200 0C 6 0C/min -> 260 0C 20 0C/min -> 320 0C (4 min)50C(2min) => (20C/min) => 120C => (7C/min) => 310C(10min)50C(2min) => (20C/min) => 120C => (7C/min) => 310C(10min)
I 1455.061488.21503.1439.1472.
ReferenceDimitriou-Christidis, Harris, et al., 2003Dimitriou-Christidis, Harris, et al., 2003Havenga and Rohwer, 1999Yasuhara, Shiraishi, et al., 1997Yasuhara, Shiraishi, et al., 1997
Comment MSDC-RI MSDC-RI MSDC-RI MSDC-RI MSDC-RI
Column type Capillary
Active phase Methyl Silicone
Column length (m)
Carrier gas
Substrate
Column diameter (mm)
Phase thickness (μm)
Program 50C (2min) => 20C/min => 160C => 5C/min => 210C => 10C/min => 300C
I 1450.
ReferenceOda, Ichikawa, et al., 1996
Comment MSDC-RI

Kovats' RI, non-polar column, isothermal

Data compiled by: NIST Mass Spectrometry Data Center, William E. Wallace, director

Column type CapillaryCapillaryCapillaryCapillaryCapillary
Active phase OV-1OV-1OV-1OV-1OV-101
Column length (m) 25.25.25.25.50.
Carrier gas N2N2N2N2N2
Substrate
Column diameter (mm) 0.20.20.20.20.3
Phase thickness (μm) 0.330.330.330.33
Temperature (C) 150.150.150.160.140.
I 1472.1472.1475.1486.1463.9
ReferenceZhang, Chen, et al., 1997Zhang, Chen, et al., 1997Zhang, Chen, et al., 1997Zhang, Chen, et al., 1997Gerasimenko, Kirilenko, et al., 1981
Comment MSDC-RI MSDC-RI MSDC-RI MSDC-RI MSDC-RI
Column type Packed
Active phase SE-30
Column length (m)
Carrier gas
Substrate
Column diameter (mm)
Phase thickness (μm)
Temperature (C) 150.
I 1475.
ReferenceShlyakhov, Anvaer, et al., 1975
Comment MSDC-RI

Normal alkane RI, polar column, custom temperature program

Data compiled by: NIST Mass Spectrometry Data Center, William E. Wallace, director

Column type CapillaryCapillaryCapillaryCapillaryCapillary
Active phase Supelcowax-10DB-WaxDB-WaxSuperox 0.6; Carbowax 20MSuperox 0.6; Carbowax 20M
Column length (m) 30.  50.50.
Carrier gas    HydrogenHydrogen
Substrate
Column diameter (mm) 0.25  0.320.32
Phase thickness (μm) 0.25
Program 40C(3min) => 4C/min => 75C => 8C/min => 250Cnot specifiednot specifiednot specifiednot specified
I 2132.2108.2133.2092.2103.
ReferenceVichi, Pizzale, et al., 2005Peng, Yang, et al., 1991Peng, Yang, et al., 1991Waggott and Davies, 1984Waggott and Davies, 1984
Comment MSDC-RI MSDC-RI MSDC-RI MSDC-RI MSDC-RI

References

Hunter and Lias, 1998
Hunter, E.P.; Lias, S.G.,
Evaluated Gas Phase Basicities and Proton Affinities of Molecules: An Update,
J. Phys. Chem. Ref. Data, 1998, 27, 3, 413-656, https://doi.org/10.1063/1.556018
. [all data]
Aue, Guidoni, et al., 2000
Aue, D.H.; Guidoni, M.; Betowski, L.D.,
Ab initio calculated gas-phase basicities of polynuclear aromatic hydrocarbons,
Int. J. Mass Spectrom., 2000, 201, 283. [all data]
Mautner(Meot-Ner), 1980
Mautner(Meot-Ner), M.,
Ion thermochemistry of low volatility compounds in the gas phase. 3. Polycyclic aromatics: Ionization energies, proton, and hydrogen affinities. Extrapolations to graphite,
J. Phys. Chem., 1980, 84, 2716. [all data]
Dewar, Haselbach, et al., 1970
Dewar, M.J.S.; Haselbach, E.; Worley, S.D.,
Calculated and observed ionization potentials of unsaturated polycyclic hydrocarbons; calculated heats of formation by several semiempirical s.c.f. m.o. methods,
Proc. Roy. Soc. (London), 1970, A315, 431. [all data]
Kinoshita, 1962
Kinoshita, M.,
The absorption spectra of the molecular complexes of aromatic compounds with p-bromanil,
Bull. Chem. Soc. Japan, 1962, 35, 1609. [all data]
Heilbronner, Hoshi, et al., 1976
Heilbronner, E.; Hoshi, T.; von Rosenberg, J.L.; Hafner, K.,
Alkyl-induced, natural hypsochromic shifts of the 2A←2X and 2B←2X transitions of azulene and naphthalene radical cations,
Nouv. J. Chim., 1976, 1, 105. [all data]
Boschi, Clar, et al., 1974
Boschi, R.; Clar, E.; Schmidt, W.,
Photoelectron spectra of polynuclear aromatics. III. The effect of nonplanarity in sterically overcrowded aromatic hydrocarbons,
J. Chem. Phys., 1974, 60, 4406. [all data]
Meot-ner and Kafafi, 1988
Meot-ner, M.; Kafafi, S.A.,
Carbon Acidities of Aromatic Compounds,
J. Am. Chem. Soc., 1988, 110, 19, 6297, https://doi.org/10.1021/ja00227a003
. [all data]