Phenanthrene, 3-methyl-
- Formula: C15H12
- Molecular weight: 192.2558
- IUPAC Standard InChIKey: GKYWZUBZZBHZKU-UHFFFAOYSA-N
- CAS Registry Number: 832-71-3
- Chemical structure:
View 3d structure (requires JavaScript / HTML 5) - Isotopologues:
- Other names: 3-Methylphenanthrene; 3-MethyIphenanthrene

Phase change data

Data compiled by: Robert L. Brown and Stephen E. Stein
Reduced pressure boiling point
Tboil (K) | Pressure (bar) | Reference |
---|---|---|
418.2 | 0.008 | Weast and Grasselli, 1989 |

Gas phase ion energetics data

Data compiled as indicated in comments:
RDSH - Henry M. Rosenstock, Keith Draxl, Bruce W. Steiner, and John T. Herron
Ionization energy determinations
IE (eV) | Method | Reference | Comment |
---|---|---|---|
7.90 | EI | Nounou, 1968 | RDSH |
7.68 ± 0.01 | EI | Bonnier, Gelus, et al., 1965 | RDSH |
Appearance energy determinations
Ion | AE (eV) | Other Products | Method | Reference | Comment |
---|---|---|---|---|---|
C13H9+ | 13.4 ± 0.2 | ? | EI | Nounou, 1966 | RDSH |
C15H9+ | 16.1 ± 0.2 | H2+H | EI | Nounou, 1966 | RDSH |
C15H10+ | 13.6 ± 0.2 | H2 | EI | Nounou, 1966 | RDSH |
C15H11+ | 12.8 ± 0.1 | H | EI | Nounou, 1966 | RDSH |

Kovats' RI, non-polar column, isothermal

Data compiled by: NIST Mass Spectrometry Data Center, William E. Wallace, director

Column type PackedCapillary
Active phase OV-101OV-101
Column length (m) 10.50.
Carrier gas  N2
Substrate Gas Chrom Q
Column diameter (mm)  0.50
Phase thickness (μm)
Temperature (C) 230.230.
I 1938.1938.
ReferenceGrimmer and Böhnke, 1975Grimmer and Böhnke, 1972
Comment MSDC-RI MSDC-RI

References

Weast and Grasselli, 1989
CRC Handbook of Data on Organic Compounds, 2nd Editon, Weast,R.C and Grasselli, J.G., ed(s)., CRC Press, Inc., Boca Raton, FL, 1989, 1. [all data]
Nounou, 1968
Nounou, P.,
Etude des composes aromatiques par spectrometrie de masse. III. Interpretation des processus d'ionisation et de dissociation des molecules de phenanthrene et de methyl-phenanthrene par impact electronique,
J. Chim. Phys., 1968, 65, 700. [all data]
Bonnier, Gelus, et al., 1965
Bonnier, J.-M.; Gelus, M.; Nounou, P.,
Contribution a l'etude de l'effet inductif et de l'effet d'hyperconjugaison dans quelques methylaromatiques,
J. Chim. Phys., 1965, 10, 1191. [all data]
Nounou, 1966
Nounou, P.,
Etude des composes aromatiques par spectrometrie de masse. I. Mesure des potentials d'ionisation et d'apparition par la methode du potential retardateur et interpretation des courbes d'ionisation differentielle,
J. Chim. Phys., 1966, 63, 994. [all data]