Phenanthrene, 4-methyl-
- Formula: C15H12
- Molecular weight: 192.2558
- IUPAC Standard InChIKey: LOCGAKKLRVLQAM-UHFFFAOYSA-N
- CAS Registry Number: 832-64-4
- Chemical structure:
View 3d structure (requires JavaScript / HTML 5) - Other names: 4-Methylphenanthrene

Gas phase thermochemistry data

Data compiled by: Hussein Y. Afeefy, Joel F. Liebman, and Stephen E. Stein
Quantity | Value | Units | Method | Reference | Comment |
---|---|---|---|---|---|
ΔfH°gas | 195.8 ± 1.1 | kJ/mol | Ccr | Chirico, Hossenlopp, et al., 1989 | Hfusion=14.04 kJ/mol |

Condensed phase thermochemistry data

Data compiled as indicated in comments:
ALS - Hussein Y. Afeefy, Joel F. Liebman, and Stephen E. Stein
DH - Eugene S. Domalski and Elizabeth D. Hearing
Quantity | Value | Units | Method | Reference | Comment |
---|---|---|---|---|---|
ΔfH°solid | 102.42 ± 0.67 | kJ/mol | Ccr | Chirico, Hossenlopp, et al., 1989 | Hfusion=14.04 kJ/mol; ALS |
Quantity | Value | Units | Method | Reference | Comment |
ΔcH°solid | -7720.05 ± 0.56 | kJ/mol | Ccr | Chirico, Hossenlopp, et al., 1989 | Hfusion=14.04 kJ/mol; Corresponding ΔfHºsolid = 102.42 kJ/mol (simple calculation by NIST; no Washburn corrections); ALS |
Quantity | Value | Units | Method | Reference | Comment |
S°solid,1 bar | 244.55 | J/mol*K | N/A | Chirico, Hossenlopp, et al., 1989 | DH |
S°solid,1 bar | 244.55 | J/mol*K | N/A | Chirico, Hossenlopp, et al., 1988 | DH |
Constant pressure heat capacity of solid
Cp,solid (J/mol*K) | Temperature (K) | Reference | Comment |
---|---|---|---|
263.13 | 298.15 | Chirico, Hossenlopp, et al., 1989 | T = 10 to 500 K. Value is a graphical extrapolation.; DH |
263.13 | 298.15 | Chirico, Hossenlopp, et al., 1988 | T = 10 to 500 K. Value is a graphical extrapolation.; DH |

Phase change data

Data compiled as indicated in comments:
TRC - Thermodynamics Research Center, NIST Boulder Laboratories, Chris Muzny director
AC - William E. Acree, Jr., James S. Chickos
DRB - Donald R. Burgess, Jr.
CAL - James S. Chickos, William E. Acree, Jr., Joel F. Liebman, Students of Chem 202 (Introduction to the Literature of Chemistry), University of Missouri -- St. Louis
DH - Eugene S. Domalski and Elizabeth D. Hearing
Quantity | Value | Units | Method | Reference | Comment |
---|---|---|---|---|---|
Ttriple | 324.920 | K | N/A | Chirico, Hossenlopp, et al., 1989, 2 | Crystal phase 1 phase; Uncertainty assigned by TRC = 0.01 K; TRC |
Quantity | Value | Units | Method | Reference | Comment |
ΔsubH° | 93.4 | kJ/mol | N/A | Chirico, Hossenlopp, et al., 1989 | DRB |
Enthalpy of vaporization
ΔvapH (kJ/mol) | Temperature (K) | Method | Reference | Comment |
---|---|---|---|---|
74.4 ± 0.2 | 380. | EB,IP | Chirico, Hossenlopp, et al., 1989 | Based on data from 368. to 647. K.; AC |
71.8 ± 0.1 | 420. | EB,IP | Chirico, Hossenlopp, et al., 1989 | Based on data from 368. to 647. K.; AC |
69.2 ± 0.1 | 460. | EB,IP | Chirico, Hossenlopp, et al., 1989 | Based on data from 368. to 647. K.; AC |
66.7 ± 0.1 | 500. | EB,IP | Chirico, Hossenlopp, et al., 1989 | Based on data from 368. to 647. K.; AC |
64.2 ± 0.1 | 540. | EB,IP | Chirico, Hossenlopp, et al., 1989 | Based on data from 368. to 647. K.; AC |
61.6 ± 0.1 | 580. | EB,IP | Chirico, Hossenlopp, et al., 1989 | Based on data from 368. to 647. K.; AC |
Enthalpy of fusion
ΔfusH (kJ/mol) | Temperature (K) | Reference | Comment |
---|---|---|---|
14.04 | 324.9 | Domalski and Hearing, 1996 | AC |
Entropy of fusion
ΔfusS (J/mol*K) | Temperature (K) | Reference | Comment |
---|---|---|---|
0.12 | 182. | Domalski and Hearing, 1996 | CAL |
0.11 | 295. | ||
43.21 | 324.9 |
Enthalpy of phase transition
ΔHtrs (kJ/mol) | Temperature (K) | Initial Phase | Final Phase | Reference | Comment |
---|---|---|---|---|---|
0.0224 | 182.0 | crystaline, III | crystaline, II | Chirico, Hossenlopp, et al., 1989 | Extrapolated value.; DH |
0.0333 | 295.0 | crystaline, II | crystaline, I | Chirico, Hossenlopp, et al., 1989 | Extrapolated value.; DH |
14.039 | 324.925 | crystaline, I | liquid | Chirico, Hossenlopp, et al., 1989 | DH |
0.0224 | 182.0 | crystaline, III | crystaline, II | Chirico, Hossenlopp, et al., 1988 | Extrapolated value.; DH |
0.0333 | 295. | crystaline, II | crystaline, I | Chirico, Hossenlopp, et al., 1988 | Extrapolated value.; DH |
14.039 | 324.925 | crystaline, I | liquid | Chirico, Hossenlopp, et al., 1988 | DH |
Entropy of phase transition
ΔStrs (J/mol*K) | Temperature (K) | Initial Phase | Final Phase | Reference | Comment |
---|---|---|---|---|---|
0.12 | 182.0 | crystaline, III | crystaline, II | Chirico, Hossenlopp, et al., 1989 | Extrapolated; DH |
0.11 | 295.0 | crystaline, II | crystaline, I | Chirico, Hossenlopp, et al., 1989 | Extrapolated; DH |
43.21 | 324.925 | crystaline, I | liquid | Chirico, Hossenlopp, et al., 1989 | DH |
0.12 | 182.0 | crystaline, III | crystaline, II | Chirico, Hossenlopp, et al., 1988 | Extrapolated; DH |
0.11 | 295. | crystaline, II | crystaline, I | Chirico, Hossenlopp, et al., 1988 | Extrapolated; DH |
43.21 | 324.925 | crystaline, I | liquid | Chirico, Hossenlopp, et al., 1988 | DH |

Gas phase ion energetics data

Data compiled as indicated in comments:
LLK - Sharon G. Lias, Rhoda D. Levin, and Sherif A. Kafafi
RDSH - Henry M. Rosenstock, Keith Draxl, Bruce W. Steiner, and John T. Herron
Ionization energy determinations
IE (eV) | Method | Reference | Comment |
---|---|---|---|
7.1 ± 0.1 | EI | Dougherty, Bertorello, et al., 1971 | LLK |
7.70 ± 0.02 | EI | Nounou, 1966 | RDSH |
7.70 ± 0.02 | EI | Bonnier, Gelus, et al., 1965 | RDSH |
Appearance energy determinations
Ion | AE (eV) | Other Products | Method | Reference | Comment |
---|---|---|---|---|---|
C13H9+ | 12.7 ± 0.1 | C2H3 | EI | Dougherty, Bertorello, et al., 1971 | LLK |
C15H9+ | 14.4 ± 0.1 | H2+H | EI | Dougherty, Bertorello, et al., 1971 | LLK |
C15H11+ | 12.0 ± 0.1 | H | EI | Dougherty, Bertorello, et al., 1971 | LLK |
C15H11+ | 12.2 ± 0.2 | H | EI | Nounou, 1966 | RDSH |

References

Chirico, Hossenlopp, et al., 1989
Chirico, R.D.; Hossenlopp, I.A.; Nguyen, A.; Steele, W.V.; Gammon, B.E.,
The thermodynamic properties of 4-methylphenanthrene,
J. Chem. Thermodyn., 1989, 21, 179-201. [all data]
Chirico, Hossenlopp, et al., 1988
Chirico, R.D.; Hossenlopp, I.A.; Nguyen, A.; Steele, W.V.,
The thermodynamic properties of 4-methylphenanthrene,
NIPER Report, 1988, 345, 42p. [all data]
Chirico, Hossenlopp, et al., 1989, 2
Chirico, R.D.; Hossenlopp, I.A.; Nguyen, A.; Steele, W.V.; Gammon, B.E.,
The thermodynamic properties of 4-methylphenanthrene,
J. Chem. Thermodyn., 1989, 21, 179. [all data]
Domalski and Hearing, 1996
Domalski, Eugene S.; Hearing, Elizabeth D.,
Heat Capacities and Entropies of Organic Compounds in the Condensed Phase. Volume III,
J. Phys. Chem. Ref. Data, 1996, 25, 1, 1, https://doi.org/10.1063/1.555985
. [all data]
Dougherty, Bertorello, et al., 1971
Dougherty, R.C.; Bertorello, H.E.; Martinez de Bertorello, M.,
Mass spectra and thermochemistry of methyl phenanthrenes. A contribution to the analogy between mass spectral and thermal fragmentation reactions,
Org. Mass Spectrom., 1971, 5, 1321. [all data]
Nounou, 1966
Nounou, P.,
Etude des composes aromatiques par spectrometrie de masse. I. Mesure des potentials d'ionisation et d'apparition par la methode du potential retardateur et interpretation des courbes d'ionisation differentielle,
J. Chim. Phys., 1966, 63, 994. [all data]
Bonnier, Gelus, et al., 1965
Bonnier, J.-M.; Gelus, M.; Nounou, P.,
Contribution a l'etude de l'effet inductif et de l'effet d'hyperconjugaison dans quelques methylaromatiques,
J. Chim. Phys., 1965, 10, 1191. [all data]