Ethanol, 2,2-dibromo-
- Formula: C2H4Br2O
- Molecular weight: 203.861
- IUPAC Standard InChIKey: OGZJULUCZAZKHP-UHFFFAOYSA-N
- CAS Registry Number: 83206-47-7
- Chemical structure:
View 3d structure (requires JavaScript / HTML 5) - Permanent link for this species. Use this link for bookmarking this species for future reference.

Gas phase ion energetics data

Data compiled by: Sharon G. Lias and Joel F. Liebman
Appearance energy determinations
Ion | AE (eV) | Other Products | Method | Reference | Comment |
---|---|---|---|---|---|
CH3O+ | 11.16 | CHBr2 | EI | Holmes and Lossing, 1988 |

References

Holmes and Lossing, 1988
Holmes, J.L.; Lossing, F.P.,
Heats of formation and bond dissociation energies in halogen-substituted methyl and ethyl radicals,
J. Am. Chem. Soc., 1988, 110, 7343. [all data]