Benzene, [(phenylmethyl)thio]-
- Formula: C13H12S
- Molecular weight: 200.299
- IUPAC Standard InChIKey: LKMCJXXOBRCATQ-UHFFFAOYSA-N
- CAS Registry Number: 831-91-4
- Chemical structure:
View 3d structure (requires JavaScript / HTML 5) - Other names: Benzyl phenyl sulfide; Phenyl benzyl sulfide; Sulfide, benzyl phenyl; 1,2-Diphenyl-1-thiaethane; benzyl phenyl sulphide

Phase change data

Data compiled as indicated in comments:
BS - Robert L. Brown and Stephen E. Stein
AC - William E. Acree, Jr., James S. Chickos
Quantity | Value | Units | Method | Reference | Comment |
---|---|---|---|---|---|
ΔsubH° | 98.4 ± 1.4 | kJ/mol | C | Mulder, Mozenson, et al., 2006 | AC |
Reduced pressure boiling point
Tboil (K) | Pressure (bar) | Reference | Comment |
---|---|---|---|
470.2 | 0.036 | Weast and Grasselli, 1989 | BS |

Gas phase ion energetics data

Data compiled as indicated in comments:
LLK - Sharon G. Lias, Rhoda D. Levin, and Sherif A. Kafafi
Ionization energy determinations
IE (eV) | Method | Reference | Comment |
---|---|---|---|
7.87 ± 0.02 | PI | Potapov, Kardash, et al., 1972 | LLK |

References

Mulder, Mozenson, et al., 2006
Mulder, Peter; Mozenson, Olga; Lin, Shuqiong; Bernardes, Carlos E.S.; Minas da Piedade, Manuel E.; Santos, Ana Filipa L.O.M.; Ribeiro da Silva, Manuel A.V.; DiLabio, Gino A.; Korth, Hans-Gert; Ingold, K.U.,
Effect of Ring Substitution on the S-H Bond Dissociation Enthalpies of Thiophenols. An Experimental and Computational Study,
J. Phys. Chem. A, 2006, 110, 32, 9949-9958, https://doi.org/10.1021/jp062781h
. [all data]
Weast and Grasselli, 1989
CRC Handbook of Data on Organic Compounds, 2nd Editon, Weast,R.C and Grasselli, J.G., ed(s)., CRC Press, Inc., Boca Raton, FL, 1989, 1. [all data]
Potapov, Kardash, et al., 1972
Potapov, V.K.; Kardash, I.E.; Sorokin, V.V.; Sokolov, S.A.; Evlasheva, T.I.,
Photoionization of heteroaromatic compounds,
Khim. Vys. Energ., 1972, 6, 392. [all data]