Bi-2,4,6-cycloheptatrien-1-yl
- Formula: C14H14
- Molecular weight: 182.2610
- IUPAC Standard InChIKey: DMVKBMNNLFFZBY-UHFFFAOYSA-N
- CAS Registry Number: 831-18-5
- Chemical structure:
View 3d structure (requires JavaScript / HTML 5) - Species with the same structure:
- Other names: Bitropenyl; Heptafulvalene, dihydro-; 7,7'-Bis(cycloheptatrienyl); 7,7'-Ditropyl; 7,7'-Bicycloheptatrienyl

Phase change data

Data compiled by: Thermodynamics Research Center, NIST Boulder Laboratories, Chris Muzny director
Quantity | Value | Units | Method | Reference | Comment |
---|---|---|---|---|---|
Tfus | 334. | K | N/A | Turner, Meador, et al., 1957 | Uncertainty assigned by TRC = 1.5 K |

Gas phase ion energetics data

Data compiled by: Henry M. Rosenstock, Keith Draxl, Bruce W. Steiner, and John T. Herron
Appearance energy determinations
Ion | AE (eV) | Other Products | Method | Reference | Comment |
---|---|---|---|---|---|
C7H7+ | 8.09 ± 0.05 | C7H7 | PI | Elder and Parr, 1969 |

References

Turner, Meador, et al., 1957
Turner, R.B.; Meador, W.R.; Doering, W. vonE.; Knox, L.H.; Mayer, J.R.; Wiley, D.W.,
Heats of Hydrogenation III. Hydrogenation of Cyclooctatetraene and of Some Seven-membered Non-benzenoid Aromatic Compounds,
J. Am. Chem. Soc., 1957, 79, 4127. [all data]
Elder and Parr, 1969
Elder, F.A.; Parr, A.C.,
Photoionization of the cycloheptatrienyl radical,
J. Chem. Phys., 1969, 50, 1027. [all data]