Adamantane-1-carboxylic acid
- Formula: C11H16O2
- Molecular weight: 180.2435
- IUPAC Standard InChIKey: JIMXXGFJRDUSRO-UHFFFAOYSA-N
- CAS Registry Number: 828-51-3
- Chemical structure:

Condensed phase thermochemistry data

Data compiled by: Hussein Y. Afeefy, Joel F. Liebman, and Stephen E. Stein
Quantity | Value | Units | Method | Reference | Comment |
---|---|---|---|---|---|
ΔfH°solid | -643.08 | kJ/mol | Ccb | Steele, Carson, et al., 1973 | |
Quantity | Value | Units | Method | Reference | Comment |
ΔcH°solid | -5972.2 ± 3.6 | kJ/mol | Ccb | Steele, Carson, et al., 1973 | Corresponding ΔfHºsolid = -643.08 kJ/mol (simple calculation by NIST; no Washburn corrections) |

Phase change data

Data compiled by: William E. Acree, Jr., James S. Chickos
Enthalpy of fusion
ΔfusH (kJ/mol) | Temperature (K) | Method | Reference |
---|---|---|---|
2.25 | 524.2 | DSC | Harvey, Gilson, et al., 1986 |

Reaction thermochemistry data

Data compiled by: John E. Bartmess
Individual Reactions
C11H15O2- + =
By formula: C11H15O2- + H+ = C11H16O2
Quantity | Value | Units | Method | Reference | Comment |
---|---|---|---|---|---|
ΔrH° | 1435. ± 8.8 | kJ/mol | G+TS | Caldwell, Renneboog, et al., 1989 | gas phase |
ΔrH° | 1438. ± 8.8 | kJ/mol | G+TS | Jinfeng, Topsom, et al., 1988 | gas phase; value altered from reference due to change in acidity scale |
Quantity | Value | Units | Method | Reference | Comment |
ΔrG° | 1406. ± 8.4 | kJ/mol | IMRE | Caldwell, Renneboog, et al., 1989 | gas phase |
ΔrG° | 1408. ± 8.4 | kJ/mol | IMRE | Jinfeng, Topsom, et al., 1988 | gas phase; value altered from reference due to change in acidity scale |

Gas phase ion energetics data

Data compiled as indicated in comments:
B - John E. Bartmess
LLK - Sharon G. Lias, Rhoda D. Levin, and Sherif A. Kafafi
Ionization energy determinations
IE (eV) | Method | Reference | Comment |
---|---|---|---|
9.34 | PE | Worley, Mateescu, et al., 1973 | LLK |
De-protonation reactions
C11H15O2- + =
By formula: C11H15O2- + H+ = C11H16O2
Quantity | Value | Units | Method | Reference | Comment |
---|---|---|---|---|---|
ΔrH° | 1435. ± 8.8 | kJ/mol | G+TS | Caldwell, Renneboog, et al., 1989 | gas phase; B |
ΔrH° | 1438. ± 8.8 | kJ/mol | G+TS | Jinfeng, Topsom, et al., 1988 | gas phase; value altered from reference due to change in acidity scale; B |
Quantity | Value | Units | Method | Reference | Comment |
ΔrG° | 1406. ± 8.4 | kJ/mol | IMRE | Caldwell, Renneboog, et al., 1989 | gas phase; B |
ΔrG° | 1408. ± 8.4 | kJ/mol | IMRE | Jinfeng, Topsom, et al., 1988 | gas phase; value altered from reference due to change in acidity scale; B |

Normal alkane RI, non-polar column, custom temperature program

Column type | Active phase | I | Reference | Comment |
---|---|---|---|---|
Capillary | PMS-1000 | 1433. | Kurbatova, Kolosova, et al., 2000 | Program: not specified |

Normal alkane RI, polar column, custom temperature program

Column type | Active phase | I | Reference | Comment |
---|---|---|---|---|
Capillary | Carbowax 20M | 2118. | Kurbatova, Kolosova, et al., 2000 | Program: not specified |

References

Steele, Carson, et al., 1973
Steele, W.V.; Carson, A.S.; Laye, P.G.; Rosser, C.A.,
Enthalpies of formation of adamantanoid compounds. Part 3.-Adamantanecarboxylic acids,
J. Chem. Soc. Faraday Trans. 1, 1973, 69, 1257-1260. [all data]
Harvey, Gilson, et al., 1986
Harvey, Pierre D.; Gilson, D.F.R.; Butler, I.S.,
Phase transitions in adamantane derivatives: adamantanecarboxylic acid,
J. Phys. Chem., 1986, 90, 1, 136-139, https://doi.org/10.1021/j100273a031
. [all data]
Caldwell, Renneboog, et al., 1989
Caldwell, G.; Renneboog, R.; Kebarle, P.,
Gas Phase Acidities of Aliphatic Carboxylic Acids, Based on Measurements of Proton Transfer Equilibria,
Can. J. Chem., 1989, 67, 4, 661, https://doi.org/10.1139/v89-092
. [all data]
Jinfeng, Topsom, et al., 1988
Jinfeng, C.; Topsom, R.D.; Headley, A.D.; Koppel, I.; Mishima, M.; Taft, R.W.; Veji, S.,
Acidities of Substituted Acetic Acids,
J. Mol. Struct., 1988, 168, 141, https://doi.org/10.1016/0166-1280(88)80349-X
. [all data]
Worley, Mateescu, et al., 1973
Worley, S.D.; Mateescu, G.D.; McFarland, C.W.; Fort, R.C., Jr.; Sheley, C.F.,
Photoelectron spectra and MINDO-SCF-MO calculations for adamantane and some of its derivatives,
J. Am. Chem. Soc., 1973, 95, 7580. [all data]
Kurbatova, Kolosova, et al., 2000
Kurbatova, S.; Kolosova, E.; Solovova, N.; Finkelshtein, E.; Zemtsova, M.,
Gas-chromatographic investigation of adamantane oxygen derivatives,
Vestn. Samara State Univ., 2000, 4, 18, 167-172. [all data]