Benzene, cyclohexyl-
- Formula: C12H16
- Molecular weight: 160.2554
- IUPAC Standard InChIKey: IGARGHRYKHJQSM-UHFFFAOYSA-N
- CAS Registry Number: 827-52-1
- Chemical structure:
View 3d structure (requires JavaScript / HTML 5) - Other names: Cyclohexane, phenyl-; Cyclohexylbenzene; Phenylcyclohexane; 1,1'-Biphenyl, 1,2,3,4,5,6-hexahydro-

Gas phase thermochemistry data

Data compiled as indicated in comments:
ALS - Hussein Y. Afeefy, Joel F. Liebman, and Stephen E. Stein
DRB - Donald R. Burgess, Jr.
Quantity | Value | Units | Method | Reference | Comment |
---|---|---|---|---|---|
ΔfH°gas | -16.7 ± 1.5 | kJ/mol | Ccb | Montgomery, Rossini, et al., 1978 | Reanalyzed by Pedley, Naylor, et al., 1986, Original value = -19.2 ± 5.6 kJ/mol; ALS |
ΔfH°gas | -14.2 | kJ/mol | N/A | Good and Lee, 1976 | Value computed using ΔfHliquid° value of -76.6±1.1 kj/mol from Good and Lee, 1976 and ΔvapH° value of 62.4 kj/mol from Montgomery, Rossini, et al., 1978.; DRB |

Condensed phase thermochemistry data

Data compiled as indicated in comments:
ALS - Hussein Y. Afeefy, Joel F. Liebman, and Stephen E. Stein
DH - Eugene S. Domalski and Elizabeth D. Hearing
Quantity | Value | Units | Method | Reference | Comment |
---|---|---|---|---|---|
ΔfH°liquid | -79.1 ± 5.6 | kJ/mol | Ccb | Montgomery, Rossini, et al., 1978 | ALS |
ΔfH°liquid | -76.6 ± 1.1 | kJ/mol | Ccb | Good and Lee, 1976 | ALS |
Quantity | Value | Units | Method | Reference | Comment |
ΔcH°liquid | -6929.6 ± 5.4 | kJ/mol | Ccb | Montgomery, Rossini, et al., 1978 | Corresponding ΔfHºliquid = -79.16 kJ/mol (simple calculation by NIST; no Washburn corrections); ALS |
ΔcH°liquid | -6932.22 ± 0.92 | kJ/mol | Ccb | Good and Lee, 1976 | Corresponding ΔfHºliquid = -76.53 kJ/mol (simple calculation by NIST; no Washburn corrections); ALS |
Constant pressure heat capacity of liquid
Cp,liquid (J/mol*K) | Temperature (K) | Reference | Comment |
---|---|---|---|
263.2 | 198.15 | O'Rourke and Mraw, 1983 | T = 220 to 475 K. Cp(c) = 0.8803 (T/K) - 29.2 (220 to 280.5 K); Cp(liq) = 0.6130 (T/K) + 80.4 (280.5 to 475 K) J/mol*K.; DH |

Phase change data

Data compiled as indicated in comments:
BS - Robert L. Brown and Stephen E. Stein
TRC - Thermodynamics Research Center, NIST Boulder Laboratories, Chris Muzny director
AC - William E. Acree, Jr., James S. Chickos
ALS - Hussein Y. Afeefy, Joel F. Liebman, and Stephen E. Stein
DRB - Donald R. Burgess, Jr.
DH - Eugene S. Domalski and Elizabeth D. Hearing
Quantity | Value | Units | Method | Reference | Comment |
---|---|---|---|---|---|
Tboil | 512.7 | K | N/A | Aldrich Chemical Company Inc., 1990 | BS |
Tboil | 508.7 | K | N/A | Weast and Grasselli, 1989 | BS |
Tboil | 513.27 | K | N/A | Mears, Stanley, et al., 1963 | Uncertainty assigned by TRC = 0.2 K; TRC |
Tboil | 513.27 | K | N/A | Jessup and Stanley, 1961 | Uncertainty assigned by TRC = 0.5 K; TRC |
Quantity | Value | Units | Method | Reference | Comment |
Tfus | 280.3 ± 0.6 | K | AVG | N/A | Average of 7 values; Individual data points |
Quantity | Value | Units | Method | Reference | Comment |
ΔvapH° | 61. ± 2. | kJ/mol | AVG | N/A | Average of 6 values; Individual data points |
Reduced pressure boiling point
Tboil (K) | Pressure (bar) | Reference | Comment |
---|---|---|---|
400.7 | 0.040 | Weast and Grasselli, 1989 | BS |
Enthalpy of vaporization
ΔvapH (kJ/mol) | Temperature (K) | Method | Reference | Comment |
---|---|---|---|---|
56.4 | 348. | N/A | Sohda, Okazaki, et al., 1990 | Based on data from 333. to 343. K.; AC |
51.3 | 436. | A | Stephenson and Malanowski, 1987 | Based on data from 421. to 513. K.; AC |
Antoine Equation Parameters
log10(P) = A − (B / (T + C))
P = vapor pressure (bar)
T = temperature (K)
View plot Requires a JavaScript / HTML 5 canvas capable browser.
Temperature (K) | A | B | C | Reference | Comment |
---|---|---|---|---|---|
340.7 to 513. | 4.98206 | 2339.819 | -42.881 | Stull, 1947 | Coefficents calculated by NIST from author's data. |
Enthalpy of fusion
ΔfusH (kJ/mol) | Temperature (K) | Reference | Comment |
---|---|---|---|
15.270 | 280.5 | O'Rourke and Mraw, 1983 | DH |
15.3 | 280.5 | Domalski and Hearing, 1996 | AC |
Entropy of fusion
ΔfusS (J/mol*K) | Temperature (K) | Reference | Comment |
---|---|---|---|
54.44 | 280.5 | O'Rourke and Mraw, 1983 | DH |

Reaction thermochemistry data

Data compiled by: Hussein Y. Afeefy, Joel F. Liebman, and Stephen E. Stein
Individual Reactions
By formula: 3H2 + C12H10 = C12H16
Quantity | Value | Units | Method | Reference | Comment |
---|---|---|---|---|---|
ΔrH° | -230. | kJ/mol | Eqk | Frye, 1962 | liquid phase |
By formula: 3H2 + C12H16 = C12H22
Quantity | Value | Units | Method | Reference | Comment |
---|---|---|---|---|---|
ΔrH° | -230. | kJ/mol | Eqk | Frye, 1962 | liquid phase |

Gas phase ion energetics data

Data compiled by: Sharon G. Lias, Rhoda D. Levin, and Sherif A. Kafafi
Ionization energy determinations
IE (eV) | Method | Reference |
---|---|---|
8.1 | EI | Mikaya, Zaikin, et al., 1979 |
Appearance energy determinations
Ion | AE (eV) | Other Products | Method | Reference | Comment |
---|---|---|---|---|---|
C8H8+ | 9.99 ± 0.02 | C4H8 | EI | Zaikin, Mikaya, et al., 1981 | |
C8H8+ | 10.8 | C4H8 | EI | Mikaya, Zaikin, et al., 1979 | |
C9H9+ | 11.7 | C3H7 | EI | Mikaya, Zaikin, et al., 1979 |

Kovats' RI, non-polar column, isothermal

Column type | Active phase | Temperature (C) | I | Reference | Comment |
---|---|---|---|---|---|
Capillary | SE-30 | 130. | 1314. | Bredael, 1982 | Column length: 100. m; Column diameter: 0.5 mm |
Packed | SE-30 | 150. | 1326. | Shlyakhov, Anvaer, et al., 1975 | |
Packed | SE-30 | 200. | 1357. | Shlyakhov, Anvaer, et al., 1975 | |
Packed | SE-30 | 130. | 1300. | Antheaume and Guiochon, 1965 | |
Packed | SE-30 | 170. | 1330. | Antheaume and Guiochon, 1965 | |
Packed | SE-30 | 184. | 1345. | Antheaume and Guiochon, 1965 | |
Packed | Methyl Silicone | 130. | 1300. | Antheaume and Guiochon, 1965 |

Kovats' RI, non-polar column, temperature ramp

Column type | Active phase | I | Reference | Comment |
---|---|---|---|---|
Capillary | OV-101 | 1296. | Hayes and Pitzer, 1982 | 110. m/0.25 mm/0.20 μm, He, 1. K/min; Tstart: 35. C; Tend: 200. C |

Van Den Dool and Kratz RI, non-polar column, temperature ramp

Column type | Active phase | I | Reference | Comment |
---|---|---|---|---|
Capillary | DB-5 | 1308.9 | Song, Lai, et al., 2003 | 30. m/0.25 mm/0.25 μm, He, 2. K/min; Tstart: 40. C; Tend: 310. C |
Capillary | DB-5 | 1317.7 | Song, Lai, et al., 2003 | 30. m/0.25 mm/0.25 μm, He, 4. K/min; Tstart: 40. C; Tend: 310. C |
Capillary | DB-5 | 1322.9 | Song, Lai, et al., 2003 | 30. m/0.25 mm/0.25 μm, He, 6. K/min; Tstart: 40. C; Tend: 310. C |
Capillary | DB-5 | 1308.9 | Lai and Song, 1995 | 30. m/0.25 mm/0.25 μm, He, 2. K/min; Tstart: 40. C; Tend: 310. C |
Capillary | DB-5 | 1317.7 | Lai and Song, 1995 | 30. m/0.25 mm/0.25 μm, He, 4. K/min; Tstart: 40. C; Tend: 310. C |
Capillary | DB-5 | 1322.9 | Lai and Song, 1995 | 30. m/0.25 mm/0.25 μm, He, 6. K/min; Tstart: 40. C; Tend: 310. C |
Capillary | DB-1 | 1312. | Peng, Hua, et al., 1992 | 30. m/0.32 mm/1.5 μm, 40. C @ 4. min, 8. K/min; Tend: 280. C |
Capillary | Petrocol DH | 1302. | White, Hackett, et al., 1992 | 100. m/0.25 mm/0.5 μm, He, 1. K/min; Tstart: 30. C; Tend: 220. C |
Capillary | OV-101 | 1296. | Hayes and Pitzer, 1981 | 108. m/0.25 mm/0.2 μm, 1. K/min; Tstart: 35. C; Tend: 200. C |

Van Den Dool and Kratz RI, non-polar column, custom temperature program

Column type | Active phase | I | Reference | Comment |
---|---|---|---|---|
Packed | SE-30 | 1333. | Peng, Ding, et al., 1988 | Supelcoport; Chromosorb; Column length: 3.05 m; Program: 40C(5min) => 10C/min => 200C or 250C (60min) |

Van Den Dool and Kratz RI, polar column, temperature ramp

Column type | Active phase | I | Reference | Comment |
---|---|---|---|---|
Capillary | Supelcowax-10 | 1661. | Chung, Fung, et al., 2005 | 60. m/0.25 mm/0.25 μm, 35. C @ 5. min, 6. K/min, 195. C @ 60. min |
Capillary | DB-Wax | 1643. | Iwaoka, Hagi, et al., 1994 | He, 40. C @ 5. min, 2. K/min; Column length: 30. m; Column diameter: 0.25 mm; Tend: 200. C |

Normal alkane RI, non-polar column, temperature ramp

Column type | Active phase | I | Reference | Comment |
---|---|---|---|---|
Capillary | Petrocol DH | 1302. | Supelco, 2012 | 100. m/0.25 mm/0.50 μm, Helium, 20. C @ 15. min, 15. K/min, 220. C @ 30. min |
Capillary | OV-1 | 1289. | Orav, Kailas, et al., 1999 | 2. K/min; Tstart: 50. C; Tend: 160. C |

Normal alkane RI, polar column, custom temperature program

Column type | Active phase | I | Reference | Comment |
---|---|---|---|---|
Capillary | DB-Wax | 1660. | Peng, Yang, et al., 1991 | Program: not specified |
Capillary | DB-Wax | 1662. | Peng, Yang, et al., 1991 | Program: not specified |

References

Montgomery, Rossini, et al., 1978
Montgomery, R.L.; Rossini, F.D.; Mansson, M.,
Enthalpies of combustion, vaporization, and formation of phenylbenzene, cyclohexylbenzene, and cyclohexylcyclohexane; enthalpy of hydrogenation of certain aromatic systems,
J. Chem. Eng. Data, 1978, 23, 125-129. [all data]
Pedley, Naylor, et al., 1986
Pedley, J.B.; Naylor, R.D.; Kirby, S.P.,
Thermochemical Data of Organic Compounds, Chapman and Hall, New York, 1986, 1-792. [all data]
Good and Lee, 1976
Good, W.D.; Lee, S.H.,
The enthalpies of formation of selected naphthalenes, diphenylmethanes, and bicyclic hydrocarbons,
J. Chem. Thermodyn., 1976, 8, 643-650. [all data]
O'Rourke and Mraw, 1983
O'Rourke, D.F.; Mraw, S.C.,
Heat capacities and enthalpies of fusion of dibenzothiophene (220 to 560 K) and of biphenyl, cyclohexylbenzene, and cyclohexylcyclohexane (220 to 475 K). Enthalpies and temperatures of three transitions in solid cyclohexylcyclohexane,
J. Chem. Thermodynam., 1983, 15, 489-502. [all data]
Aldrich Chemical Company Inc., 1990
Aldrich Chemical Company Inc.,
Catalog Handbook of Fine Chemicals, Aldrich Chemical Company, Inc., Milwaukee WI, 1990, 1. [all data]
Weast and Grasselli, 1989
CRC Handbook of Data on Organic Compounds, 2nd Editon, Weast,R.C and Grasselli, J.G., ed(s)., CRC Press, Inc., Boca Raton, FL, 1989, 1. [all data]
Mears, Stanley, et al., 1963
Mears, T.W.; Stanley, C.L.; Compere, E.L.; Howard, F.L.,
Synthesis, purification, and physical properties of seven twelve-carbon hyd rocarbons,
J. Res. Natl. Bur. Stand., Sect. A, 1963, 67, 475. [all data]
Jessup and Stanley, 1961
Jessup, R.S.; Stanley, C.L.,
Heats and volumes of mixing in several c(12) hydrocarbon systems,
J. Chem. Eng. Data, 1961, 6, 368-71. [all data]
Sohda, Okazaki, et al., 1990
Sohda, M.; Okazaki, M.; Iwai, Y.; Arai, Y.; Sakoguchi, A.; Ueoka, R.; Kato, Y.,
Vapor pressures of cyclohexylbenzene and diphenylmethane,
The Journal of Chemical Thermodynamics, 1990, 22, 6, 607-608, https://doi.org/10.1016/0021-9614(90)90152-G
. [all data]
Stephenson and Malanowski, 1987
Stephenson, Richard M.; Malanowski, Stanislaw,
Handbook of the Thermodynamics of Organic Compounds, 1987, https://doi.org/10.1007/978-94-009-3173-2
. [all data]
Stull, 1947
Stull, Daniel R.,
Vapor Pressure of Pure Substances. Organic and Inorganic Compounds,
Ind. Eng. Chem., 1947, 39, 4, 517-540, https://doi.org/10.1021/ie50448a022
. [all data]
Domalski and Hearing, 1996
Domalski, Eugene S.; Hearing, Elizabeth D.,
Heat Capacities and Entropies of Organic Compounds in the Condensed Phase. Volume III,
J. Phys. Chem. Ref. Data, 1996, 25, 1, 1, https://doi.org/10.1063/1.555985
. [all data]
Frye, 1962
Frye, C.G.,
Equilibria in the hydrogenation of polycyclic aromatics,
J. Chem. Eng. Data, 1962, 7, 592-595. [all data]
Mikaya, Zaikin, et al., 1979
Mikaya, A.I.; Zaikin, V.G.; Finkel'stein, E.S.; Vdovin, V.M.,
Mass-spectrometric investigation of aromatic derivatives of cycloalkanes and cycloalkanols,
Izv. Akad. Nauk SSSR, Ser. Khim., 1979, 10, 2221. [all data]
Zaikin, Mikaya, et al., 1981
Zaikin, V.G.; Mikaya, A.I.; Finkel'shtein, E.Sh.; Vdovin, V.M.; Nametkin, N.S.,
Heats of formation of phenylcycloalkanes,
Dokl. Phys. Chem., 1981, 253, 620. [all data]
Kusakov, et al., 1963
Kusakov, M.M., et al.,
Ultraviolet Absorption Spectra of Aromatic Hydrocarbons, 1963, 103. [all data]
Bredael, 1982
Bredael, P.,
Retention indices of hydrocarbons on SE-30,
J. Hi. Res. Chromatogr. Chromatogr. Comm., 1982, 5, 6, 325-328, https://doi.org/10.1002/jhrc.1240050610
. [all data]
Shlyakhov, Anvaer, et al., 1975
Shlyakhov, A.F.; Anvaer, B.I.; Zolotareva, O.V.; Romina, N.N.; Novikova, N.V.; Koreshkova, R.I.,
On the possibility of group indentification of hydrocarbons by gas chromatography from temperature coefficients of retention indices,
Zh. Anal. Khim., 1975, 30, 788-792. [all data]
Antheaume and Guiochon, 1965
Antheaume, J.; Guiochon, G.,
Application de la chromatographie en phase gazeuse à l'étude de la composition des fractions moyennes d'un brut pétrolier,
Bull. Soc. Chim. Fr., 1965, 2, 298-307. [all data]
Hayes and Pitzer, 1982
Hayes, P.C., Jr.; Pitzer, E.W.,
Characterizing petroleum- and shale-derived jet fuel distillates via temperature-programmed Kováts indices,
J. Chromatogr., 1982, 253, 179-198, https://doi.org/10.1016/S0021-9673(01)88376-X
. [all data]
Song, Lai, et al., 2003
Song, C.; Lai, W.-C.; Madhusudan Reddy, K.; Wei, B.,
Chapter 7. Temperature-programmed retention indices for GC and GC-MS of hydrocarbon fuels and simulated distillation GC of heavy oils
in Analytical advances for hydrocarbon research, Hsu,C.S., ed(s)., Kluwer Academic/Plenum Publishers, New York, 2003, 147-193. [all data]
Lai and Song, 1995
Lai, W.-C.; Song, C.,
Temperature-programmed retention indices for g.c. and g.c.-m.s. analysis of coal- and petroleum-derived liquid fuels,
Fuel, 1995, 74, 10, 1436-1451, https://doi.org/10.1016/0016-2361(95)00108-H
. [all data]
Peng, Hua, et al., 1992
Peng, C.T.; Hua, R.L.; Maltby, D.,
Prediction of retention indexes. IV. Chain branching in alkylbenzene isomers with C10-13 alkyl chains identified in a scintillator solvent,
J. Chromatogr., 1992, 589, 1-2, 231-239, https://doi.org/10.1016/0021-9673(92)80027-R
. [all data]
White, Hackett, et al., 1992
White, C.M.; Hackett, J.; Anderson, R.R.; Kail, S.; Spock, P.S.,
Linear temperature programmed retention indices of gasoline range hydrocarbons and chlorinated hydrocarbons on cross-linked polydimethylsiloxane,
J. Hi. Res. Chromatogr., 1992, 15, 2, 105-120, https://doi.org/10.1002/jhrc.1240150211
. [all data]
Hayes and Pitzer, 1981
Hayes, P.C., Jr.; Pitzer, E.W.,
Kovats indices as a tool in characterizing hydrocarbon fuels in temperature programmed glass capillary gas chromatography. Part 1. Qualitative identification, Inhouse rpt. for Air Force Wright Aeronautical Labs., Air Force Wright Aeronautical Labs., Wright-Patterson AFB, Ohio, 1981, 75. [all data]
Peng, Ding, et al., 1988
Peng, C.T.; Ding, S.F.; Hua, R.L.; Yang, Z.C.,
Prediction of Retention Indexes I. Structure-Retention Index Relationship on Apolar Columns,
J. Chromatogr., 1988, 436, 137-172, https://doi.org/10.1016/S0021-9673(00)94575-8
. [all data]
Chung, Fung, et al., 2005
Chung, H.Y.; Fung, P.K.; Kim, J.-S.,
Aroma impact components in commercial plain sufu,
J. Agric. Food Chem., 2005, 53, 5, 1684-1691, https://doi.org/10.1021/jf048617d
. [all data]
Iwaoka, Hagi, et al., 1994
Iwaoka, W.; Hagi, Y.; Umano, K.; Shibamoto, T.,
Volatile chemicals identified in fresh and cooked breadfruit,
J. Agric. Food Chem., 1994, 42, 4, 975-976, https://doi.org/10.1021/jf00040a026
. [all data]
Supelco, 2012
Supelco, CatalogNo. 24160-U,
Petrocol DH Columns. Catalog No. 24160-U, 2012, retrieved from http://www.sigmaaldrich.com/etc/medialib/docs/Supelco/Datasheet/1/w97949.Par.0001.File.tmp/w97949.pdf. [all data]
Orav, Kailas, et al., 1999
Orav, A.; Kailas, T.; Muurisepp, M.; Kann, J.,
Composition of the oil from waste tires. 2. Fraction boiling at 160-180 0C,
Proc. Estonian Acad. Sci. Chem., 1999, 48, 3, 136-140. [all data]
Peng, Yang, et al., 1991
Peng, C.T.; Yang, Z.C.; Ding, S.F.,
Prediction of rentention idexes. II. Structure-retention index relationship on polar columns,
J. Chromatogr., 1991, 586, 1, 85-112, https://doi.org/10.1016/0021-9673(91)80028-F
. [all data]