Benzene, pentafluoroiodo-
- Formula: C6F5I
- Molecular weight: 293.9607
- IUPAC Standard InChIKey: OPYHNLNYCRZOGY-UHFFFAOYSA-N
- CAS Registry Number: 827-15-6
- Chemical structure:
View 3d structure (requires JavaScript / HTML 5) - Other names: Iodopentafluorobenzene; Pentafluoroiodobenzene; Pentafluorophenyl iodide; Iodoperfluorobenzene; 2,3,4,5,6-Pentafluoroiodobenzene; Perfluoroiodobenzene; 1,2,3,4,5-Pentafluoro-6-iodo-benzene

Gas phase thermochemistry data

Data compiled as indicated in comments:
ALS - Hussein Y. Afeefy, Joel F. Liebman, and Stephen E. Stein
Quantity | Value | Units | Method | Reference | Comment |
---|---|---|---|---|---|
ΔfH°gas | -738.9 | kJ/mol | Semi | Stewart, 2004 | |
ΔfH°gas | -549. ± 13. | kJ/mol | Ccb | Krech, Price, et al., 1974 | Reanalyzed by Pedley, Naylor, et al., 1986, Original value = -557. ± 13. kJ/mol; ALS |

Condensed phase thermochemistry data

Data compiled by: Hussein Y. Afeefy, Joel F. Liebman, and Stephen E. Stein
Quantity | Value | Units | Method | Reference | Comment |
---|---|---|---|---|---|
ΔcH°liquid | -2201. ± 13. | kJ/mol | Ccb | Krech, Price, et al., 1974 | Reanalyzed by Pedley, Naylor, et al., 1986, Original value = -2328.5 kJ/mol |

Phase change data

Data compiled as indicated in comments:
BS - Robert L. Brown and Stephen E. Stein
ALS - Hussein Y. Afeefy, Joel F. Liebman, and Stephen E. Stein
Quantity | Value | Units | Method | Reference | Comment |
---|---|---|---|---|---|
Tboil | 434.2 | K | N/A | Aldrich Chemical Company Inc., 1990 | BS |
Tboil | 439. | K | N/A | PCR Inc., 1990 | BS |
Quantity | Value | Units | Method | Reference | Comment |
ΔvapH° | 57.9 ± 0.2 | kJ/mol | V | Krech, Price, et al., 1974 | ALS |

Gas phase ion energetics data

Data compiled as indicated in comments:
LLK - Sharon G. Lias, Rhoda D. Levin, and Sherif A. Kafafi
RDSH - Henry M. Rosenstock, Keith Draxl, Bruce W. Steiner, and John T. Herron
B - John E. Bartmess
Electron affinity determinations
EA (eV) | Method | Reference | Comment |
---|---|---|---|
1.41 ± 0.11 | IMRE | Dillow and Kebarle, 1989 | ΔGea(423 K) = -35.0±1.0 kcal/mol , assumed entropy = 3.5 eu; B |
Ionization energy determinations
IE (eV) | Method | Reference | Comment |
---|---|---|---|
9.54 | PE | Trudell and Price, 1979 | LLK |
9.5 ± 0.1 | EI | Majer and Patrick, 1962 | RDSH |
9.54 | PE | Trudell and Price, 1979 | Vertical value; LLK |
Appearance energy determinations
Ion | AE (eV) | Other Products | Method | Reference | Comment |
---|---|---|---|---|---|
C6F5+ | 13.21 ± 0.05 | I | EI | Price and Sapiano, 1974 | LLK |

References

Stewart, 2004
Stewart, J.J.P.,
Comparison of the accuracy of semiempirical and some DFT methods for predicting heats of formation,
J. Mol. Model, 2004, 10, 1, 6-10, https://doi.org/10.1007/s00894-003-0157-6
. [all data]
Krech, Price, et al., 1974
Krech, M.J.; Price, S.J.W.; Yared, W.F.,
Determination of ΔHf2980(C6F5I,g) from studies of the combustion of iodopentafluorobenzene in oxygen and calculation of D(C6F5-X) bond dissociation energies,
Can. J. Chem., 1974, 52, 2673-2678. [all data]
Pedley, Naylor, et al., 1986
Pedley, J.B.; Naylor, R.D.; Kirby, S.P.,
Thermochemical Data of Organic Compounds, Chapman and Hall, New York, 1986, 1-792. [all data]
Aldrich Chemical Company Inc., 1990
Aldrich Chemical Company Inc.,
Catalog Handbook of Fine Chemicals, Aldrich Chemical Company, Inc., Milwaukee WI, 1990, 1. [all data]
PCR Inc., 1990
PCR Inc.,
Research Chemicals Catalog 1990-1991, PCR Inc., Gainesville, FL, 1990, 1. [all data]
Dillow and Kebarle, 1989
Dillow, G.W.; Kebarle, P.,
Substituent Effects on the Electron Affinities of Perfluorobenzenes C6F5X,
J. Am. Chem. Soc., 1989, 111, 15, 5592, https://doi.org/10.1021/ja00197a014
. [all data]
Trudell and Price, 1979
Trudell, B.C.; Price, S.J.W.,
The ultraviolet photoelectron spectra of C6F5X compounds, X=(F, Cl, Br, I, H, CH3),
Can. J. Chem., 1979, 57, 2256. [all data]
Majer and Patrick, 1962
Majer, J.R.; Patrick, C.R.,
Electron impact on some halogenated aromatic compounds,
J. Chem. Soc. Faraday Trans., 1962, 58, 17. [all data]
Price and Sapiano, 1974
Price, S.J.W.; Sapiano, H.J.,
C6F5X bond dissociation energies: determination from appearance potential measurements and correlation with thermochemical data,
Can. J. Chem., 1974, 52, 4109. [all data]