5,5-Dimethyl-3-i-butylamino-cyclohex-2-en-1-one
- Formula: C12H21NO
- Molecular weight: 195.3012
- IUPAC Standard InChIKey: TWJANHDHUVWEPJ-UHFFFAOYSA-N
- CAS Registry Number: 82663-49-8
- Chemical structure:
View 3d structure (requires JavaScript / HTML 5) - Permanent link for this species. Use this link for bookmarking this species for future reference.

Gas phase ion energetics data

Data compiled as indicated in comments:
LBLHLM - Sharon G. Lias, John E. Bartmess, Joel F. Liebman, John L. Holmes, Rhoda D. Levin, and W. Gary Mallard
Ionization energy determinations
IE (eV) | Method | Reference | Comment |
---|---|---|---|
7.98 | PE | Pfister-Guillouzo, Geribaldi, et al., 1982 | Vertical value; LBLHLM |

References

Pfister-Guillouzo, Geribaldi, et al., 1982
Pfister-Guillouzo, G.; Geribaldi, S.; Gal, J.-F.,
Spectres photoelectroniques de cyclohexene-2-ones-1 diversement substituees en position 3. Correlations avec la reactivite,
Can. J. Chem., 1982, 60, 1163. [all data]