Benzene, 1-pentenyl-
- Formula: C11H14
- Molecular weight: 146.2289
- IUPAC Standard InChIKey: KHMYONNPZWOTKW-UHFFFAOYSA-N
- CAS Registry Number: 826-18-6
- Chemical structure:
View 3d structure (requires JavaScript / HTML 5) - Stereoisomers:
- Other names: 1-Pentene, 1-phenyl-; 1-Phenyl-1-pentene; 1-Phenylpentene; 1-Pentenylbenzene

Gas phase ion energetics data

Data compiled by: Sharon G. Lias, Rhoda D. Levin, and Sherif A. Kafafi
Ionization energy determinations
IE (eV) | Method | Reference |
---|---|---|
8.4 ± 0.07 | EI | Schwarz, Wesdemiotis, et al., 1975 |

Van Den Dool and Kratz RI, non-polar column, temperature ramp

Data compiled by: NIST Mass Spectrometry Data Center, William E. Wallace, director

Column type Capillary
Active phase SE-54
Column length (m) 25.
Carrier gas He
Substrate
Column diameter (mm) 0.32
Phase thickness (μm) 0.15
Tstart (C) 40.
Tend (C) 280.
Heat rate (K/min) 5.
Initial hold (min) 1.
Final hold (min) 15.
I 1131.4
ReferenceShapi and Hesso, 1990
Comment MSDC-RI

References

Schwarz, Wesdemiotis, et al., 1975
Schwarz, H.; Wesdemiotis, C.; Hess, B.; Levsen, K.,
Massenspektrometrische Untersuchung organischer Stickstoffverbindungen,
Org. Mass Spectrom., 1975, 10, 595. [all data]