Bicyclo[2.2.1]hexa-2,5-diene, 2,3-dicarbonitrile-
- Formula: C9H6N2
- Molecular weight: 142.1573
- IUPAC Standard InChIKey: XKDBHCJBKRLHRJ-UHFFFAOYSA-N
- CAS Registry Number: 825-24-1
- Chemical structure:
View 3d structure (requires JavaScript / HTML 5) - Other names: 2,3-Dicyanobicyclo[2.2.1]hepta-2,5-diene; Norbornadiene-2,3-dicarbonitrile

Gas phase ion energetics data

Data compiled by: Sharon G. Lias, John E. Bartmess, Joel F. Liebman, John L. Holmes, Rhoda D. Levin, and W. Gary Mallard
Ionization energy determinations
IE (eV) | Method | Reference | Comment |
---|---|---|---|
9.3 | PE | Kobayashi, Yoshida, et al., 1987 | |
9.3 | PE | Kobayashi, Yoshida, et al., 1986 | |
9.60 | PE | Kobayashi, Yoshida, et al., 1987 | Vertical value |
9.60 | PE | Kobayashi, Yoshida, et al., 1986 | Vertical value |

Reaction thermochemistry data

Data compiled by: Hussein Y. Afeefy, Joel F. Liebman, and Stephen E. Stein

Individual Reactions

Bicyclo[2.2.1]hexa-2,5-diene, 2,3-dicarbonitrile- = Tetracyclo[3.2.0.02,7.04,6]heptane-1,5-dicarbonitrile

By formula: C9H6N2 = C9H6N2

Quantity Value Units Method Reference Comment
Δr22.3 ± 2.3kcal/molCisoHarel, Adamson, et al., 1987liquid phase; solvent: Acetonitrile; Photocalorimatry

References

Kobayashi, Yoshida, et al., 1987
Kobayashi, T.; Yoshida, Z.; Asako, Y.; Miki, S.; Kato, S.,
Electronic structures of dicyanobicycloalkadienes,
J. Am. Chem. Soc., 1987, 109, 5103. [all data]
Kobayashi, Yoshida, et al., 1986
Kobayashi, T.; Yoshida, Z.; Asako, Y.; Kiki, S.; ato, S.,
Avoided crossing between the ground and first excited 2A' cation states of dicyanobicycloalkadiene series revealed by photoelectron spectroscopy,
Chem. Phys. Lett., 1986, 125, 586. [all data]