Benzene, 1-(chloromethyl)-4-methoxy-
- Formula: C8H9ClO
- Molecular weight: 156.609
- IUPAC Standard InChIKey: MOHYOXXOKFQHDC-UHFFFAOYSA-N
- CAS Registry Number: 824-94-2
- Chemical structure:
View 3d structure (requires JavaScript / HTML 5) - Other names: Anisole, p-(chloromethyl)-; α-Chloro-4-methoxytoluene; p-(Chloromethyl)anisole; p-Anisyl chloride; p-Methoxybenzyl chloride; 1-(Chloromethyl)-4-methoxybenzene; 4-Methoxybenzyl chloride

Phase change data

Data compiled by: Robert L. Brown and Stephen E. Stein
Reduced pressure boiling point
Tboil (K) | Pressure (bar) | Reference |
---|---|---|
390.7 | 0.019 | Aldrich Chemical Company Inc., 1990 |

Gas phase ion energetics data

Data compiled by: Henry M. Rosenstock, Keith Draxl, Bruce W. Steiner, and John T. Herron
Appearance energy determinations
Ion | AE (eV) | Other Products | Method | Reference | Comment |
---|---|---|---|---|---|
C8H9O+ | 8.7 ± 0.1 | Cl | EI | Tait, Shannon, et al., 1962 |

References

Aldrich Chemical Company Inc., 1990
Aldrich Chemical Company Inc.,
Catalog Handbook of Fine Chemicals, Aldrich Chemical Company, Inc., Milwaukee WI, 1990, 1. [all data]
Tait, Shannon, et al., 1962
Tait, J.M.S.; Shannon, T.W.; Harrison, A.G.,
The structure of substituted C7 ions from benzyl derivatives at the appearance potential threshold,
J. Am. Chem. Soc., 1962, 84, 4. [all data]