Bicyclo(3.2.1)oct-2-ene
- Formula: C8H12
- Molecular weight: 108.1809
- IUPAC Standard InChIKey: YEHSTKKZWWSIMD-UHFFFAOYSA-N
- CAS Registry Number: 823-02-9
- Chemical structure:
View 3d structure (requires JavaScript / HTML 5) - Other names: Bicyclo(3.2.1)-2-octene

Reaction thermochemistry data

Data compiled as indicated in comments:
B - John E. Bartmess
ALS - Hussein Y. Afeefy, Joel F. Liebman, and Stephen E. Stein
Individual Reactions
C8H11- + =
By formula: C8H11- + H+ = C8H12
Quantity | Value | Units | Method | Reference | Comment |
---|---|---|---|---|---|
ΔrH° | 1634.4 ± 3.6 | kJ/mol | G+TS | Lee and Squires, 1986 | gas phase; B |
Quantity | Value | Units | Method | Reference | Comment |
ΔrG° | 1603.7 ± 2.5 | kJ/mol | IMRE | Lee and Squires, 1986 | gas phase; B |
By formula: H2 + C8H12 = C8H14
Quantity | Value | Units | Method | Reference | Comment |
---|---|---|---|---|---|
ΔrH° | -112.3 ± 0.46 | kJ/mol | Chyd | Turner, Jarrett, et al., 1973 | liquid phase; solvent: Acetic acid; ALS |

Gas phase ion energetics data

Data compiled as indicated in comments:
B - John E. Bartmess
RDSH - Henry M. Rosenstock, Keith Draxl, Bruce W. Steiner, and John T. Herron
Ionization energy determinations
IE (eV) | Method | Reference | Comment |
---|---|---|---|
8.76 ± 0.02 | PI | Demeo and El-Sayed, 1970 | RDSH |
De-protonation reactions
C8H11- + =
By formula: C8H11- + H+ = C8H12
Quantity | Value | Units | Method | Reference | Comment |
---|---|---|---|---|---|
ΔrH° | 1634.4 ± 3.6 | kJ/mol | G+TS | Lee and Squires, 1986 | gas phase; B |
Quantity | Value | Units | Method | Reference | Comment |
ΔrG° | 1603.7 ± 2.5 | kJ/mol | IMRE | Lee and Squires, 1986 | gas phase; B |

References

Lee and Squires, 1986
Lee, R.E.; Squires, R.R.,
Anionic homoaromaticity: A gas phase experimental study,
J. Am. Chem. Soc., 1986, 105, 5078. [all data]
Turner, Jarrett, et al., 1973
Turner, R.B.; Jarrett, A.D.; Goebel, P.; Mallon, B.J.,
Heats of hydrogenation. 9. Cyclic acetylenes and some miscellaneous olefins,
J. Am. Chem. Soc., 1973, 95, 790-792. [all data]
Demeo and El-Sayed, 1970
Demeo, D.A.; El-Sayed, M.A.,
Ionization potential and structure of olefins,
J. Chem. Phys., 1970, 52, 2622. [all data]