2-Cyclohexen-1-ol
- Formula: C6H10O
- Molecular weight: 98.1430
- IUPAC Standard InChIKey: PQANGXXSEABURG-UHFFFAOYSA-N
- CAS Registry Number: 822-67-3
- Chemical structure:
View 3d structure (requires JavaScript / HTML 5) - Other names: Cyclohexen-3-ol; 1-Cyclohexen-3-ol; 2-Cyclohexenol; 3-Hydroxycyclohexene; 2-Cyclohexene-1-ol; cyclohex-2-ene-1-ol

Phase change data

Data compiled by: Robert L. Brown and Stephen E. Stein
Quantity | Value | Units | Method | Reference | Comment |
---|---|---|---|---|---|
Tboil | 437.2 | K | N/A | Weast and Grasselli, 1989 |

Gas phase ion energetics data

Data compiled by: Sharon G. Lias, John E. Bartmess, Joel F. Liebman, John L. Holmes, Rhoda D. Levin, and W. Gary Mallard
Appearance energy determinations
Ion | AE (eV) | Other Products | Method | Reference | Comment |
---|---|---|---|---|---|
C5H7O+ | 9.74 | CH3 | EI | Alai, Attardo, et al., 1985 |

Van Den Dool and Kratz RI, non-polar column, temperature ramp

Column type | Active phase | I | Reference | Comment |
---|---|---|---|---|
Packed | SE-30 | 887. | Buchman, Cao, et al., 1984 | He, Chromosorb AW, 40. C @ 10. min, 10. K/min, 210. C @ 30. min; Column length: 3.05 m |

Van Den Dool and Kratz RI, non-polar column, custom temperature program

Column type | Active phase | I | Reference | Comment |
---|---|---|---|---|
Capillary | Methyl Silicone | 887. | Peng, Yang, et al., 1991 | Program: not specified |

Van Den Dool and Kratz RI, polar column, temperature ramp

Column type | Active phase | I | Reference | Comment |
---|---|---|---|---|
Capillary | Supelcowax-10 | 1427. | Chung, Fung, et al., 2005 | 60. m/0.25 mm/0.25 μm, 35. C @ 5. min, 6. K/min, 195. C @ 60. min |
Capillary | Supelcowax-10 | 1471. | Chung, Yung, et al., 2002 | 60. m/0.25 mm/0.25 μm, He, 35. C @ 5. min, 2. K/min, 195. C @ 90. min |
Capillary | Supelcowax-10 | 1471. | Chung, Yung, et al., 2001 | 60. m/0.25 mm/0.25 μm, He, 35. C @ 5. min, 2. K/min, 195. C @ 90. min |
Capillary | Supelcowax-10 | 1473. | Chung, 1999 | 60. m/0.25 mm/0.25 μm, He, 35. C @ 5. min, 2. K/min, 195. C @ 90. min |
Capillary | DB-Wax | 1466. | Iwaoka, Hagi, et al., 1994 | He, 40. C @ 5. min, 2. K/min; Column length: 30. m; Column diameter: 0.25 mm; Tend: 200. C |
Packed | Carbowax 20M | 1481. | Buchman, Cao, et al., 1984 | He, Supelcoport, 40. C @ 10. min, 10. K/min, 210. C @ 30. min; Column length: 3.05 m |

Normal alkane RI, non-polar column, temperature ramp

Column type | Active phase | I | Reference | Comment |
---|---|---|---|---|
Capillary | HP-5 MS | 883. | Kim and Chung, 2009 | 30. m/0.25 mm/0.25 μm, Helium, 35. C @ 5. min, 2. K/min, 195. C @ 30. min |
Packed | SE-30 | 880. | Peng, Ding, et al., 1988 | Helium, Supelcoport, 40. C @ 4. min, 10. K/min, 200. C @ 60. min; Column length: 3.05 m |
Packed | SE-30 | 890. | Peng, Ding, et al., 1988 | Helium, Supelcoport, 40. C @ 4. min, 10. K/min, 200. C @ 60. min; Column length: 3.05 m |

Normal alkane RI, non-polar column, custom temperature program

Column type | Active phase | I | Reference | Comment |
---|---|---|---|---|
Capillary | VF-5 | 890. | Shivashankar, Roy, et al., 2012 | 30. m/0.25 mm/0.25 μm, Helium; Program: 50 0C (2 min) 3 0C/min -> 200 0C (3 min) 10 0C/min -> 220 0C (8 min) |
Capillary | VF-5 | 887. | Shivashankar, Roy, et al., 2012 | 30. m/0.25 mm/0.25 μm, Helium; Program: not specified |
Capillary | OV-1, SE-30, Methyl silicone, SP-2100, OV-101, DB-1, etc. | 887. | Waggott and Davies, 1984 | Hydrogen; Column length: 50. m; Column diameter: 0.32 mm; Program: not specified |

Normal alkane RI, polar column, custom temperature program

Column type | Active phase | I | Reference | Comment |
---|---|---|---|---|
Capillary | DB-Wax | 1479. | Peng, Yang, et al., 1991, 2 | Program: not specified |
Capillary | Carbowax 400, Carbowax 20M, Carbowax 1540, Carbowax 4000, Superox 06, PEG 20M, etc. | 1481. | Waggott and Davies, 1984 | Hydrogen; Column length: 50. m; Column diameter: 0.32 mm; Program: not specified |

References

Weast and Grasselli, 1989
CRC Handbook of Data on Organic Compounds, 2nd Editon, Weast,R.C and Grasselli, J.G., ed(s)., CRC Press, Inc., Boca Raton, FL, 1989, 1. [all data]
Alai, Attardo, et al., 1985
Alai, M.; Attardo, G.G.; Rye, R.T.B.,
Formation threshold structures of some [C5H7O]+ ions: Use of general schemes for estimation of heats of formation of gas phase ions,
Can. J. Chem., 1985, 63, 833. [all data]
Buchman, Cao, et al., 1984
Buchman, O.; Cao, G.-Y.; Peng, C.T.,
Structure assignment by retention index in gas-liquid radiochromatography of substituted cyclohexenes,
J. Chromatogr., 1984, 312, 75-90, https://doi.org/10.1016/S0021-9673(01)92765-7
. [all data]
Peng, Yang, et al., 1991
Peng, C.T.; Yang, Z.C.; Maltby, D.,
Prediction of retention indexes. III. Silylated derivatives of polar compounds,
J. Chromatogr., 1991, 586, 1, 113-129, https://doi.org/10.1016/0021-9673(91)80029-G
. [all data]
Chung, Fung, et al., 2005
Chung, H.Y.; Fung, P.K.; Kim, J.-S.,
Aroma impact components in commercial plain sufu,
J. Agric. Food Chem., 2005, 53, 5, 1684-1691, https://doi.org/10.1021/jf048617d
. [all data]
Chung, Yung, et al., 2002
Chung, H.-Y.; Yung, I.K.S.; Ma, W.C.J.; Kim, J.-S.,
Analysis of volatile components in frozen and dried scallops (Patinopecten yessoensis) by gas chromatography/mass spectrometry,
Food Res. Int., 2002, 35, 1, 43-53, https://doi.org/10.1016/S0963-9969(01)00107-7
. [all data]
Chung, Yung, et al., 2001
Chung, H.Y.; Yung, I.K.S.; Kim, J.-S.,
Comparison of volatile components in dried scallops (Chlamys farreri and Patinopecten yessoensis) prepared by boiling and steaming methods,
J. Agric. Food Chem., 2001, 49, 1, 192-202, https://doi.org/10.1021/jf000692a
. [all data]
Chung, 1999
Chung, H.Y.,
Volatile components in crabmeats of Charybdis feriatus,
J. Agric. Food Chem., 1999, 47, 6, 2280-2287, https://doi.org/10.1021/jf981027t
. [all data]
Iwaoka, Hagi, et al., 1994
Iwaoka, W.; Hagi, Y.; Umano, K.; Shibamoto, T.,
Volatile chemicals identified in fresh and cooked breadfruit,
J. Agric. Food Chem., 1994, 42, 4, 975-976, https://doi.org/10.1021/jf00040a026
. [all data]
Kim and Chung, 2009
Kim, J.-S.; Chung, H.Y.,
GC-MS analysis of the volatile components in dried boxthorn (Lycium chimensis) Fruit,
J. Korean Soc. Appl. Biol. Chem., 2009, 52, 5, 516-524, https://doi.org/10.3839/jksabc.2009.088
. [all data]
Peng, Ding, et al., 1988
Peng, C.T.; Ding, S.F.; Hua, R.L.,
Radioimpurity identification by retention index in tritium labeling,
J. Radioanal. Nucl. Chem., 1988, 123, 2, 411-420, https://doi.org/10.1007/BF02034907
. [all data]
Shivashankar, Roy, et al., 2012
Shivashankar, S.; Roy, T.K.; Moorthy, P.N.R.,
Headspace solid phase micro extraction and GC/MS analysis of the volatile components in seed and cake of Azadirachta indica A. juss,
Chem. Bull. of Politechnika Univ. Timisoara, Romania, 2012, 57(71), 1, 1-6. [all data]
Waggott and Davies, 1984
Waggott, A.; Davies, I.W.,
Identification of organic pollutants using linear temperature programmed retention indices (LTPRIs) - Part II, 1984, retrieved from http://dwi.defra.gov.uk/research/completed-research/reports/dwi0383.pdf. [all data]
Peng, Yang, et al., 1991, 2
Peng, C.T.; Yang, Z.C.; Ding, S.F.,
Prediction of rentention idexes. II. Structure-retention index relationship on polar columns,
J. Chromatogr., 1991, 586, 1, 85-112, https://doi.org/10.1016/0021-9673(91)80028-F
. [all data]