1,3-Dithiolane-2-thione
- Formula: C3H4S3
- Molecular weight: 136.259
- IUPAC Standard InChIKey: XCWPBWWTGHQKDR-UHFFFAOYSA-N
- CAS Registry Number: 822-38-8
- Chemical structure:
View 3d structure (requires JavaScript / HTML 5) - Other names: Carbonic acid, trithio-, cyclic ethylene ester; Cyclic ethylene trithiocarbonate; Ethylene trithiocarbonate; Trithiocarbonic acid, cyclic ethylene ester; 1,3-Dithiolan-2-thione; 1,3-Dithiacyclopentane-2-thione; Cylic ethylene trithiocarbonate

Gas phase thermochemistry data

Data compiled by: Hussein Y. Afeefy, Joel F. Liebman, and Stephen E. Stein
Quantity | Value | Units | Method | Reference | Comment |
---|---|---|---|---|---|
ΔfH°gas | 93.8 ± 2.0 | kJ/mol | Ccr | Geiseler, Schaffernicht, et al., 1967 | Reanalyzed by Cox and Pilcher, 1970, Original value = 94.27 kJ/mol |
Quantity | Value | Units | Method | Reference | Comment |
ΔcH°gas | -3571. ± 2. | kJ/mol | Ccr | Geiseler, Schaffernicht, et al., 1967 |

Phase change data

Data compiled as indicated in comments:
AC - William E. Acree, Jr., James S. Chickos
ALS - Hussein Y. Afeefy, Joel F. Liebman, and Stephen E. Stein
Quantity | Value | Units | Method | Reference | Comment |
---|---|---|---|---|---|
ΔvapH° | 82.9 | kJ/mol | N/A | Dykyj, Svoboda, et al., 1999 | Based on data from 294. to 303. K.; AC |
ΔvapH° | 81.8 ± 0.8 | kJ/mol | V | Geiseler, Schaffernicht, et al., 1967 | ALS |
Quantity | Value | Units | Method | Reference | Comment |
ΔsubH° | 81.8 ± 0.8 | kJ/mol | N/A | Geiseler, Schaffernicht, et al., 1967 | Based on data from 294. to 303. K. See also Cox and Pilcher, 1970, 2.; AC |

Gas phase ion energetics data

Data compiled as indicated in comments:
LLK - Sharon G. Lias, Rhoda D. Levin, and Sherif A. Kafafi
Ionization energy determinations
IE (eV) | Method | Reference | Comment |
---|---|---|---|
8.40 | PE | Guimon and Pfister-Guillouzo, 1975 | Vertical value; LLK |
8.40 | PE | Guimon, Gonbeau, et al., 1974 | Vertical value; LLK |

References

Geiseler, Schaffernicht, et al., 1967
Geiseler, V.G.; Schaffernicht, H.; Walther, H.J.,
Bildungsenthalpien und Mesomerieenergien von π-Bindungssystemen,
Ber. Bunsen-Ges. Phys. Chem., 1967, 71, 196-199. [all data]
Cox and Pilcher, 1970
Cox, J.D.; Pilcher, G.,
Thermochemistry of Organic and Organometallic Compounds, Academic Press, New York, 1970, 1-636. [all data]
Dykyj, Svoboda, et al., 1999
Dykyj, J.; Svoboda, J.; Wilhoit, R.C.; Frenkel, M.L.; Hall, K.R.,
Vapor Pressure of Chemicals: Part A. Vapor Pressure and Antoine Constants for Hydrocarbons and Sulfur, Selenium, Tellurium and Hydrogen Containing Organic Compounds, Springer, Berlin, 1999, 373. [all data]
Cox and Pilcher, 1970, 2
Cox, J.D.; Pilcher, G.,
Thermochemistry of Organic and Organometallic Compounds, Academic Press Inc., London, 1970, 643. [all data]
Guimon and Pfister-Guillouzo, 1975
Guimon, C.; Pfister-Guillouzo, G.,
Electronic structure of sulfur compounds XVI. Photoelectron spectra of ethylene trithiocarbonate ethylene dithiocarbonate,
J. Electron Spectrosc. Relat. Phenom., 1975, 7, 191. [all data]
Guimon, Gonbeau, et al., 1974
Guimon, C.; Gonbeau, D.; Pfister-Guillouzo, G.; Asbrink, L.; Sandstrom, J.,
Electronic structure of sulphur compounds. VI. Photoelectron spectra of some simple thiocarbonyl compounds,
J. Electron Spectrosc. Relat. Phenom., 1974, 4, 49. [all data]