Diethyldiazene

Gas phase ion energetics data

Data compiled as indicated in comments:
LLK - Sharon G. Lias, Rhoda D. Levin, and Sherif A. Kafafi
RDSH - Henry M. Rosenstock, Keith Draxl, Bruce W. Steiner, and John T. Herron

Ionization energy determinations

IE (eV) Method Reference Comment
8.7 ± 0.1EITan and Lampe, 1972LLK

Appearance energy determinations

Ion AE (eV) Other Products MethodReferenceComment
C2H5+10.5 ± 0.2?EIGowenlock, Majer, et al., 1962RDSH

References

Tan and Lampe, 1972
Tan, H.-S.; Lampe, F.W., The reaction of ethyl radicals with nitric oxide. Nitrosoethane triethylhydroxylamine formation, J. Phys. Chem., 1972, 76, 3303. [all data]

Gowenlock, Majer, et al., 1962
Gowenlock, B.G.; Majer, J.R.; Snelling, D.R., Bond dissociation energies in some azo compounds, J. Chem. Soc. Faraday Trans., 1962, 58, 670. [all data]