1,5-Hexadien-3-yne
- Formula: C6H6
- Molecular weight: 78.1118
- IUPAC Standard InChIKey: AUBDSFLQOBEOPX-UHFFFAOYSA-N
- CAS Registry Number: 821-08-9
- Chemical structure:
View 3d structure (requires JavaScript / HTML 5) - Other names: Divinylacetylene; CH2=CHC≡CCH=CH2; 1,5-Hexadiene-3-yne

Phase change data

Data compiled as indicated in comments:
TRC - Thermodynamics Research Center, NIST Boulder Laboratories, Chris Muzny director
AC - William E. Acree, Jr., James S. Chickos
Quantity | Value | Units | Method | Reference | Comment |
---|---|---|---|---|---|
Tboil | 357.9 | K | N/A | Lespieau and Guillemonat, 1932 | Uncertainty assigned by TRC = 1.5 K; TRC |
Enthalpy of vaporization
ΔvapH (kJ/mol) | Temperature (K) | Method | Reference | Comment |
---|---|---|---|---|
40.4 | 238. | A | Stephenson and Malanowski, 1987 | Based on data from 223. to 357. K.; AC |
Antoine Equation Parameters
log10(P) = A − (B / (T + C))
P = vapor pressure (bar)
T = temperature (K)
View plot Requires a JavaScript / HTML 5 canvas capable browser.
Temperature (K) | A | B | C | Reference | Comment |
---|---|---|---|---|---|
228.1 to 357. | 4.25065 | 1357.643 | -37.484 | Stull, 1947 | Coefficents calculated by NIST from author's data. |

Gas phase ion energetics data

Data compiled as indicated in comments:
LLK - Sharon G. Lias, Rhoda D. Levin, and Sherif A. Kafafi
RDSH - Henry M. Rosenstock, Keith Draxl, Bruce W. Steiner, and John T. Herron
Ionization energy determinations
IE (eV) | Method | Reference | Comment |
---|---|---|---|
8.50 ± 0.02 | PE | Bieri, Burger, et al., 1977 | LLK |
8.50 ± 0.02 | PE | Brogli, Heilbronner, et al., 1975 | LLK |
~10.5 | S | Price, 1946 | RDSH |

Normal alkane RI, non-polar column, custom temperature program

Column type | Active phase | I | Reference | Comment |
---|---|---|---|---|
Capillary | Methyl Silicone | 679. | Zenkevich, 1998 | Program: not specified |

References

Lespieau and Guillemonat, 1932
Lespieau, R.; Guillemonat, A.,
C. R. Hebd. Seances Acad. Sci., 1932, 195, 245. [all data]
Stephenson and Malanowski, 1987
Stephenson, Richard M.; Malanowski, Stanislaw,
Handbook of the Thermodynamics of Organic Compounds, 1987, https://doi.org/10.1007/978-94-009-3173-2
. [all data]
Stull, 1947
Stull, Daniel R.,
Vapor Pressure of Pure Substances. Organic and Inorganic Compounds,
Ind. Eng. Chem., 1947, 39, 4, 517-540, https://doi.org/10.1021/ie50448a022
. [all data]
Bieri, Burger, et al., 1977
Bieri, G.; Burger, F.; Heilbronner, E.; Maier, J.P.,
Valence ionization enrgies of hydrocarbons,
Helv. Chim. Acta, 1977, 60, 2213. [all data]
Brogli, Heilbronner, et al., 1975
Brogli, F.; Heilbronner, E.; Wirz, J.; Kloster-Jensen, E.; Bergman, R.G.; Vollhardt, K.P.C.; Ashe, A.J., III,
The consequences of σ and π conjugative interactions in mono-, di- and triacetylenes. A photoelectron spectroscopic investigation,
Helv. Chim. Acta, 1975, 58, 2620. [all data]
Price, 1946
Price, W.C.,
The absorption spectra of hexatriene and divinyl acetylene in the vacuum ultraviolet,
Proc. Roy. Soc. (London) Al, 1946, 85, 182. [all data]
Fihtengolts, et al., 1969
Fihtengolts, V.S., et al.,
Atlas of UV Absorption Spectra of Substances Used in Synhetic Rubber Manufacture, 1969, 171. [all data]
Zenkevich, 1998
Zenkevich, I.G.,
Non-Traditional Criteria for Gas-Chromatographic and Chromato-Mass-Spectrometric Identification of Organic Compounds,
Zh. Anal. Khim., 1998, 53, 8, 828-835. [all data]