1,3,5-Hexatriene, (E)-
- Formula: C6H8
- Molecular weight: 80.1277
- IUPAC Standard InChIKey: AFVDZBIIBXWASR-AATRIKPKSA-N
- CAS Registry Number: 821-07-8
- Chemical structure:
View 3d structure (requires JavaScript / HTML 5) - Stereoisomers:
- Other names: (E)-1,3,5-Hexatriene; trans-Hexatriene; trans-1,3,5-Hexatriene; 1,3,5-Hexatriene, trans-; (E)-CH2=CHCH=CHCH=CH2

Gas phase thermochemistry data

Data compiled as indicated in comments:
ALS - Hussein Y. Afeefy, Joel F. Liebman, and Stephen E. Stein
GT - Glushko Thermocenter, Russian Academy of Sciences, Moscow
Quantity | Value | Units | Method | Reference | Comment |
---|---|---|---|---|---|
ΔfH°gas | 168. ± 3. | kJ/mol | Chyd | Fang and Rogers, 1992 | ALS |
Constant pressure heat capacity of gas
Cp,gas (J/mol*K) | Temperature (K) | Reference | Comment |
---|---|---|---|
41.02 | 50. | Thermodynamics Research Center, 1997 | GT |
55.50 | 100. | ||
68.21 | 150. | ||
81.32 | 200. | ||
102.87 | 273.15 | ||
110.62 | 298.15 | ||
111.19 | 300. | ||
141.33 | 400. | ||
167.54 | 500. | ||
189.25 | 600. | ||
207.28 | 700. | ||
222.46 | 800. | ||
235.38 | 900. | ||
246.46 | 1000. | ||
256.00 | 1100. | ||
264.24 | 1200. | ||
271.37 | 1300. | ||
277.56 | 1400. | ||
282.94 | 1500. |

Condensed phase thermochemistry data

Data compiled by: Hussein Y. Afeefy, Joel F. Liebman, and Stephen E. Stein
Quantity | Value | Units | Method | Reference | Comment |
---|---|---|---|---|---|
ΔcH°liquid | -3630. ± 10. | kJ/mol | Ccb | Kreysig, Friebe, et al., 1968 | Benzene as standard substance; Corresponding ΔfHºliquid = 123.1 kJ/mol (simple calculation by NIST; no Washburn corrections) |

Phase change data

Data compiled as indicated in comments:
TRC - Thermodynamics Research Center, NIST Boulder Laboratories, Chris Muzny director
ALS - Hussein Y. Afeefy, Joel F. Liebman, and Stephen E. Stein
Quantity | Value | Units | Method | Reference | Comment |
---|---|---|---|---|---|
Tboil | 353.4 | K | N/A | Hwa, De Benneville, et al., 1960 | Uncertainty assigned by TRC = 2. K; TRC |
Quantity | Value | Units | Method | Reference | Comment |
ΔvapH° | 20.5 | kJ/mol | V | Kreysig, Friebe, et al., 1968 | Benzene as standard substance; ALS |

Reaction thermochemistry data

Data compiled by: Hussein Y. Afeefy, Joel F. Liebman, and Stephen E. Stein
Individual Reactions
By formula: 3H2 + C6H8 = C6H14
Quantity | Value | Units | Method | Reference | Comment |
---|---|---|---|---|---|
ΔrH° | -335. ± 3. | kJ/mol | Chyd | Fang and Rogers, 1992 | liquid phase; solvent: Cyclohexane |
ΔrH° | -332.3 ± 0.92 | kJ/mol | Chyd | Turner, Mallon, et al., 1973 | liquid phase; solvent: Glacial acetic acid |

Gas phase ion energetics data

Data compiled as indicated in comments:
LLK - Sharon G. Lias, Rhoda D. Levin, and Sherif A. Kafafi
LBLHLM - Sharon G. Lias, John E. Bartmess, Joel F. Liebman, John L. Holmes, Rhoda D. Levin, and W. Gary Mallard
RDSH - Henry M. Rosenstock, Keith Draxl, Bruce W. Steiner, and John T. Herron
Ionization energy determinations
IE (eV) | Method | Reference | Comment |
---|---|---|---|
8.30 ± 0.02 | PE | Allan, Dannacher, et al., 1980 | LLK |
8.29 ± 0.02 | PE | Bieri, Burger, et al., 1977 | LLK |
8.27 | S | Gavin and Rice, 1974 | LLK |
8.29 | PE | Beez, Bieri, et al., 1973 | LLK |
Appearance energy determinations
Ion | AE (eV) | Other Products | Method | Reference | Comment |
---|---|---|---|---|---|
C3H3+ | 14.65 ± 0.10 | C2H2+CH3? | EI | Franklin and Carroll, 1969 | RDSH |
C6H7+ | 9.95 | H | PIPECO | Lias and Ausloos, 1985 | LBLHLM |

References

Fang and Rogers, 1992
Fang, W.; Rogers, D.W.,
Enthalpy of hydrogenation of the hexadienes and cis- and trans-1,3,5-hexatriene,
J. Org. Chem., 1992, 57, 2294-2297. [all data]
Thermodynamics Research Center, 1997
Thermodynamics Research Center,
Selected Values of Properties of Chemical Compounds., Thermodynamics Research Center, Texas A&M University, College Station, Texas, 1997. [all data]
Kreysig, Friebe, et al., 1968
Kreysig, V.D.; Friebe, R.; Aparowsky, H.; Schirmer, J.,
Verbrennungsenthalpie und diamagnetische Suszeptibilitat von n-trans-Hexatrien-1,3,5,
J. Prakt. Chem., 1968, 37, 329-336. [all data]
Hwa, De Benneville, et al., 1960
Hwa, J.C.H.; De Benneville, P.L.; Sims, H.J.,
A New Preparation of 1,3,5-Hexatriene and the Separation of Its Geometrical Isomers,
J. Am. Chem. Soc., 1960, 82, 2537-40. [all data]
Turner, Mallon, et al., 1973
Turner, R.B.; Mallon, B.J.; Tichy, M.; Doering, W.v.E.; Roth, W.R.; Schroder, G.,
Heats of hydrogenation. X. Conjugative interaction in cyclic dienes and trienes,
J. Am. Chem. Soc., 1973, 95, 8605-8610. [all data]
Allan, Dannacher, et al., 1980
Allan, M.; Dannacher, J.; Maier, J.P.,
Radiative and fragmentation decay of the cations of trans- and cis 1,3,5-hexatriene of all trans-1,3,5-heptatriene in the A(π-1) states, studied by emission photoelectron-photoion coincidence spectroscopy,
J. Chem. Phys., 1980, 73, 3114. [all data]
Bieri, Burger, et al., 1977
Bieri, G.; Burger, F.; Heilbronner, E.; Maier, J.P.,
Valence ionization enrgies of hydrocarbons,
Helv. Chim. Acta, 1977, 60, 2213. [all data]
Gavin and Rice, 1974
Gavin, R.M., Jr.; Rice, S.A.,
Spectroscopic properties of polyenes. II. The vacuum ultraviolet spectra of cis- and trans-1,3,5-hexatriene,
J. Chem. Phys., 1974, 60, 3231. [all data]
Beez, Bieri, et al., 1973
Beez, M.; Bieri, G.; Bock, H.; Heilbronner, E.,
The ionization potentials of butadiene, hexatriene, andtheir methyl derivatives: evidence for through space interaction between double bond π-orbitals and non-bonded pseudo-π orbitals of methyl groups?,
Helv. Chim. Acta, 1973, 56, 1028. [all data]
Franklin and Carroll, 1969
Franklin, J.L.; Carroll, S.R.,
Effect of molecular structure on ionic decomposition. II. An electron-impact study of 1,3-and 1,4-cyclohexadiene and 1,3,5-hexatriene,
J. Am. Chem. Soc., 1969, 91, 6564. [all data]
Lias and Ausloos, 1985
Lias, S.G.; Ausloos, P.,
Structures of C6H7+ ions formed in unimolecular and bimolecular reactions,
J. Chem. Phys., 1985, 82, 3613. [all data]