3-Bromobenzanthrone
- Formula: C17H9BrO
- Molecular weight: 309.157
- IUPAC Standard InChIKey: WVECFEIAZAKUNF-UHFFFAOYSA-N
- CAS Registry Number: 81-96-9
- Chemical structure:
View 3d structure (requires JavaScript / HTML 5) - Other names: 7H-Benz[de]anthracen-7-one, 3-bromo-; Benzanthrone, 3-bromo-; 3-Bromobenz[de]anthrone; 7-Bromomesobenzanthrone; 3-Brombenzanthrone; 3-Bromo-7H-benz(de)anthracen-7-one; 7H-Benz[de]anthracene-7-one, 3-bromo-; 3-Bromo-7H-benzo[de]anthracen-7-one; NSC 13976; 3-bromobenz[de]anthracen-7-one

Phase change data

Data compiled by: Thermodynamics Research Center, NIST Boulder Laboratories, Chris Muzny director
Quantity | Value | Units | Method | Reference | Comment |
---|---|---|---|---|---|
Tfus | 445.65 | K | N/A | Witschonke, 1954 | Metastable crystal phase; Uncertainty assigned by TRC = 0.5 K |
Tfus | 446.35 | K | N/A | Witschonke, 1954 | Metastable crystal phase; Uncertainty assigned by TRC = 0.3 K |
Tfus | 449.75 | K | N/A | Witschonke, 1954 | Crystal phase 1 phase; Uncertainty assigned by TRC = 0.35 K |
Tfus | 450.45 | K | N/A | Witschonke, 1954 | Crystal phase 1 phase; Uncertainty assigned by TRC = 0.25 K |

Gas phase ion energetics data

Data compiled by: Sharon G. Lias and Joel F. Liebman
Ionization energy determinations
IE (eV) | Method | Reference |
---|---|---|
8.5 | EI | Abliz, Ueda, et al., 1990 |
Appearance energy determinations
Ion | AE (eV) | Other Products | Method | Reference | Comment |
---|---|---|---|---|---|
C16H8+ | 20.0 | CO+HBr | EI | Abliz, Ueda, et al., 1990 | |
C16H9+ | 16.5 | CO+Br | EI | Abliz, Ueda, et al., 1990 | |
C16H9Br+ | 14.5 | CO | EI | Abliz, Ueda, et al., 1990 | |
C17H9O+ | 15.0 | Br | EI | Abliz, Ueda, et al., 1990 |

References

Witschonke, 1954
Witschonke, C.R.,
Freezing point and purity data for some organic compounds,
Anal. Chem., 1954, 26, 562-4. [all data]
Abliz, Ueda, et al., 1990
Abliz, Z.; Ueda, T.; Kubogata, K.; Iwashima, S.; Takekawa, M.; Aoki, J.; Kan, T.,
Mechanism of ionization and initial fragmentation in electron impact mass spectra of 3-halogenobenzanthrones,
Org. Mass Spectrom., 1990, 25, 345. [all data]