Allyl fluoride
- Formula: C3H5F
- Molecular weight: 60.0702
- IUPAC Standard InChIKey: QCMKXHXKNIOBBC-UHFFFAOYSA-N
- CAS Registry Number: 818-92-8
- Chemical structure:
View 3d structure (requires JavaScript / HTML 5) - Other names: 1-Propene, 3-fluoro-; Propene, 3-fluoro-; 1-Fluoro-2-propene; 3-Fluoro-1-propene; 3-Fluoropropene; 3-Fluoropropylene; CH2=CHCH2F

Phase change data

Data compiled by: Robert L. Brown and Stephen E. Stein
Quantity | Value | Units | Method | Reference | Comment |
---|---|---|---|---|---|
Tboil | 263. | K | N/A | PCR Inc., 1990 |

Reaction thermochemistry data

Data compiled as indicated in comments:
B - John E. Bartmess
ALS - Hussein Y. Afeefy, Joel F. Liebman, and Stephen E. Stein
Individual Reactions
C3H4F- + =
By formula: C3H4F- + H+ = C3H5F
Quantity | Value | Units | Method | Reference | Comment |
---|---|---|---|---|---|
ΔrH° | 1628. ± 17. | kJ/mol | G+TS | Dahlke and Kass, 1991 | gas phase; Between H2O, furan. Reprotonation site uncertain; B |
Quantity | Value | Units | Method | Reference | Comment |
ΔrG° | 1598. ± 17. | kJ/mol | IMRB | Dahlke and Kass, 1991 | gas phase; Between H2O, furan. Reprotonation site uncertain; B |
By formula: C3H5F = C3H5F
Quantity | Value | Units | Method | Reference | Comment |
---|---|---|---|---|---|
ΔrH° | -17.4 ± 0.42 | kJ/mol | Ciso | Abell and Adolf, 1969 | gas phase; HBr catalyst; ALS |

Gas phase ion energetics data

Data compiled as indicated in comments:
B - John E. Bartmess
LLK - Sharon G. Lias, Rhoda D. Levin, and Sherif A. Kafafi
Ionization energy determinations
IE (eV) | Method | Reference | Comment |
---|---|---|---|
10.11 | PE | Mines and Thompson, 1973 | LLK |
10.38 | PE | Worrell, 1974 | Vertical value; LLK |
10.56 | PE | Schmidt and Schweig, 1973 | Vertical value; LLK |
De-protonation reactions
C3H4F- + =
By formula: C3H4F- + H+ = C3H5F
Quantity | Value | Units | Method | Reference | Comment |
---|---|---|---|---|---|
ΔrH° | 1628. ± 17. | kJ/mol | G+TS | Dahlke and Kass, 1991 | gas phase; Between H2O, furan. Reprotonation site uncertain; B |
Quantity | Value | Units | Method | Reference | Comment |
ΔrG° | 1598. ± 17. | kJ/mol | IMRB | Dahlke and Kass, 1991 | gas phase; Between H2O, furan. Reprotonation site uncertain; B |

Normal alkane RI, non-polar column, temperature ramp

Column type | Active phase | I | Reference | Comment |
---|---|---|---|---|
Capillary | OV-101 | 380. | Zenkevich, 2005 | 25. m/0.20 mm/0.10 μm, N2/He, 6. K/min; Tstart: 50. C; Tend: 250. C |

References

PCR Inc., 1990
PCR Inc.,
Research Chemicals Catalog 1990-1991, PCR Inc., Gainesville, FL, 1990, 1. [all data]
Dahlke and Kass, 1991
Dahlke, G.D.; Kass, S.R.,
Substituent Effects in the Gas Phase - 1-Substituted Allyl Anions,
J. Am. Chem. Soc., 1991, 113, 15, 5566, https://doi.org/10.1021/ja00015a008
. [all data]
Abell and Adolf, 1969
Abell, P.I.; Adolf, P.K.,
HBr catalyzed photoisomerization of allyl halides,
J. Chem. Thermodyn., 1969, 1, 333-338. [all data]
Mines and Thompson, 1973
Mines, G.W.; Thompson, H.W.,
Photoelectron spectra of vinyl and allyl halides,
Spectrochim. Acta Part A, 1973, 29, 1377. [all data]
Worrell, 1974
Worrell, C.W.,
The photoelectron and absorption spectra of allyl halides,
J. Electron Spectrosc. Relat. Phenom., 1974, 3, 359. [all data]
Schmidt and Schweig, 1973
Schmidt, H.; Schweig, A.,
Semiquantitative proof of hyperconjugation,
Angew. Chem. Int. Ed. Engl., 1973, 12, 307. [all data]
Zenkevich, 2005
Zenkevich, I.G.,
Experimentally measured retention indices., 2005. [all data]