Naphthalic anhydride
- Formula: C12H6O3
- Molecular weight: 198.1742
- IUPAC Standard InChIKey: GRSMWKLPSNHDHA-UHFFFAOYSA-N
- CAS Registry Number: 81-84-5
- Chemical structure:
View 3d structure (requires JavaScript / HTML 5) - Other names: 1,8-Naphthalic anhydride; 1H,3H-Naphtho[1,8-cd]pyran-1,3-dione; Naphthalic acid anhydride; Protect; 1,8-Naphthalenedicarboxylic acid anhydride; 1,8-Naphthalenedicarboxylic anhydride; 1,8-Naphthalic acid anhydride; Naphthalenedicarboxylic-1,8-anhydride; Naphthalene-1,8-dicarboxylic acid anhydride; 1,8-Naphthoic anhydride; Protect (agrochemical); Benzo[de]isochromene-1,3-dione; 1,8-Naphthanoic anhydride; NSC 5747; naphthalene-1,8-dicarboxylic anhydride

Phase change data

Data compiled as indicated in comments:
TRC - Thermodynamics Research Center, NIST Boulder Laboratories, Chris Muzny director
AC - William E. Acree, Jr., James S. Chickos
Quantity | Value | Units | Method | Reference | Comment |
---|---|---|---|---|---|
Tfus | 545.7 | K | N/A | Donnelly, Drewes, et al., 1990 | Uncertainty assigned by TRC = 0.2 K; TRC |
Enthalpy of fusion
ΔfusH (kJ/mol) | Temperature (K) | Method | Reference | Comment |
---|---|---|---|---|
23.32 | 542.3 | DSC | Donnelly, Drewes, et al., 1990, 2 | AC |

Gas phase ion energetics data

Data compiled by: Sharon G. Lias, Rhoda D. Levin, and Sherif A. Kafafi
Ionization energy determinations
IE (eV) | Method | Reference | Comment |
---|---|---|---|
8.92 ± 0.05 | PE | Bigotto, Galasso, et al., 1979 | Vertical value |

Normal alkane RI, non-polar column, custom temperature program

View large format table.

Column type Active phase I Reference Comment
CapillaryMethyl Silicone1944.Oda, Yasuhara, et al., 199825. m/0.25 mm/0.25 μm, He; Program: 50 0C (2 min) 20 0C/min -> 160 0C 5 0C/min -> 210 0C 10 0C/min -> 300 0C

Lee's RI, non-polar column, temperature ramp

View large format table.

Column type Active phase I Reference Comment
CapillaryHP-5342.17Pedersen, Durant, et al., 200530. m/0.25 mm/0.25 μm, Helium, 50. C @ 1.5 min, 6. K/min, 310. C @ 10. min
CapillarySPB-5339.9Knobloch and Engewald, 199340. C @ 2. min, 4. K/min; Column length: 30. m; Column diameter: 0.25 mm; Tend: 300. C
CapillarySPB-5340.8Knobloch and Engewald, 199340. C @ 2. min, 4. K/min; Column length: 30. m; Column diameter: 0.25 mm; Tend: 300. C
CapillarySE-30341.19König, Balfanz, et al., 198330. m/0.32 mm/0.25 μm, He, 2. K/min; Tstart: 120. C; Tend: 280. C

Lee's RI, non-polar column, custom temperature program

View large format table.

Column type Active phase I Reference Comment
CapillaryDB-5339.2Lundstedt, Haglund, et al., 200330. m/0.25 mm/0.25 μm; Program: not specified

References

Donnelly, Drewes, et al., 1990
Donnelly, J.R.; Drewes, L.A.; Johnson, R.L.; Munslow, W.D.; Knapp, K.K.; Sovocool, G.W.,
Purity and heat of fusion data for environmental standards as determined by differential scanning calorimetry,
Thermochim. Acta, 1990, 167, 2, 155, https://doi.org/10.1016/0040-6031(90)80476-F
. [all data]
Donnelly, Drewes, et al., 1990, 2
Donnelly, J.R.; Drewes, L.A.; Johnson, R.L.; Munslow, W.D.; Knapp, K.K.; Sovocool, G.W.,
Purity and heat of fusion data for environmental standards as determined by differential scanning calorimetry,
Thermochimica Acta, 1990, 167, 2, 155-187, https://doi.org/10.1016/0040-6031(90)80476-F
. [all data]
Bigotto, Galasso, et al., 1979
Bigotto, A.; Galasso, V.; Distefano, G.; Modelli, A.,
Photoelectron and electronic spectra of acenaphthenequinone, naphthalic anhydride, and naphthalimide,
J. Chem. Soc. Perkin Trans. 2, 1979, 1502. [all data]