N,N,2,6-Tetramethylbenzeneamine
- Formula: C14H23N
- Molecular weight: 205.3391
- IUPAC Standard InChIKey: SCVRZFQSPISLTD-UHFFFAOYSA-N
- CAS Registry Number: 81506-16-3
- Chemical structure:
View 3d structure (requires JavaScript / HTML 5) - Species with the same structure:

Gas phase ion energetics data

Data compiled as indicated in comments:
LBLHLM - Sharon G. Lias, John E. Bartmess, Joel F. Liebman, John L. Holmes, Rhoda D. Levin, and W. Gary Mallard
Ionization energy determinations
IE (eV) | Method | Reference | Comment |
---|---|---|---|
7.77 | PE | Rozeboom, Houk, et al., 1982 | Vertical value; LBLHLM |

References

Rozeboom, Houk, et al., 1982
Rozeboom, M.D.; Houk, K.N.; Searles, S.; Seyedrezai, S.E.,
Photoelectron spectroscopy of N-aryl cyclic amines. Variable conformations and relationships to gas- and solution-phase basicities,
J. Am. Chem. Soc., 1982, 104, 3448. [all data]