1,1,2,2-tetramethyldisilane
- Formula: C4H14Si2
- Molecular weight: 118.3250
- IUPAC Standard InChIKey: RDWAGGBALVFUHB-UHFFFAOYSA-N
- CAS Registry Number: 814-98-2
- Chemical structure:
View 3d structure (requires JavaScript / HTML 5) - Permanent link for this species. Use this link for bookmarking this species for future reference.

Gas phase ion energetics data

Data compiled by: Sharon G. Lias, Rhoda D. Levin, and Sherif A. Kafafi
Appearance energy determinations
Ion | AE (eV) | Other Products | Method | Reference | Comment |
---|---|---|---|---|---|
C2H6Si+ | 10.7 ± 0.1 | (CH3)2SiH2 | EI | Potzinger, Ritter, et al., 1975 | |
C2H7Si+ | 10.8 ± 0.1 | (CH3)2SiH | EI | Potzinger, Ritter, et al., 1975 | |
C3H9Si+ | 10.1 ± 0.1 | CH3SiH2 | EI | Potzinger, Ritter, et al., 1975 |

References

Potzinger, Ritter, et al., 1975
Potzinger, P.; Ritter, A.; Krause, J.,
Massenspektrometrische Bestimmung von Bindungsenergien in siliciumorganischen Verbindungen,
Z. Naturforsch. A:, 1975, 30, 347. [all data]