3-Buten-2-one, 3-methyl-
- Formula: C5H8O
- Molecular weight: 84.1164
- IUPAC Standard InChIKey: ZGHFDIIVVIFNPS-UHFFFAOYSA-N
- CAS Registry Number: 814-78-8
- Chemical structure:
View 3d structure (requires JavaScript / HTML 5) - Other names: Isopropenyl methyl ketone; Methyl isopropenyl ketone; CH2=C(CH3)C(=O)CH3; Ketone, methyl isopropenyl; 2-Methyl-1-buten-3-one; 3-Methyl-3-buten-2-on; 3-Methyl-3-buten-2-one; UN 1246; 3- Methyl-3- butene-2- one; 3- Methyl-3- butene-2- one (methyl isopropenyl ketone); 3-methylbut-3-en-2-one

Phase change data

Data compiled as indicated in comments:
BS - Robert L. Brown and Stephen E. Stein
TRC - Thermodynamics Research Center, NIST Boulder Laboratories, Chris Muzny director
AC - William E. Acree, Jr., James S. Chickos
Quantity | Value | Units | Method | Reference | Comment |
---|---|---|---|---|---|
Tboil | 371.2 | K | N/A | Weast and Grasselli, 1989 | BS |
Tboil | 370.86 | K | N/A | Dreisbach and Martin, 1949 | Uncertainty assigned by TRC = 0.2 K; TRC |
Tboil | 370. | K | N/A | Landau and Irany, 1947 | Uncertainty assigned by TRC = 3. K; TRC |
Quantity | Value | Units | Method | Reference | Comment |
Tfus | 219.55 | K | N/A | Dreisbach and Martin, 1949 | Uncertainty assigned by TRC = 0.2 K; TRC |
Enthalpy of vaporization
ΔvapH (kJ/mol) | Temperature (K) | Method | Reference | Comment |
---|---|---|---|---|
26.2 | 328. | A | Stephenson and Malanowski, 1987 | Based on data from 313. to 371. K. See also Dykyj, 1972.; AC |

Gas phase ion energetics data

Data evaluated as indicated in comments:
HL - Edward P. Hunter and Sharon G. Lias
Data compiled as indicated in comments:
LLK - Sharon G. Lias, Rhoda D. Levin, and Sherif A. Kafafi
Quantity | Value | Units | Method | Reference | Comment |
---|---|---|---|---|---|
Proton affinity (review) | 843.1 | kJ/mol | N/A | Hunter and Lias, 1998 | HL |
Quantity | Value | Units | Method | Reference | Comment |
Gas basicity | 811.3 | kJ/mol | N/A | Hunter and Lias, 1998 | HL |
Ionization energy determinations
IE (eV) | Method | Reference | Comment |
---|---|---|---|
9.50 | PE | Masclet and Mouvier, 1978 | LLK |

Kovats' RI, non-polar column, isothermal

Column type | Active phase | Temperature (C) | I | Reference | Comment |
---|---|---|---|---|---|
Packed | Apiezon L | 120. | 643. | Bogoslovsky, Anvaer, et al., 1978 | Celite 545 |
Packed | Apiezon L | 160. | 654. | Bogoslovsky, Anvaer, et al., 1978 | Celite 545 |

Normal alkane RI, non-polar column, temperature ramp

Column type | Active phase | I | Reference | Comment |
---|---|---|---|---|
Capillary | DBP-5 | 620. | Heravi and Sereshti, 2007 | 25. m/0.25 mm/0.22 μm, Helium, 40. C @ 1. min, 3. K/min, 250. C @ 10. min |
Capillary | DBP-5 | 620. | Sereshti and Samadi, 2007 | 25. m/0.25 mm/0.22 μm, Helium, 40. C @ 1. min, 3. K/min, 250. C @ 10. min |
Capillary | DB-1 | 693. | Tai and Ho, 1998 | 60. m/0.32 mm/1.0 μm, He, 2. K/min; Tstart: 40. C; Tend: 280. C |
Capillary | DB-1 | 671. | Lu, Yu, et al., 1997 | 60. m/0.32 mm/1. μm, He, 40. C @ 2. min, 2. K/min, 280. C @ 40. min |

Normal alkane RI, non-polar column, custom temperature program

Column type | Active phase | I | Reference | Comment |
---|---|---|---|---|
Capillary | HP-5 | 653. | Jordán, Margaría, et al., 2002 | 30. m/0.25 mm/0.25 μm; Program: 40C (6min) => 2.5C/min => 150C => 90C/min => 250C |

Normal alkane RI, polar column, temperature ramp

Column type | Active phase | I | Reference | Comment |
---|---|---|---|---|
Capillary | DB-Wax | 1006. | Qian and Wang, 2005 | 60. m/0.32 mm/0.50 μm, Nitrogen, 35. C @ 4. min, 2. K/min, 235. C @ 30. min |

Normal alkane RI, polar column, custom temperature program

Column type | Active phase | I | Reference | Comment |
---|---|---|---|---|
Capillary | DB-Wax | 987. | Kim. J.H., Ahn, et al., 2004 | 60. m/0.25 mm/0.25 μm, Helium; Program: 60 0C (3 min) 2 0C/min -> 150 0C 4 0C/min -> 200 0C |
Capillary | Supelcowax 10 | 991. | Castioni and Kapetanidis, 1996 | 60. m/0.25 mm/0.25 μm, Helium; Program: 60 0C (10 min) 2 0C/min -> 80 0C 3 0C/min -> 100 0C 4 0C/min -> 220 0C (30 min) |
Capillary | Supelcowax 10 | 1000. | Castioni and Kapetanidis, 1996 | 60. m/0.25 mm/0.25 μm, Helium; Program: not specified |

References

Weast and Grasselli, 1989
CRC Handbook of Data on Organic Compounds, 2nd Editon, Weast,R.C and Grasselli, J.G., ed(s)., CRC Press, Inc., Boca Raton, FL, 1989, 1. [all data]
Dreisbach and Martin, 1949
Dreisbach, R.R.; Martin, R.A.,
Physical Data on Some Organic Compounds,
Ind. Eng. Chem., 1949, 41, 2875-8. [all data]
Landau and Irany, 1947
Landau, E.F.; Irany, E.P.,
Preparation of Methyl Isopropenyl Ketone from Methyl Ethyl Ketone and Formaldehyde,
J. Org. Chem., 1947, 12, 422-5. [all data]
Stephenson and Malanowski, 1987
Stephenson, Richard M.; Malanowski, Stanislaw,
Handbook of the Thermodynamics of Organic Compounds, 1987, https://doi.org/10.1007/978-94-009-3173-2
. [all data]
Dykyj, 1972
Dykyj, J.,
Petrochemia, 1972, 12, 1, 13. [all data]
Hunter and Lias, 1998
Hunter, E.P.; Lias, S.G.,
Evaluated Gas Phase Basicities and Proton Affinities of Molecules: An Update,
J. Phys. Chem. Ref. Data, 1998, 27, 3, 413-656, https://doi.org/10.1063/1.556018
. [all data]
Masclet and Mouvier, 1978
Masclet, P.; Mouvier, G.,
Etude par spectrometrie photoelectronique d'aldehydes et de cetones ethyleniques conjugues,
J. Electron Spectrosc. Relat. Phenom., 1978, 14, 77. [all data]
Bolshakov, et al., 1969
Bolshakov, G.F., et al.,
Ultraviolet Spectra of Heteroorganic Compounds, 1969, 261. [all data]
Bogoslovsky, Anvaer, et al., 1978
Bogoslovsky, Yu.N.; Anvaer, B.I.; Vigdergauz, M.S.,
Chromatographic constants in gas chromatography (in Russian), Standards Publ. House, Moscow, 1978, 192. [all data]
Heravi and Sereshti, 2007
Heravi, M.J.; Sereshti, H.,
Determination of Essential Oil Components of Artemisia haussknechtii Boiss. using Simultaneous Hydrodistillation-Static Headspace Liquid Phase Microextraction - Gas Chromatography Mass Spectrometry,
J. Chromatogr. A, 2007, 1160, 1-2, 81-89, https://doi.org/10.1016/j.chroma.2007.05.096
. [all data]
Sereshti and Samadi, 2007
Sereshti, H.; Samadi, S.,
Comparison of hydrodistillation-headspace liquid phase microextraction techniques with hydrodistillation in determination of essential oils in Artemisia Haussknechtii Boiss,
JSUT, 2007, 33, 2, 7-17. [all data]
Tai and Ho, 1998
Tai, C.-Y.; Ho, C.-T.,
Influence of glutathione oxidation and pH on thermal formation of Maillard-type volatile compounds,
J. Agric. Food Chem., 1998, 46, 6, 2260-2265, https://doi.org/10.1021/jf971111t
. [all data]
Lu, Yu, et al., 1997
Lu, G.; Yu, T.-H.; Ho, C.-T.,
Generation of flavor compounds by the reaction of 2-deoxyglucose with selected amino acids,
J. Agric. Food Chem., 1997, 45, 1, 233-236, https://doi.org/10.1021/jf960609c
. [all data]
Jordán, Margaría, et al., 2002
Jordán, M.J.; Margaría, C.A.; Shaw, P.E.; Goodner, K.L.,
Aroma active components in aqueous kiwi fruit essence and kiwi fruit puree by GC-MS and multidimensional GC/GC-O,
J. Agric. Food Chem., 2002, 50, 19, 5386-5390, https://doi.org/10.1021/jf020297f
. [all data]
Qian and Wang, 2005
Qian, M.C.; Wang, Y.,
Seasonal Variations of Volatile Composition and Odor Activity Value of Marion (Rubus spp. hyb) and Thornless Evergreen (R.laciniatus L.) Blackberries,
J. Food. Sci., 2005, 70, 1, c13-c20, https://doi.org/10.1111/j.1365-2621.2005.tb09013.x
. [all data]
Kim. J.H., Ahn, et al., 2004
Kim. J.H.; Ahn, H.J.; Yook, H.S.; Kim, K.S.; Rhee, M.S.; Ryu, G.H.; Byun, M.W.,
Color, flavor, and sensory characteristics of gamma-irradiated salted and fermented anchovy sauce,
Radiation Phys. Chem., 2004, 69, 2, 179-187, https://doi.org/10.1016/S0969-806X(03)00400-6
. [all data]
Castioni and Kapetanidis, 1996
Castioni, P.; Kapetanidis, I.,
Volatile constituents from Brunfelsia grandiflora ssp. grandiflora: qualitative analysis by GC-MS,
Scientia Pharmaceutica, 1996, 64, 83-91. [all data]