2-Butanone, 3-bromo-
- Formula: C4H7BrO
- Molecular weight: 151.002
- IUPAC Standard InChIKey: BNBOUFHCTIFWHN-UHFFFAOYSA-N
- CAS Registry Number: 814-75-5
- Chemical structure:

Phase change data

Data compiled by: William E. Acree, Jr., James S. Chickos
Enthalpy of vaporization
ΔvapH (kcal/mol) | Temperature (K) | Method | Reference | Comment |
---|---|---|---|---|
11.1 | 321. | A | Stephenson and Malanowski, 1987 | Based on data from 306. to 409. K. |

Gas phase ion energetics data

Data compiled by: Sharon G. Lias and Joel F. Liebman
Appearance energy determinations
Ion | AE (eV) | Other Products | Method | Reference | Comment |
---|---|---|---|---|---|
C2H3O+ | 10.22 | BrCHCH3 | EI | Holmes and Lossing, 1988 |

References

Stephenson and Malanowski, 1987
Stephenson, Richard M.; Malanowski, Stanislaw,
Handbook of the Thermodynamics of Organic Compounds, 1987, https://doi.org/10.1007/978-94-009-3173-2
. [all data]
Holmes and Lossing, 1988
Holmes, J.L.; Lossing, F.P.,
Heats of formation and bond dissociation energies in halogen-substituted methyl and ethyl radicals,
J. Am. Chem. Soc., 1988, 110, 7343. [all data]