Violanthrene
- Formula: C34H20
- Molecular weight: 428.5226
- IUPAC Standard InChIKey: JAIHDOVRCZNXDU-UHFFFAOYSA-N
- CAS Registry Number: 81-31-2
- Chemical structure:
View 3d structure (requires JavaScript / HTML 5) - Permanent link for this species. Use this link for bookmarking this species for future reference.

Gas phase ion energetics data

Data compiled by: Henry M. Rosenstock, Keith Draxl, Bruce W. Steiner, and John T. Herron
Ionization energy determinations
IE (eV) | Method | Reference |
---|---|---|
6.86 | CTS | Kuroda, 1964 |

Phase change data

Data compiled by: William E. Acree, Jr., James S. Chickos
Enthalpy of sublimation
ΔsubH (kcal/mol) | Temperature (K) | Reference | Comment |
---|---|---|---|
53.5 ± 2.1 | 590. | Inokuchi, Shiba, et al., 1952 | See also Jones, 1960. |

References

Kuroda, 1964
Kuroda, H.,
Ionization potentials of polycyclic aromatic hydrocarbons,
Nature, 1964, 201, 1214. [all data]