H2CClH+

Vibrational and/or electronic energy levels

Data compiled by: Marilyn E. Jacox

State:   X

Vib.
sym.
 No.   Approximate
 type of mode
 cm-1   Med.   Method   References

1 CH2 a-stretch 3225.5 w m Ne IR Lugez, Forney, et al., 1997
2 CH2 s-stretch 3053.3 m Ne IR Lugez, Forney, et al., 1997
3 ClH stretch 2626.1 m Ne IR Lugez, Forney, et al., 1997
7 CCl stretch 798.8 w Ne IR Lugez, Forney, et al., 1997
8 Wag 655.0 w m Ne IR Lugez, Forney, et al., 1997

Additional references: Jacox, 1998, page 274

References

Lugez, Forney, et al., 1997
Lugez, C.L.; Forney, D.; Jacox, M.E.; Irikura, K.K., The vibrational spectra of molecular ions isolated in solid neon. XIV. CH[sub 3]F[sup +], CH[sub 3]Cl[sup +], CH[sub 3]Br[sup +], and their ylidion isomers, J. Chem. Phys., 1997, 106, 2, 489, https://doi.org/10.1063/1.473390 . [all data]

Jacox, 1998
Jacox, M.E., Vibrational and electronic energy levels of polyatomic transient molecules: supplement A, J. Phys. Chem. Ref. Data, 1998, 27, 2, 115-393, https://doi.org/10.1063/1.556017 . [all data]