Disilane, pentamethyl-
- Formula: C5H16Si2
- Molecular weight: 132.3515
- IUPAC Standard InChIKey: FHQRQPAFALORSL-UHFFFAOYSA-N
- CAS Registry Number: 812-15-7
- Chemical structure:
View 3d structure (requires JavaScript / HTML 5) - Other names: Pentamethyldisilane; (CH3)3SiSiH(CH3)2

Gas phase ion energetics data

Data compiled by: Sharon G. Lias, Rhoda D. Levin, and Sherif A. Kafafi
Appearance energy determinations
Ion | AE (eV) | Other Products | Method | Reference | Comment |
---|---|---|---|---|---|
C3H9Si+ | 10.2 ± 0.1 | (CH3)2SiH | EI | Potzinger, Ritter, et al., 1975 |

References

Potzinger, Ritter, et al., 1975
Potzinger, P.; Ritter, A.; Krause, J.,
Massenspektrometrische Bestimmung von Bindungsenergien in siliciumorganischen Verbindungen,
Z. Naturforsch. A:, 1975, 30, 347. [all data]