Silanamine, 1,1,1-trifluoro-N,N-dimethyl-
- Formula: C2H6F3NSi
- Molecular weight: 129.1564
- IUPAC Standard InChIKey: UUVDYUPJXKVYIM-UHFFFAOYSA-N
- CAS Registry Number: 812-14-6
- Chemical structure:
View 3d structure (requires JavaScript / HTML 5) - Permanent link for this species. Use this link for bookmarking this species for future reference.

Phase change data

Data compiled by: William E. Acree, Jr., James S. Chickos
Enthalpy of vaporization
ΔvapH (kJ/mol) | Temperature (K) | Reference | Comment |
---|---|---|---|
28.5 | 273. | Grosse-Ruyken and Kleesaat, 1961 | Based on data from 225. to 288. K. |

Gas phase ion energetics data

Data compiled by: Sharon G. Lias, Rhoda D. Levin, and Sherif A. Kafafi
Ionization energy determinations
IE (eV) | Method | Reference | Comment |
---|---|---|---|
9.60 ± 0.05 | PE | Demuth, 1977 | Vertical value |

References

Grosse-Ruyken and Kleesaat, 1961
Grosse-Ruyken, Heinz; Kleesaat, Renate,
Zur Darstellung von Dimethylaminofluorsilanen,
Z. Anorg. Allg. Chem., 1961, 308, 1-6, 122-132, https://doi.org/10.1002/zaac.19613080114
. [all data]
Demuth, 1977
Demuth, R.,
Photoelektronenspektren von einigen Trihalogensilylphosphanen und -arsanen X3SiER2 (X = F, Cl; E = N, P, As; R = H, CH3),
Z. Naturforsch. B:, 1977, 32, 1252. [all data]