Dimethylaminetrifluoroborane
- Formula: C2H7BF3N
- Molecular weight: 112.890
- IUPAC Standard InChIKey: ZTAAALGPDJSKAL-UHFFFAOYSA-N
- CAS Registry Number: 811-59-6
- Chemical structure:
View 3d structure (requires JavaScript / HTML 5) - Permanent link for this species. Use this link for bookmarking this species for future reference.

Gas phase ion energetics data

Data compiled by: Sharon G. Lias, Rhoda D. Levin, and Sherif A. Kafafi
Ionization energy determinations
IE (eV) | Method | Reference | Comment |
---|---|---|---|
12.18 | PE | Lake, 1971 | Vertical value |

References

Lake, 1971
Lake, R.F.,
The photoelectron spectra of complexes of boron trifluoride and amines,
Spectrochim. Acta, 1971, 27A, 1220. [all data]