Propynonitrile, trimethylsilyl-
- Formula: C6H9NSi
- Molecular weight: 123.2279
- IUPAC Standard InChIKey: APNUIYXSABHLIF-UHFFFAOYSA-N
- CAS Registry Number: 80958-26-5
- Chemical structure:
View 3d structure (requires JavaScript / HTML 5) - Permanent link for this species. Use this link for bookmarking this species for future reference.

Gas phase ion energetics data

Data compiled by: Sharon G. Lias, Rhoda D. Levin, and Sherif A. Kafafi
Appearance energy determinations
Ion | AE (eV) | Other Products | Method | Reference | Comment |
---|---|---|---|---|---|
C5H6NSi+ | 10.35 ± 0.05 | CH3 | PI | Takhistov, Khlebnikova, et al., 1980 |

References

Takhistov, Khlebnikova, et al., 1980
Takhistov, V.; Khlebnikova, N.; Orlov, V.,
Photoionization study of energetic properties of cations formed with fragmentation of substituted acetylenes containing elements of IV B group,
Org. React. Tartu, 1980, 17, 449. [all data]