dl-2-Aminobutyric acid
- Formula: C4H9NO2
- Molecular weight: 103.1198
- IUPAC Standard InChIKey: QWCKQJZIFLGMSD-UHFFFAOYSA-N
- CAS Registry Number: 80-60-4
- Chemical structure:
View 3d structure (requires JavaScript / HTML 5) - Species with the same structure:
- Stereoisomers:
- Other names: dl-2-Amino-n-butyric acid; 2-Aminobutyric acid; dl-α-Amino-n-butyric acid; Butanoic acid, 2-amino-, (.+/-.)-; Aminobutyric acid,-2-; Butyric acid, 2-amino-, DL-; DL-2-Aminobutanoic acid; 2-Aminobutyric acid, dl; Butanoic acid, 2-amino-; Butyrine; NSC 3251; α-Aminobutyric acid; Butyric acid, dl-2-amino-, beta-form; (±)-2-aminobutyric acid

Condensed phase thermochemistry data

Data compiled by: Eugene S. Domalski and Elizabeth D. Hearing
Constant pressure heat capacity of solid
Cp,solid (J/mol*K) | Temperature (K) | Reference | Comment |
---|---|---|---|
160.7 | 323. | Satoh and Sogabe, 1941 | T = 0 to 100°C. Mean value. |

Gas phase ion energetics data

Data compiled by: Sharon G. Lias, Rhoda D. Levin, and Sherif A. Kafafi
Ionization energy determinations
IE (eV) | Method | Reference |
---|---|---|
8.70 | PE | Klasinc, 1976 |

References

Satoh and Sogabe, 1941
Satoh, S.; Sogabe, T.,
The heat capacities of some organic compounds containing nitrogen and the atomic heat of nitrogen. (3), Sci.,
Pap. Inst. Phys. Chem. Res. (Tokyo), 1941, 38, 238-245. [all data]
Klasinc, 1976
Klasinc, L.,
Application of photoelectron spectroscopy to biologically active molecules and their constituent parts,
J. Electron Spectrosc. Relat. Phenom., 1976, 8, 161. [all data]