α-Pinene
- Formula: C10H16
- Molecular weight: 136.2340
- IUPAC Standard InChIKey: GRWFGVWFFZKLTI-UHFFFAOYSA-N
- CAS Registry Number: 80-56-8
- Chemical structure:
View 3d structure (requires JavaScript / HTML 5) - Species with the same structure:
- Stereoisomers:
- Other names: Bicyclo[3.1.1]hept-2-ene, 2,6,6-trimethyl-; 2-Pinene; 2,6,6-Trimethylbicyclo[3.1.1]hept-2-ene; Pinene, α; 2,6,6-Trimethylbicyclo(3.1.1)-2-hept-2-ene; 2,6,6-Trimethylbicyclo[3.1.1]-2-heptene; Acintene A; 4,6,6-Trimethylbicyklo(3,1,1)hept-3-en; UN 2368; alpha-Pinene; PC 500; Bicyclo[3.1.1]hept-2-ene, 2,6,6-trimethyl-, (.+/-.)-; Sylvapine A; (.+/-.)-α-Pinene; NSC 7727; Pinene; (+)-α-pinene; 2,6,6-trimethylbicyclo[3,1,1]-heptene (α-pinene); α-Pinene [1R-(+), 1S-(-) ]; 2,6,6-trimethylbicyclo-[3,1,1]-2-heptene (α-pinene); pin-2(3)-ene

Condensed phase thermochemistry data

Data compiled by: Hussein Y. Afeefy, Joel F. Liebman, and Stephen E. Stein
Quantity | Value | Units | Method | Reference | Comment |
---|---|---|---|---|---|
ΔcH°liquid | -1483.10 ± 0.70 | kcal/mol | Ccb | Hawkins and Eriksen, 1954 | Reanalyzed by Cox and Pilcher, 1970, Original value = -1483.0 ± 0.25 kcal/mol; Corresponding ΔfHºliquid = -3.93 kcal/mol (simple calculation by NIST; no Washburn corrections) |

Phase change data

Data compiled as indicated in comments:
TRC - Thermodynamics Research Center, NIST Boulder Laboratories, Chris Muzny director
AC - William E. Acree, Jr., James S. Chickos
ALS - Hussein Y. Afeefy, Joel F. Liebman, and Stephen E. Stein
Quantity | Value | Units | Method | Reference | Comment |
---|---|---|---|---|---|
Tboil | 430. ± 4. | K | AVG | N/A | Average of 14 values; Individual data points |
Quantity | Value | Units | Method | Reference | Comment |
Tfus | 197.64 | K | N/A | Hawkins and Eriksen. W.T., 1954 | Uncertainty assigned by TRC = 0.1 K; TRC |
Tfus | 210.35 | K | N/A | Timmermans, 1952 | Uncertainty assigned by TRC = 1. K; TRC |
Tfus | 202.25 | K | N/A | Anonymous, 1942 | Uncertainty assigned by TRC = 1. K; TRC |
Tfus | 200.75 | K | N/A | Anonymous, 1942 | Uncertainty assigned by TRC = 1. K; TRC |
Quantity | Value | Units | Method | Reference | Comment |
ΔvapH° | 10.9 | kcal/mol | N/A | Clara, Marigliano, et al., 2009 | Based on data from 308. to 427. K.; AC |
ΔvapH° | 10.7 ± 0.02 | kcal/mol | C | An, Hu, et al., 1987 | AC |
Enthalpy of vaporization
ΔvapH (kcal/mol) | Temperature (K) | Method | Reference | Comment |
---|---|---|---|---|
10.2 | 335. | N/A | Rodrigues and Bernardo-Gil, 1996 | Based on data from 320. to 429. K.; AC |
9.61 | 380. | N/A | Reich and Sanhueza, 1993 | Based on data from 365. to 430. K.; AC |
10.8 | 307. | A | Stephenson and Malanowski, 1987 | Based on data from 292. to 433. K.; AC |
10.4 | 308. | N/A | Bukala, Majewski, et al., 1954 | Based on data from 293. to 363. K.; AC |
11.14 | 288. | V | Hawkins and Armstrong, 1954 | ALS |
Antoine Equation Parameters
log10(P) = A − (B / (T + C))
P = vapor pressure (atm)
T = temperature (K)
View plot Requires a JavaScript / HTML 5 canvas capable browser.
Temperature (K) | A | B | C | Reference | Comment |
---|---|---|---|---|---|
292.59 to 428.91 | 3.91590 | 1411.869 | -68.817 | Hawkinds and Armstrong, 1954 | Coefficents calculated by NIST from author's data. |

Gas phase ion energetics data

Data compiled by: Henry M. Rosenstock, Keith Draxl, Bruce W. Steiner, and John T. Herron
Ionization energy determinations
IE (eV) | Method | Reference |
---|---|---|
8.07 | PE | Al-Joboury and Turner, 1964 |

Kovats' RI, non-polar column, isothermal

Column type | Active phase | Temperature (C) | I | Reference | Comment |
---|---|---|---|---|---|
Capillary | DB-1 | 120. | 948.55 | Harangi, 2003 | 30. m/0.32 mm/5. μm, He |
Capillary | DB-1 | 120. | 948.81 | Harangi, 2003 | 30. m/0.32 mm/5. μm, He |
Capillary | DB-1 | 140. | 955.92 | Harangi, 2003 | 30. m/0.32 mm/5. μm, He |
Capillary | DB-1 | 140. | 956.48 | Harangi, 2003 | 30. m/0.32 mm/5. μm, He |
Capillary | OV-1 | 100. | 942.00 | Tarján, Bitter, et al., 2002 | 25. m/0.2 mm/0.5 μm, He |
Capillary | OV-1 | 110. | 945.00 | Tarján, Bitter, et al., 2002 | 25. m/0.2 mm/0.5 μm, He |
Capillary | OV-1 | 120. | 949.00 | Tarján, Bitter, et al., 2002 | 25. m/0.2 mm/0.5 μm, He |
Capillary | OV-1 | 130. | 952.00 | Tarján, Bitter, et al., 2002 | 25. m/0.2 mm/0.5 μm, He |
Capillary | OV-1 | 140. | 956.00 | Tarján, Bitter, et al., 2002 | 25. m/0.2 mm/0.5 μm, He |
Capillary | OV-1 | 150. | 959.00 | Tarján, Bitter, et al., 2002 | 25. m/0.2 mm/0.5 μm, He |
Capillary | OV-1 | 80. | 935.00 | Tarján, Bitter, et al., 2002 | 25. m/0.2 mm/0.5 μm, He |
Capillary | OV-1 | 90. | 938.00 | Tarján, Bitter, et al., 2002 | 25. m/0.2 mm/0.5 μm, He |
Capillary | DB-1 | 150. | 930. | Viswanathan, Maridass, et al., 2002 | 28. m/0.25 mm/0.25 μm, He |
Capillary | SE-30 | 100. | 940.9 | Tudor, 1997 | 40. m/0.35 mm/0.35 μm |
Capillary | OV-101 | 100. | 933. | Baaliouamer, Boudarene, et al., 1993 | He; Column length: 25. m; Column diameter: 0.20 mm |
Capillary | OV-101 | 100. | 941. | Baaliouamer, Boudarene, et al., 1993 | He; Column length: 25. m; Column diameter: 0.20 mm |
Capillary | OV-101 | 120. | 934. | Baaliouamer, Boudarene, et al., 1993 | He; Column length: 25. m; Column diameter: 0.20 mm |
Capillary | OV-101 | 120. | 941. | Baaliouamer, Boudarene, et al., 1993 | He; Column length: 25. m; Column diameter: 0.20 mm |
Capillary | OV-101 | 80. | 926. | Baaliouamer, Boudarene, et al., 1993 | He; Column length: 25. m; Column diameter: 0.20 mm |
Capillary | OV-101 | 80. | 934. | Baaliouamer, Boudarene, et al., 1993 | He; Column length: 25. m; Column diameter: 0.20 mm |
Capillary | PB-1 | 130. | 950. | Engewald, Knobloch, et al., 1991 | Column length: 42. m; Column diameter: 0.32 mm |
Packed | OV-101 | 130. | 952. | Szabolcs, Benecke, et al., 1985 | Ar, W-AW-DMCS; Column length: 2. m |
Packed | OV-101 | 140. | 956. | Szabolcs, Benecke, et al., 1985 | Ar, W-AW-DMCS; Column length: 2. m |
Packed | OV-101 | 150. | 960. | Szabolcs, Benecke, et al., 1985 | Ar, W-AW-DMCS; Column length: 2. m |
Packed | OV-101 | 160. | 965. | Szabolcs, Benecke, et al., 1985 | Ar, W-AW-DMCS; Column length: 2. m |
Capillary | OV-101 | 130. | 952. | Benecke, Thieme, et al., 1982 | |
Capillary | OV-101 | 140. | 956. | Benecke, Thieme, et al., 1982 | |
Capillary | OV-101 | 150. | 960. | Benecke, Thieme, et al., 1982 | |
Capillary | OV-101 | 160. | 965. | Benecke, Thieme, et al., 1982 | |
Capillary | Apiezon L | 100. | 948. | Morishita, Okano, et al., 1980 | Column length: 45. m; Column diameter: 0.25 mm |
Capillary | SE-30 | 100. | 940.7 | Saeed, Redant, et al., 1979 | 80. m/0.5 mm/0.8 μm |
Capillary | SE-30 | 110. | 940.5 | Saeed, Redant, et al., 1979 | 80. m/0.5 mm/0.8 μm |
Capillary | SE-30 | 130. | 950.5 | Saeed, Redant, et al., 1979 | 80. m/0.5 mm/0.8 μm |
Capillary | SF-96 | 100. | 940. | Kepner, Ellison, et al., 1974 | Column length: 152. m; Column diameter: 0.8 mm |
Packed | SE-30 | 160. | 970. | Hedin, Thompson, et al., 1972 | N2, Chromosorb W; Column length: 6.145 m |
Capillary | SF-96 | 100. | 938. | Andersen and Syrdal, 1970 | |
Capillary | Apiezon L | 100. | 944.5 | Andersen and Syrdal, 1970 | |
Packed | Squalane | 86. | 928. | Hively and Hinton, 1968 | He, Chromosorb P; Column length: 15. m; Column diameter: 0.25 mm |
Capillary | SF-96 | 100. | 942. | Sakai, Maarse, et al., 1967 | Column length: 152. m; Column diameter: 0.8 mm |
Packed | Apiezon L | 130. | 962. | Minyard, Tumlinson, et al., 1965 | N2, Gas Chrom P (60-80 mesh); Column length: 6.1 m |

Kovats' RI, non-polar column, temperature ramp

Column type | Active phase | I | Reference | Comment |
---|---|---|---|---|
Capillary | HP-5MS | 917. | Kartal N., Sokmen M., et al., 2007 | 30. m/0.25 mm/0.25 μm, He, 50. C @ 3. min, 3. K/min; Tend: 240. C |
Capillary | DB-5 | 939. | Adams, González Elizondo, et al., 2006 | 30. m/0.26 mm/0.25 μm, He, 3. K/min; Tstart: 60. C; Tend: 246. C |
Capillary | DB-1 | 933. | Allegrone, Belliardo, et al., 2006 | 30. m/0.25 mm/0.25 μm, He, 50. C @ 3. min, 5. K/min; Tend: 280. C |
Capillary | DB-5MS | 931. | Angioni, Barra, et al., 2006 | 30. m/0.25 mm/0.25 μm, He, 3. K/min, 180. C @ 15. min; Tstart: 60. C |
Capillary | HP-5MS | 939. | Hazzit, Baaliouamer, et al., 2006 | 30. m/0.25 mm/0.25 μm, He, 60. C @ 8. min, 2. K/min, 280. C @ 30. min |
Capillary | HP-5MS | 940. | Jalali-Heravi, Zekavat, et al., 2006 | 60. m/0.25 mm/0.25 μm, He, 40. C @ 1. min, 3. K/min, 250. C @ 20. min |
Capillary | DB-5 | 940. | Lucero, Fredrickson, et al., 2006 | 30. m/0.25 mm/0.25 μm, He, 3. K/min; Tstart: 60. C |
Capillary | DB-5MS | 917. | Marongiu, Porcedda, et al., 2006 | 30. m/0.25 mm/0.25 μm, He, 3. K/min, 280. C @ 30. min; Tstart: 60. C |
Capillary | HP-5 | 938. | Oliveira, Leitao, et al., 2006 | 25. m/0.2 mm/0.33 μm, 3. K/min; Tstart: 60. C; Tend: 240. C |
Capillary | BP-1 | 934. | Raina, Verma, et al., 2006 | 25. m/0.32 mm/0.25 μm, N2, 5. K/min, 220. C @ 13. min; Tstart: 60. C |
Capillary | BP-1 | 932. | Srivastava, Srivastava, et al., 2006 | 30. m/0.32 mm/0.25 μm, N2, 5. K/min, 220. C @ 3. min; Tstart: 60. C |
Capillary | CP Sil 8 CB | 945. | Tayoub, Schwob, et al., 2006 | 30. m/0.25 mm/0.25 μm, H2, 50. C @ 2. min, 3. K/min; Tend: 220. C |
Capillary | CP Sil 8 CB | 945. | Tayoub, Schwob, et al., 2006, 2 | 30. m/0.25 mm/0.25 μm, H2, 50. C @ 2. min, 3. K/min; Tend: 220. C |
Capillary | SPB-1 | 932. | Walde, Jyothirmayi, et al., 2006 | 30. m/0.32 mm/0.25 μm, He, 60. C @ 4. min, 4. K/min, 240. C @ 2. min |
Capillary | DB-5 | 939. | Adams, Morris, et al., 2005 | 30. m/0.26 mm/0.25 μm, He, 3. K/min; Tstart: 60. C; Tend: 246. C |
Capillary | DB-5 | 939. | Adams and Nguyen, 2005 | 30. m/0.26 mm/0.25 μm, He, 3. K/min; Tstart: 60. C; Tend: 246. C |
Capillary | DB-5 | 917. | Asfaw, Licence, et al., 2005 | 10. m/0.1 mm/0.1 μm, He, 60. C @ 5. min, 5. K/min, 240. C @ 10. min |
Capillary | HP-5MS | 939. | Asuming, Beauchamp, et al., 2005 | 30. m/0.25 mm/0.25 μm, He, 50. C @ 10. min, 3. K/min, 250. C @ 5. min |
Capillary | BP-5 | 938. | Baranauskiene, Venskutonis, et al., 2005 | 50. m/0.32 mm/0.25 μm, He, 50. C @ 2. min, 5. K/min, 260. C @ 5. min |
Capillary | DB-5MS | 940. | Maia, Andrade, et al., 2005 | 30. m/0.25 mm/0.25 μm, He, 3. K/min; Tstart: 60. C; Tend: 240. C |
Capillary | DB-5 | 940. | Medina, Lucero, et al., 2005 | 30. m/0.25 mm/0.25 μm, Helium, 3. K/min; Tstart: 60. C; Tend: 255. C |
Capillary | DB-5 | 939. | Shatar S., 2005 | 3. K/min; Tstart: 60. C; Tend: 240. C |
Capillary | DB-5MS | 936. | Angioni, Barra, et al., 2004 | 30. m/0.25 mm/0.25 μm, He, 60. C @ 15. min, 3. K/min; Tend: 180. C |
Capillary | SPB-1 | 927. | Behera, Nagarajan, et al., 2004 | 30. m/0.32 mm/0.25 μm, He, 50. C @ 2. min, 2. K/min, 250. C @ 5. min |
Capillary | BPX-5 | 930. | El-Ghorab, Mansour, et al., 2004 | 25. m/0.22 mm/0.25 μm, He, 3. K/min; Tstart: 60. C; Tend: 240. C |
Capillary | SPB-5 | 936. | Gauvin, Lecomte, et al., 2004 | 60. m/0.32 mm/1. μm, He, 4. K/min, 200. C @ 30. min; Tstart: 60. C |
Capillary | HP-5MS | 937. | Juliani, Zygadlo, et al., 2004 | 30. m/0.25 mm/0.25 μm, He, 60. C @ 1. min, 4. K/min, 200. C @ 15. min |
Capillary | HP-5 | 938. | Lopes, Strobl, et al., 2004 | 30. m/0.25 mm/0.25 μm, He, 3. K/min; Tstart: 60. C; Tend: 260. C |
Capillary | HP-5 | 942. | Mahmood, Kaul, et al., 2004 | 30. m/0.25 mm/0.25 μm, He, 50. C @ 5. min, 3. K/min, 280. C @ 25. min |
Capillary | DB-5 | 932. | Merle, Morón, et al., 2004 | 25. m/0.25 mm/0.25 μm, He, 60. C @ 6. min, 5. K/min, 180. C @ 15. min |
Capillary | DB-5 | 939. | Morteza-Semnani, Azadbakht, et al., 2004 | 30. m/0.25 mm/0.25 μm, He, 60. C @ 4. min, 4. K/min; Tend: 220. C |
Capillary | CP Sil 5 CB | 939. | Ogunwande, Olawore, et al., 2004 | 25. m/0.25 mm/0.15 μm, H2, 3. K/min; Tstart: 50. C; Tend: 230. C |
Capillary | CP Sil 8 CB | 938. | Schwob, Bessiere, et al., 2004 | 30. m/0.25 mm/0.25 μm, H2, 50. C @ 2. min, 3. K/min; Tend: 220. C |
Capillary | HP-5MS | 929. | Siani, Garrido, et al., 2004 | 30. m/0.32 mm/0.25 μm, He, 70. C @ 5. min, 3. K/min; Tend: 250. C |
Capillary | DB-1 | 934. | Velasco-Negueruela, Sanz, et al., 2004 | 50. m/0.25 mm/0.25 μm, N2, 4. K/min; Tstart: 95. C; Tend: 240. C |
Capillary | SPB-1 | 933. | Yadav, Chauhan, et al., 2004 | 30. m/0.32 mm/0.25 μm, He, 50. C @ 2. min, 2. K/min, 250. C @ 5. min |
Capillary | DB-5 | 932. | Amparo Blázquez, Pérez, et al., 2003 | He, 40. C @ 5. min, 3. K/min, 280. C @ 5. min; Column length: 25. m; Column diameter: 0.25 mm |
Capillary | DB-5 | 944. | Baranauskiene, Venskutonis, et al., 2003 | 50. m/0.32 mm/0.25 μm, He, 50. C @ 2. min, 5. K/min, 280. C @ 10. min |
Capillary | HP-5MS | 942. | Baranauskiene, Venskutonis, et al., 2003, 2 | 30. m/0.25 mm/0.25 μm, He, 50. C @ 2. min, 4. K/min, 280. C @ 10. min |
Capillary | HP-5 | 940. | Bouzouita, Kachouri, et al., 2003 | 30. m/0.25 mm/1. μm, He, 40. C @ 1. min, 5. K/min; Tend: 250. C |
Capillary | HP-5MS | 924. | Couladis, Chinou, et al., 2003 | 30. m/0.25 mm/0.25 μm, He, 3. K/min; Tstart: 60. C; Tend: 280. C |
Capillary | HP-5MS | 928. | Gkinis, Tzakou, et al., 2003 | 30. m/0.25 mm/0.25 μm, He, 3. K/min; Tstart: 60. C; Tend: 280. C |
Capillary | DB-5 | 940. | Lucero, Estell, et al., 2003 | 30. m/0.25 mm/0.25 μm, He, 3. K/min; Tstart: 60. C |
Capillary | CP Sil 5 CB | 941. | Ogunwande, Olawore, et al., 2003 | 25. m/0.25 mm/0.15 μm, He, 3. K/min; Tstart: 50. C; Tend: 230. C |
Capillary | CP Sil 5 CB | 941. | Ogunwande, Olawore, et al., 2003, 2 | 25. m/0.25 mm/0.15 μm, H2, 3. K/min; Tstart: 50. C; Tend: 230. C |
Capillary | HP-5 | 925. | Özcan, Tzakou, et al., 2003 | 30. m/0.25 mm/0.25 μm, He, 3. K/min; Tstart: 60. C; Tend: 280. C |
Capillary | BP-1 | 935. | Raina, Srivastava, et al., 2003 | 25. m/0.32 mm/0.25 μm, N2, 5. K/min, 220. C @ 15. min; Tstart: 60. C |
Capillary | BP-1 | 939. | Srivastava, Ahmad, et al., 2003 | 25. m/0.55 mm/0.25 μm, N2, 5. K/min, 220. C @ 15. min; Tstart: 60. C |
Capillary | DB-5 | 936. | Viña and Murillo, 2003 | 30. m/0.25 mm/0.25 μm, He, 50. C @ 5. min, 0.5 K/min, 250. C @ 10. min |
Capillary | DB-5 | 943. | Buchin, Salmon, et al., 2002 | 60. m/0.32 mm/1. μm, He, 40. C @ 5. min, 3. K/min, 230. C @ 2. min |
Capillary | DB-5 | 944. | El-Ghorab, Fadel, et al., 2002 | 25. m/0.22 mm/0.25 μm, He, 3. K/min; Tstart: 60. C; Tend: 240. C |
Capillary | DB-5 | 943.5 | El-Massry, El-Ghorab, et al., 2002 | 30. m/0.25 mm/0.5 μm, 50. C @ 3. min, 7. K/min, 250. C @ 10. min |
Capillary | SPB-1 | 953. | Jayaprakasha, Rao, et al., 2002 | 30. m/0.32 mm/0.25 μm, He, 60. C @ 2. min, 2. K/min, 225. C @ 5. min |
Capillary | SE-30 | 937. | Juliani, Koroch, et al., 2002 | He, 4. K/min; Column length: 30. m; Column diameter: 0.25 mm; Tstart: 60. C; Tend: 240. C |
Capillary | HP-5 | 936. | Juliani and Simon, 2002 | 30. m/0.25 mm/0.25 μm, He, 60. C @ 1. min, 4. K/min, 200. C @ 15. min |
Capillary | CP Sil 5 CB | 941. | Kasali, Adio, et al., 2002 | He, 3. K/min; Column length: 25. m; Column diameter: 0.25 mm; Tstart: 50. C; Tend: 230. C |
Capillary | HP-5 | 939. | Mita, Tsitsimpikou, et al., 2002 | 30. m/0.25 mm/0.25 μm, He, 3. K/min, 240. C @ 20. min; Tstart: 60. C |
Capillary | Methyl Silicone | 927. | Palá-Paúl, Pérez-Alonso, et al., 2002 | 50. m/0.25 mm/0.25 μm, He, 4. K/min; Tstart: 70. C; Tend: 240. C |
Capillary | SE-30 | 928. | Palá-Paúl, Velasco-Negueruela, et al., 2002 | 25. m/0.22 mm/0.25 μm, He, 4. K/min; Tstart: 70. C; Tend: 220. C |
Capillary | BP-1 | 938. | Raina, Lal, et al., 2002 | 60. m/0.32 mm/0.25 μm, N2, 5. K/min; Tstart: 60. C; Tend: 220. C |
Capillary | BP-1 | 935. | Raina, Srivastava, et al., 2002 | 25. m/0.32 mm/0.25 μm, N2, 5. K/min, 220. C @ 15. min; Tstart: 60. C |
Capillary | BP-1 | 935. | Raina, Srivastava, et al., 2002, 2 | 25. m/0.55 mm/0.25 μm, N2, 5. K/min, 220. C @ 15. min; Tstart: 60. C |
Capillary | Cross-Linked Methylsilicone | 934. | Rajeswara Rao, Kaul, et al., 2002 | 50. m/0.2 mm/0.25 μm, He, 4. K/min; Tstart: 100. C; Tend: 280. C |
Capillary | BP-1 | 935. | Rajeswara Rao, 2002 | 25. m/0.5 mm/0.25 μm, N2, 5. K/min, 220. C @ 10. min; Tstart: 60. C |
Capillary | BP-1 | 935. | Rao B.R.R., 2002 | 25. m/0.5 mm/0.25 μm, 5. K/min, 220. C @ 10. min; Tstart: 60. C |
Capillary | BP-1 | 935. | Rao B.R.R., 2002 | 25. m/0.5 mm/0.25 μm, 5. K/min, 220. C @ 10. min; Tstart: 60. C |
Capillary | HP-5MS | 936. | Salido, Altarejos, et al., 2002 | 30. m/0.25 mm/0.25 μm, He, 3. K/min; Tstart: 50. C; Tend: 250. C |
Capillary | BP-1 | 932. | Shawl, Srivastava, et al., 2002 | 30. m/0.32 mm/0.25 μm, N2, 5. K/min, 220. C @ 13. min; Tstart: 60. C |
Capillary | HP-5 | 930. | Yáñez, Pinzón, et al., 2002 | 50. m/0.25 mm/0.25 μm, He, 50. C @ 5. min, 2.5 K/min; Tend: 250. C |
Capillary | DB-5 | 938. | Akrout, Chemli, et al., 2001 | 25. m/0.20 mm/0.25 μm, He, 5. K/min; Tstart: 50. C; Tend: 240. C |
Capillary | BP-1 | 933. | Jain, Aggarwal, et al., 2001 | 25. m/0.55 mm/0.25 μm, N2, 5. K/min, 220. C @ 15. min; Tstart: 60. C |
Capillary | BP-1 | 929. | Jain, Srivastava, et al., 2001 | 25. m/0.55 mm/0.25 μm, N2, 5. K/min, 220. C @ 15. min; Tstart: 60. C |
Capillary | HP-5 | 939. | Kitic, Palic, et al., 2001 | 25. m/0.32 mm/0.52 μm, H2, 4. K/min; Tstart: 40. C; Tend: 240. C |
Capillary | DB-5 | 935. | Moreira, Sousa, et al., 2001 | H2, 3. K/min; Column length: 30. m; Column diameter: 0.20 mm; Tstart: 60. C; Tend: 240. C |
Capillary | DB-1 | 930. | Nagalakshmi, Thangadurai, et al., 2001 | 28. m/0.25 mm/0.25 μm, He, 50. C @ 1. min, 4.5 K/min; Tend: 270. C |
Capillary | DB-1 | 926. | Palá-Paúl, Velasco-Negueruela, et al., 2001 | 50. m/0.25 mm/0.25 μm, N2, 4. K/min; Tstart: 80. C; Tend: 225. C |
Capillary | BP-1 | 931. | Raina, Srivastava, et al., 2001 | 25. m/0.55 mm/0.25 μm, N2, 5. K/min, 220. C @ 15. min; Tstart: 60. C |
Capillary | DB-1 | 929. | Senatore and Rigano, 2001 | 30. m/0.25 mm/0.25 μm, He, 40. C @ 5. min, 2. K/min, 260. C @ 20. min |
Capillary | HP-5 | 935. | Tzakou and Couladis, 2001 | 30. m/0.25 mm/0.25 μm, He, 3. K/min; Tstart: 60. C; Tend: 280. C |
Capillary | DB-1 | 928. | Abella, Cortella, et al., 2000 | 30. m/0.25 mm/0.25 μm, 4. K/min; Tstart: 80. C; Tend: 225. C |
Capillary | SE-54 | 939. | Adams, 2000 | 30. m/0.26 mm/0.25 μm, He, 3. K/min; Tstart: 60. C; Tend: 246. C |
Capillary | DB-5 | 939. | Adams, 2000, 2 | 30. m/0.26 mm/0.25 μm, He, 3. K/min; Tstart: 60. C; Tend: 240. C |
Capillary | SE-54 | 939. | Adams, 2000, 3 | 30. m/0.26 mm/0.25 μm, 3. K/min; Tstart: 60. C; Tend: 246. C |
Capillary | DB-5 | 939. | Adams, 2000, 4 | 30. m/0.26 mm/0.25 μm, He, 3. K/min; Tstart: 60. C; Tend: 246. C |
Capillary | SE-30 | 930. | Kardali, Velasco-Negueruela, et al., 2000 | 25. m/0.22 mm/0.25 μm, He, 5. K/min; Tstart: 70. C; Tend: 220. C |
Capillary | HP-5 | 933. | Ramos, Siani, et al., 2000 | 30. m/0.32 mm/0.25 μm, He, 3. K/min; Tstart: 70. C; Tend: 250. C |
Capillary | BP-1 | 935. | Rao, Kaul, et al., 2000 | N2, 5. K/min, 220. C @ 10. min; Column length: 25. m; Column diameter: 0.5 mm; Tstart: 60. C |
Capillary | BP-1 | 935. | Rao, Sastry, et al., 2000 | 25. m/0.50 mm/0.25 μm, N2, 5. K/min, 220. C @ 10. min; Tstart: 60. C |
Capillary | HP-5MS | 942. | Roussis, Tsoukatou, et al., 2000 | 30. m/0.25 mm/0.25 μm, He, 3. K/min; Tstart: 60. C; Tend: 280. C |
Capillary | DB-5 | 936. | Tzakou, Harvala, et al., 2000 | 50. C @ 5. min, 3. K/min; Column length: 30. m; Column diameter: 0.32 mm; Tend: 250. C |
Capillary | DB-5 | 939. | Adams, 1999 | 30. m/0.26 mm/0.25 μm, He, 3. K/min; Tstart: 60. C; Tend: 246. C |
Capillary | SE-30 | 936. | Jantan I. and Ahmad A.S., 1999 | He, 60. C @ 10. min, 3. K/min; Column length: 25. m; Column diameter: 0.2 mm; Tend: 180. C |
Capillary | SPB-1 | 937. | John, Rao, et al., 1999 | 30. m/0.32 mm/0.25 μm, He, 50. C @ 3. min, 2. K/min, 250. C @ 5. min |
Capillary | CP Sil 5 CB | 939. | Kaul, Gujral, et al., 1999 | He, 5. K/min; Column length: 25. m; Column diameter: 0.25 mm; Tstart: 60. C; Tend: 280. C |
Capillary | OV-101 | 934. | Kuiate, Zollo, et al., 1999 | 5. K/min; Column length: 25. m; Column diameter: 0.32 mm; Tstart: 50. C; Tend: 200. C |
Capillary | DB-5 | 937. | Lopes, Kato, et al., 1999 | 3. K/min; Column length: 30. m; Column diameter: 0.25 mm; Tstart: 60. C; Tend: 240. C |
Capillary | DB-5 | 939. | Lopes, Kato, et al., 1999 | 3. K/min; Column length: 30. m; Column diameter: 0.25 mm; Tstart: 60. C; Tend: 240. C |
Capillary | HP-5 | 935. | Sajjadi and Ghassemi, 1999 | 30. m/0.25 mm/0.25 μm, He, 4. K/min; Tstart: 60. C; Tend: 280. C |
Capillary | DB-5 | 910. | Senatore and de Feo, 1999 | 30. m/0.25 mm/0.33 μm, He, 40. C @ 5. min, 2. K/min, 260. C @ 20. min |
Capillary | HP-5MS | 942. | Siani, Ramos, et al., 1999 | 30. m/0.32 mm/0.25 μm, He, 70. C @ 5. min, 3. K/min; Tend: 250. C |
Capillary | DB-5 | 936. | da Silva, Andrade, et al., 1999 | 30. m/0.25 mm/0.25 μm, He, 3. K/min; Tstart: 60. C; Tend: 240. C |
Capillary | DB-5 | 934. | da Silva, Zoghbi, et al., 1999 | 30. m/0.25 mm/0.25 μm, He, 4. K/min; Tstart: 60. C; Tend: 240. C |
Capillary | BP-1 | 934. | Vera and Chane-Ming, 1999 | 50. m/0.25 mm/0.25 μm, 2. K/min; Tstart: 60. C; Tend: 260. C |
Capillary | BP-1 | 942. | Vera and Chane-Ming, 1999 | 50. m/0.25 mm/0.25 μm, 2. K/min; Tstart: 60. C; Tend: 260. C |
Capillary | Methyl Silicone | 940. | Adegoke, Rao, et al., 1998 | 30. m/0.32 mm/0.25 μm, He, 60. C @ 2. min, 2. K/min, 250. C @ 5. min |
Capillary | DB-1 | 928. | Bylaite, Venskutonis, et al., 1998 | 60. m/0.25 mm/0.25 μm, He, 50. C @ 5. min, 3. K/min, 250. C @ 10. min |
Capillary | DB-5 | 909. | de Feo, Porta, et al., 1998 | 30. m/0.25 mm/0.25 μm, He, 40. C @ 5. min, 2. K/min, 250. C @ 20. min |
Capillary | CP Sil 5 CB | 927. | Kaul and Vats, 1998 | 5. K/min; Column length: 25. m; Column diameter: 0.25 mm; Tstart: 60. C; Tend: 280. C |
Capillary | BP-1 | 934. | Kulkarni, Mallavarapu, et al., 1998 | N2, 5. K/min; Column length: 25. m; Column diameter: 0.25 mm; Tstart: 60. C; Tend: 220. C |
Capillary | Methyl Silicone | 936. | Mallavarapu, Rao, et al., 1998 | N2, 5. K/min; Column length: 25. m; Column diameter: 0.5 mm; Tstart: 60. C; Tend: 220. C |
Capillary | DB-5 | 910. | Senatore, 1998 | 30. m/0.25 mm/0.25 μm, He, 40. C @ 5. min, 2. K/min, 250. C @ 20. min |
Capillary | DB-5 | 930. | Zoghbi, Andrade, et al., 1998 | 30. m/0.25 mm/0.25 μm, He, 4. K/min; Tstart: 60. C; Tend: 240. C |
Capillary | BP-1 | 938. | Breheret, Talou, et al., 1997 | 50. m/0.22 mm/1. μm, He, 3. K/min; Tstart: 50. C; Tend: 220. C |
Capillary | DB-1 | 927. | Breheret, Talou, et al., 1997 | 25. m/0.23 mm/0.13 μm, He, 60. C @ 2. min, 4. K/min; Tend: 200. C |
Capillary | DB-1 | 929. | Fiorini, Fourasté, et al., 1997 | He, 3. K/min; Column length: 30. m; Column diameter: 0.23 mm; Tstart: 50. C; Tend: 200. C |
Capillary | BPX-5 | 941. | Fournier, Hadjiakhoondi, et al., 1997 | 50. m/0.22 mm/0.25 μm, N2, 60. C @ 10. min, 2. K/min; Tend: 185. C |
Capillary | SPB-1 | 953. | Jayaprakasha, Jaganmohan Rao, et al., 1997 | 30. m/0.32 mm/0.25 μm, He, 60. C @ 2. min, 5. K/min, 250. C @ 5. min |
Capillary | DB-5 | 909. | Senatore, Urrunaga Soria, et al., 1997 | 30. m/0.25 mm/0.25 μm, He, 40. C @ 5. min, 2. K/min, 250. C @ 20. min |
Capillary | DB-5 | 938. | Tellez, Estell, et al., 1997 | 30. m/0.25 mm/0.25 μm, He, 3. K/min; Tstart: 60. C; Tend: 240. C |
Capillary | SE-30 | 936. | Jantan, Ahmad, et al., 1996 | N2, 60. C @ 10. min, 3. K/min, 180. C @ 1. min; Column length: 25. m; Column diameter: 0.2 mm |
Capillary | OV-101 | 938. | Padrayuttawat, Tamura, et al., 1996 | 50. m/0.25 mm/0.2 μm, N2, 2. K/min, 200. C @ 60. min; Tstart: 80. C |
Capillary | OV-101 | 935. | von Poser, Menut, et al., 1996 | 25. m/0.25 mm/0.25 μm, N2, 5. K/min; Tstart: 50. C; Tend: 200. C |
Capillary | SE-30 | 936. | Jantan, Ali, et al., 1995 | N2, 60. C @ 10. min, 3. K/min, 180. C @ 1. min; Column length: 25. m; Column diameter: 0.2 mm |
Capillary | DB-5 | 938. | Loayza, Abujder, et al., 1995 | 40. C @ 2. min, 2. K/min, 210. C @ 120. min; Column length: 30. m |
Capillary | DB-5 | 938. | Loayza, Abujder, et al., 1995 | 40. C @ 2. min, 2. K/min, 210. C @ 120. min; Column length: 30. m |
Capillary | DB-5 | 938. | Loayza, Abujder, et al., 1995 | 40. C @ 2. min, 2. K/min, 210. C @ 120. min; Column length: 30. m |
Capillary | OV-101 | 935. | Menut, Molangui, et al., 1995 | N2, 5. K/min; Column length: 25. m; Column diameter: 0.25 mm; Tstart: 50. C; Tend: 200. C |
Capillary | DB-1 | 930. | Saad, El-Sharkawy, et al., 1995 | 28. m/0.25 mm/0.25 μm, He, 50. C @ 1. min, 4. K/min; Tend: 270. C |
Capillary | DB-5 | 937. | Ramarathnam, Rubin, et al., 1993 | He, 30. C @ 2. min, 10. K/min, 280. C @ 3. min; Column length: 30. m; Column diameter: 0.13 mm |
Capillary | SPB-1 | 927. | Wong and Tie, 1993 | He, 35. C @ 5. min, 3. K/min, 200. C @ 20. min; Column length: 50. m; Column diameter: 0.20 mm |
Capillary | SE-54 | 928. | Rembold, Wallner, et al., 1989 | 30. m/0.25 mm/0.25 μm, He, 0. C @ 12. min, 12. K/min; Tend: 250. C |
Capillary | BP-1 | 932. | Bartley, 1988 | He, 2. K/min; Column length: 50. m; Tstart: -100. C; Tend: 200. C |
Capillary | OV-1 | 929. | Bicchi, Frattini, et al., 1988 | 23. m/0.32 mm/0.3 μm, H2, 3. K/min; Tstart: 50. C; Tend: 200. C |
Capillary | BP-1 | 938. | Ekundayo, Laakso, et al., 1988 | H2, 65. C @ 2. min, 5. K/min; Column length: 50. m; Column diameter: 0.33 mm; Tend: 220. C |
Capillary | OV-101 | 940. | Gaydou, Randriamiharisoa, et al., 1986 | 100. m/0.3 mm/0.15 μm, H2, 2. K/min; Tstart: 90. C; Tend: 220. C |
Capillary | DB-1 | 961. | Burns and Tingey, 1983 | 60. m/0.25 mm/1. μm, He, 40. C @ 4. min, 12. K/min; Tend: 250. C |
Capillary | DB-1 | 951. | Burns and Tingey, 1983 | 60. m/0.25 mm/1. μm, He, 4. K/min; Tstart: 40. C; Tend: 250. C |
Capillary | SE-30 | 933. | Greenberg, 1981 | He, 40. C @ 3. min, 3. K/min; Column length: 50. m; Column diameter: 0.5 mm; Tend: 170. C |
Capillary | SE-30 | 934. | Greenberg, 1981 | He, 40. C @ 3. min, 3. K/min; Column length: 50. m; Column diameter: 0.5 mm; Tend: 170. C |

Kovats' RI, non-polar column, custom temperature program

Column type | Active phase | I | Reference | Comment |
---|---|---|---|---|
Capillary | HP-5 | 938. | de Marchese, de Heluani, et al., 2007 | He; Program: 60C(5min) => 3C/min => 100C => 1C/min => 160C => 10C/min => 240C(10min) |
Capillary | BP-1 | 932. | Khan, Verma, et al., 2006 | 30. m/0.32 mm/0.25 μm, N2; Program: 60C => 5C/min => 220C (5min) => 3C/min => 245C(5min) |
Capillary | DB-5 | 921. | Lima, Barros, et al., 2005 | 30. m/0.25 mm/0.1 μm, He; Program: 35C => 4C/min => 180C => 20C/min => 280C |
Capillary | CP Sil 8 CB | 940. | Radusiene, Judzentiene, et al., 2005 | 50. m/0.32 mm/0.25 μm, He; Program: 60C(1min) => 3C/min => 70C => 15C/min => 170C(8min) => 5C/min => 250C |
Capillary | DB-5MS | 937. | Tuberoso, Kowalczyk, et al., 2005 | 30. m/0.25 mm/0.25 μm, He; Program: 60C(5min) => 2C/min => 140C= 5C/min => 250C(5min) |
Capillary | BP-1 | 933. | Dwivedi, Khan, et al., 2004 | 25. m/0.25 mm/0.25 μm, N2; Program: 60C => 5C/min => 220C(5min) => 3C/min => 245C(5min) |
Capillary | DB-5 | 934. | Araújo, Silveira, et al., 2003 | 30. m/0.25 mm/0.25 μm, He; Program: 35C => 4C/min => 180C => 20C/min => 280C |
Capillary | HP-5 | 939. | Daferera, Ziogas, et al., 2003 | 30. m/0.25 mm/0.25 μm, He; Program: 40C (3min) => 3C/min => 180C => 30C/min => 270C (5min) |
Capillary | BP-1 | 934. | Khan, Srivastava, et al., 2003 | 25. m/0.25 mm/0.25 μm, N2; Program: 60C => 5C/min => 220C (5min) => 3C/min => 245 C (5min) |
Capillary | HP-5 | 939. | Shellie and Marriott, 2003 | 30. m/0.25 mm/0.25 μm, He; Program: not specified |
Capillary | OV-1 | 924. | El-Shazly, Dorai, et al., 2002 | 15. m/0.317 mm/0.25 μm, He; Program: 50C(4min) => (4C/min) => 90C => (10C/min)=300C(10min) |
Capillary | OV-1 | 923. | El-Shazly, Dorai, et al., 2002, 2 | 30. m/0.25 mm/0.25 μm, He; Program: 44C(4min) => 3C/min => 74C => 6C/min => 134C => 12C/min => 312C |
Capillary | BP-1 | 934. | Khan, Srivastava, et al., 2002 | 30. m/0.32 mm/0.25 μm, N2; Program: 60 C 5 C/min -> 220 C (5 min) 3 C/min -> 245 C (5 min) |
Capillary | DB-5 | 938. | Bizzo, Lopes, et al., 2001 | Program: not specified |
Capillary | HP-5 | 928. | Frizzo, Serafini, et al., 2001 | 30. m/0.32 mm/0.25 μm, H2; Program: 60 0C (8 min) 3 K/min -> 180 0C 20 K/min (20 min) |
Capillary | DB-5 | 939. | Moreira, Sousa, et al., 2001 | H2; Column length: 30. m; Column diameter: 0.20 mm; Program: not specified |
Capillary | HP-5 | 938. | Novak, Zitterl-Eglseer, et al., 2001 | 30. m/0.25 mm/0.25 μm, He; Program: 50 0C 5 K/min -> 140 0C 2 K/min -> 170 0C |
Capillary | AT-5 | 938. | Khouri, Usubillaga, et al., 2000 | 60. m/0.25 mm/0.25 μm, He; Program: 60 C 4K/min -> 200 C 10 K/min -> 280 C |
Capillary | DB-5MS | 935. | Maia, Andrade, et al., 2000 | 30. m/0.25 mm/0.25 μm, He; Program: 40C => 2C/min => 60C => 4C/min => 260C |
Capillary | AT-5 | 940. | Rojas and Usubillaga, 2000 | 60. m/0.25 mm/0.25 μm, He; Program: 60 C (1 min) 4 K/min -> 200 C 10 K/min -> 280 C |
Capillary | DB-5 | 939. | Adams, 1998 | 30. m/0.26 mm/0.25 μm; Program: not specified |
Capillary | DB-5 | 935. | Santos, Andrade, et al., 1998 | 30. m/0.25 mm/0.25 μm, He; Program: 40C => 2C/min => 60C => 4C/min => 240C |
Capillary | BP-1 | 942. | MacLeod, MacLeod, et al., 1988 | Column length: 25. m; Column diameter: 0.2 mm; Program: not specified |
Capillary | SF-96 | 940. | Okamoto, Ellison, et al., 1981 | Column length: 127. m; Column diameter: 0.75 mm; Program: not specified |
Capillary | SF-96 | 939. | Malingré and Maarse, 1974 | Column length: 150. m; Column diameter: 0.75 mm; Program: not specified |
Packed | SE-30 | 959. | Minyard, Tumlinson, et al., 1967 | He, Chromasorb W; Column length: 6.1 m; Program: 150C (10min) => 15C/min => 200C(16min) => 10C/min => 240C |

Kovats' RI, polar column, isothermal

Column type | Active phase | Temperature (C) | I | Reference | Comment |
---|---|---|---|---|---|
Capillary | PEG-20M | 100. | 1042. | Morishita, Okano, et al., 1980 | Column length: 75. m; Column diameter: 0.25 mm |
Capillary | Carbowax 20M | 100. | 1049.7 | Saeed, Redant, et al., 1979 | Phase thickness: 0.5 μm |
Capillary | Carbowax 20M | 70. | 1036.7 | Saeed, Redant, et al., 1979 | Phase thickness: 0.5 μm |
Capillary | Carbowax 20M | 90. | 1046.6 | Saeed, Redant, et al., 1979 | Phase thickness: 0.5 μm |
Capillary | Carbowax 20M | 70. | 1039. | Kepner, Ellison, et al., 1974 | Column length: 152. m; Column diameter: 0.8 mm |
Capillary | Carbowax 20M | 70. | 1038. | Malingré and Maarse, 1974 | Column length: 150. m; Column diameter: 0.75 mm |
Packed | PEG 4000 | 175. | 1072. | Hedin, Thompson, et al., 1972 | N2, Chromosorb P; Column length: 6.145 m |
Packed | PEG-20M | 150. | 1077. | Luisetti and Yunes, 1971 | N2, Celite 545; Column length: 4. m |
Capillary | Carbowax 20M | 75. | 1022.5 | Andersen and Syrdal, 1970 | |
Capillary | Carbowax 20M + Igepal (20:1) | 75. | 1036. | Sakai, Maarse, et al., 1967 | He, GAS PAK F; Column length: 152. m; Column diameter: 0.8 mm |
Packed | Carbowax 4000 | 130. | 1071. | Minyard, Tumlinson, et al., 1965 | N2, Gas Chrom P (60-80 mesh); Column length: 6.1 m |

Kovats' RI, polar column, temperature ramp

Column type | Active phase | I | Reference | Comment |
---|---|---|---|---|
Capillary | Stabilwax | 1026. | Hazzit, Baaliouamer, et al., 2006 | 30. m/0.32 mm/1. μm, N2, 50. C @ 3. min, 2. K/min, 220. C @ 15. min |
Capillary | BP-20 | 1032. | Khan, Verma, et al., 2006 | 30. m/0.32 mm/0.25 μm, N2, 5. K/min, 220. C @ 14. min; Tstart: 60. C |
Capillary | HP-FFAP | 1045. | Radusiene, Judzentiene, et al., 2005 | 30. m/0.25 mm/0.3 μm, He, 70. C @ 10. min, 3. K/min; Tend: 210. C |
Capillary | HP-Wax | 1031. | Gauvin, Lecomte, et al., 2004 | 50. m/0.2 mm/0.4 μm, He, 4. K/min, 230. C @ 30. min; Tstart: 60. C |
Capillary | DB-Wax | 1015. | Lopes, Strobl, et al., 2004 | 30. m/0.32 mm/0.25 μm, He, 40. C @ 5. min, 3. K/min; Tend: 220. C |
Capillary | Innowax | 1036. | Mahmood, Kaul, et al., 2004 | 30. m/0.25 mm/0.25 μm, He, 5. K/min, 190. C @ 5. min; Tstart: 40. C |
Capillary | Innowax | 1012. | Viña and Murillo, 2003 | 30. m/0.25 mm/0.25 μm, He, 50. C @ 5. min, 0.5 K/min, 250. C @ 10. min |
Capillary | Supelcowax-10 | 1029. | Tzakou and Couladis, 2001 | 30. m/0.32 mm/0.25 μm, He, 3. K/min; Tstart: 75. C; Tend: 230. C |
Capillary | Carbowax 20M | 1023. | Vera and Chane-Ming, 1999 | 50. m/0.32 mm/0.2 μm, 2. K/min; Tstart: 60. C; Tend: 260. C |
Capillary | Carbowax 20M | 1039. | Vera and Chane-Ming, 1999 | 50. m/0.32 mm/0.2 μm, 2. K/min; Tstart: 60. C; Tend: 260. C |
Capillary | Carbowax 20M | 1017. | Kulkarni, Mallavarapu, et al., 1998 | N2, 5. K/min; Column length: 25. m; Column diameter: 0.25 mm; Tstart: 60. C; Tend: 200. C |
Capillary | Carbowax 20M | 1029. | Mallavarapu, Rao, et al., 1998 | N2, 5. K/min; Column length: 25. m; Column diameter: 0.5 mm; Tstart: 60. C; Tend: 200. C |
Capillary | Supelcowax-10 | 1021. | Loayza, Abujder, et al., 1995 | 40. C @ 2. min, 2. K/min, 210. C @ 120. min; Column length: 30. m |
Capillary | Supelcowax-10 | 1012. | Loayza, Abujder, et al., 1995 | 40. C @ 2. min, 2. K/min, 210. C @ 120. min; Column length: 30. m |
Capillary | Supelcowax-10 | 1014. | Loayza, Abujder, et al., 1995 | 40. C @ 2. min, 2. K/min, 210. C @ 120. min; Column length: 30. m |
Capillary | DB-Wax | 1020. | Umano, Hagi, et al., 1994 | He, 40. C @ 2. min, 2. K/min; Column length: 60. m; Column diameter: 0.25 mm; Tend: 200. C |
Capillary | Supelcowax-10 | 1030. | Wong and Tie, 1993 | He, 35. C @ 5. min, 3. K/min, 200. C @ 20. min; Column length: 60. m; Column diameter: 0.25 mm |
Capillary | Supelcowax-20M | 1018. | Bicchi, Frattini, et al., 1988 | 23. m/0.32 mm/0.30 μm, H2, 50. C @ 1. min, 3. K/min; Tend: 200. C |
Capillary | DB-Wax | 1013. | Umano and Shibamoto, 1988 | 40. C @ 10. min, 2. K/min; Column length: 60. m; Column diameter: 0.25 mm; Tend: 220. C |
Capillary | DB-Wax | 1011. | Umano and Shibamoto, 1988 | 40. C @ 10. min, 2. K/min; Column length: 60. m; Column diameter: 0.25 mm; Tend: 220. C |
Capillary | Carbowax 20M | 1000. | Randriamiharisoa and Gaydou, 1987 | He, 2. K/min; Column length: 50. m; Column diameter: 0.3 mm; Tstart: 70. C; Tend: 210. C |
Capillary | BP-20 | 1032. | Wyllie, Cook, et al., 1987 | 70. C @ 2. min, 4. K/min; Column length: 25. m; Column diameter: 0.332 mm; Tend: 200. C |
Capillary | Carbowax 20M | 1038. | Gaydou, Randriamiharisoa, et al., 1986 | 50. m/0.3 mm/0.15 μm, H2, 2. K/min; Tstart: 70. C; Tend: 210. C |
Capillary | Carbowax 20M | 1031. | Bernhard, Shibamoto, et al., 1983 | 3. K/min; Column length: 100. m; Column diameter: 0.28 mm; Tstart: 80. C; Tend: 200. C |
Capillary | Carbowax 20M | 1031. | Bernhard, Shibamoto, et al., 1983 | 3. K/min; Column length: 100. m; Column diameter: 0.28 mm; Tstart: 80. C; Tend: 200. C |
Capillary | Carbowax 20M | 1040. | Tressl, Friese, et al., 1978 | He, 2. K/min; Column length: 50. m; Column diameter: 0.28 mm; Tstart: 70. C; Tend: 190. C |

Kovats' RI, polar column, custom temperature program

Column type | Active phase | I | Reference | Comment |
---|---|---|---|---|
Capillary | HP-Innowax | 1027. | Frizzo, Serafini, et al., 2001 | 30. m/0.32 mm/0.50 μm, H2; Program: 60 0C (8 min) 3 K/min -> 180 0C 20 K/min -> 230 0C (20 min) |
Capillary | Carbowax | 1038. | Okamoto, Ellison, et al., 1981 | Column length: 127. m; Column diameter: 0.75 mm; Program: not specified |

Van Den Dool and Kratz RI, non-polar column, temperature ramp

Column type | Active phase | I | Reference | Comment |
---|---|---|---|---|
Capillary | RTX-1 | 931. | Bendahou, Muselli, et al., 2008 | 60. m/0.22 mm/0.25 μm, He, 2. K/min, 230. C @ 30. min; Tstart: 60. C |
Capillary | DB-5MS | 933. | Cho, Namgung, et al., 2008 | 30. m/0.25 mm/0.25 μm, He, 40. C @ 1. min, 4. K/min, 200. C @ 10. min |
Capillary | DB-5 | 942. | Baccouri, Ben Temime, et al., 2007 | 30. m/0.25 mm/0.25 μm, He, 3. K/min; Tstart: 60. C; Tend: 240. C |
Capillary | SPB-5 | 935. | Balbontin, Gaete-Eastman, et al., 2007 | 30. m/0.25 mm/0.25 μm, He, 50. C @ 2. min, 20. K/min, 220. C @ 2. min |
Capillary | Equity-5MS | 932. | Belsito E.L., Carbone C., et al., 2007 | 30. m/0.25 mm/0.25 μm, He, 3. K/min, 250. C @ 10. min; Tstart: 50. C |
Capillary | HP-5MS | 934. | Benkaci-Ali, Baaliouamer, et al., 2007 | 30. m/0.25 mm/0.25 μm, He, 60. C @ 8. min, 2. K/min, 250. C @ 30. min |
Capillary | HP-5 | 940. | Benzo, Gilardoni, et al., 2007 | 30. m/0.25 mm/0.25 μm, He, 40. C @ 1. min, 5. K/min, 250. C @ 10. min |
Capillary | BP-1 | 930. | Castilho, Liu, et al., 2007 | 50. m/0.22 mm/0.25 μm, He, 2. K/min, 220. C @ 20. min; Tstart: 60. C |
Capillary | CP-Sil PONA GB | 941. | Cunicao, Lopes, et al., 2007 | 100. m/0.25 mm/0.25 μm, He, 140. C @ 10. min, 5. K/min, 230. C @ 25. min |
Capillary | HP-5 | 934. | Dehghan, Solaimanian, et al., 2007 | 25. m/0.25 mm/0.25 μm, He, 60. C @ 2. min, 4. K/min; Tend: 240. C |
Capillary | BP-1 | 933. | Duquesnoy, Castola, et al., 2007 | 50. m/0.22 mm/0.25 μm, He, 2. K/min, 220. C @ 20. min; Tstart: 60. C |
Capillary | SPB-5 | 943. | Engel and Ratel, 2007 | 60. m/0.32 mm/1. μm, 40. C @ 2. min, 3. K/min, 230. C @ 10. min |
Capillary | DB-5 | 940. | Flamini, Cioni, et al., 2007 | 30. m/0.25 mm/0.25 μm, He, 3. K/min; Tstart: 60. C; Tend: 240. C |
Capillary | HP-5 | 942. | Flamini, Tebano, et al., 2007 | 30. m/0.25 mm/0.25 μm, N2, 50. C @ 10. min, 5. K/min; Tend: 220. C |
Capillary | HP-5 | 941. | Flamini, Tebano, et al., 2007, 2 | 30. m/0.25 mm/0.25 μm, N2, 60. C @ 10. min, 5. K/min; Tend: 220. C |
Capillary | DB-5 | 933. | Hongratanaworakit and Buchbauer, 2007 | 30. m/0.25 mm/0.25 μm, He, 3. K/min; Tstart: 60. C; Tend: 246. C |
Capillary | HP-5MS | 931. | Kundakovic, Fokialakis, et al., 2007 | 30. m/0.25 mm/0.25 μm, He, 3. K/min; Tstart: 60. C; Tend: 280. C |
Capillary | BP-1 | 930. | Lesueur, de Rocca Serra, et al., 2007 | 50. m/0.22 mm/0.25 μm, He, 2. K/min, 220. C @ 20. min; Tstart: 60. C |
Capillary | DB-5 | 941. | Maccioni, Baldini, et al., 2007 | 30. m/0.25 mm/0.25 μm, He, 3. K/min; Tstart: 60. C; Tend: 240. C |
Capillary | DB-5 | 941. | Maccioni, Baldini, et al., 2007 | 30. m/0.25 mm/0.25 μm, He, 3. K/min; Tstart: 60. C; Tend: 240. C |
Capillary | DB-5 | 939. | Martins, Santos, et al., 2007 | 30. m/0.22 mm/0.25 μm, 60. C @ 2. min, 3. K/min; Tend: 240. C |
Capillary | DB-5 | 942. | Methven L., Tsoukka M., et al., 2007 | 60. m/0.32 mm/1. μm, 40. C @ 2. min, 4. K/min, 260. C @ 10. min |
Capillary | RTX-1 | 928. | Muselli, Rossi, et al., 2007 | 60. m/0.22 mm/0.25 μm, He, 2. K/min, 230. C @ 30. min; Tstart: 60. C |
Capillary | RTX-1 | 930. | Paolini J., Costa J., et al., 2007 | 60. m/0.22 mm/0.25 μm, He, 2. K/min, 230. C @ 35. min; Tstart: 60. C |
Capillary | RTX-1 | 933. | Paolini, Muselli, et al., 2007 | 60. m/0.22 mm/0.25 μm, He, 2. K/min, 230. C @ 35. min; Tstart: 60. C |
Capillary | HP-101 | 938. | Politeo, Jukic, et al., 2007 | 25. m/0.20 mm/0.20 μm, Helium, 70. C @ 2. min, 3. K/min, 200. C @ 15. min |
Capillary | HP-5 | 939. | Quijano, Salamanca, et al., 2007 | 30. m/0.25 mm/0.25 μm, He, 50. C @ 4. min, 4. K/min, 250. C @ 10. min |
Capillary | SPB-1 | 946. | Radulovic, Lazarevic, et al., 2007 | 30. m/0.25 mm/0.25 μm, He, 50. C @ 3. min, 5. K/min, 250. C @ 15. min |
Capillary | HP-5MS | 936. | Radulovic, Lazarevic, et al., 2007 | 30. m/0.25 mm/0.25 μm, He, 60. C @ 5. min, 4. K/min; Tend: 280. C |
Capillary | DB-5 | 936. | Sabulal, Dan, et al., 2007 | 30. m/0.25 mm/0.25 μm, He, 5. K/min; Tstart: 60. C; Tend: 260. C |
Capillary | DB-5 | 935. | Silva, Barbosa, et al., 2007 | 30. m/0.22 mm/0.25 μm, He, 55. C @ 2. min, 3. K/min, 240. C @ 15. min |
Capillary | DB-5 | 939. | Telascrea, de Araujo, et al., 2007 | 30. m/0.25 mm/0.25 μm, He, 3. K/min; Tstart: 60. C; Tend: 240. C |
Capillary | HP-5MS | 937. | Vagionas, Ngassapa, et al., 2007 | 30. m/0.25 mm/0.25 μm, He, 3. K/min; Tstart: 60. C; Tend: 280. C |
Capillary | DB-5 | 927. | Wu, Zorn, et al., 2007 | 30. m/0.32 mm/0.25 μm, He, 40. C @ 2. min, 5. K/min, 250. C @ 5. min |
Capillary | DB-5 | 936. | Yu, Liao, et al., 2007 | 30. m/0.25 mm/0.25 μm, He, 3. K/min, 250. C @ 10. min; Tstart: 50. C |
Capillary | HP-5MS | 939.7 | Zeng, Zhao, et al., 2007 | 30. m/0.25 mm/0.25 μm, He, 4. K/min; Tstart: 80. C; Tend: 300. C |
Capillary | CP Sil 5 CB | 937. | Andrianoelisoa H.S., Menut C., et al., 2006 | 30. m/0.25 mm/0.25 μm, N2, 5. K/min; Tstart: 50. C; Tend: 200. C |
Capillary | DB-5 | 932. | Bastos, Ishimoto, et al., 2006 | 30. m/0.25 mm/0.25 μm, 3. K/min; Tstart: 60. C; Tend: 220. C |
Capillary | HP-5MS | 927. | Basta, Tzakou, et al., 2006 | 30. m/0.25 mm/0.25 μm, He, 3. K/min; Tstart: 60. C; Tend: 280. C |
Capillary | DB-5 | 933. | Batista-Pereira, Fernandes, et al., 2006 | 30. m/0.25 mm/0.25 μm, He, 60. C @ 2. min, 3. K/min; Tend: 240. C |
Capillary | DB-5 | 932. | Batista-Pereira, Fernandes, et al., 2006 | 30. m/0.25 mm/0.25 μm, He, 60. C @ 2. min, 3. K/min; Tend: 240. C |
Capillary | DB-5 | 933. | Batista-Pereira, Fernandes, et al., 2006 | 30. m/0.25 mm/0.25 μm, He, 60. C @ 2. min, 3. K/min; Tend: 240. C |
Capillary | SPB-1 | 947. | Blagojevic, Radulovic, et al., 2006 | 30. m/0.25 mm/0.25 μm, He, 50. C @ 3. min, 5. K/min, 250. C @ 15. min |
Capillary | DB-5 | 940. | Blagojevic, Radulovic, et al., 2006 | 30. m/0.2 mm/0.25 μm, He, 50. C @ 3. min, 5. K/min, 250. C @ 15. min |
Capillary | DB-5 | 942. | Block, Flamini, et al., 2006 | 30. m/0.25 mm/0.25 μm, He, 3. K/min; Tstart: 60. C; Tend: 240. C |
Capillary | BP-1 | 930. | Boti, Bighelli, et al., 2006 | 50. m/0.22 mm/0.25 μm, He, 2. K/min, 220. C @ 20. min; Tstart: 60. C |
Capillary | BP-1 | 931. | Bousmaha, Boti, et al., 2006 | 50. m/0.25 mm/0.25 μm, He, 2. K/min, 220. C @ 20. min; Tstart: 60. C |
Capillary | DB-5 | 954. | Bylaite and Meyer, 2006 | 30. m/0.25 mm/1. μm, 50. C @ 1. min, 10. K/min, 290. C @ 10. min |
Capillary | RTX-1 | 931. | Cavalli, Tomi, et al., 2006 | 60. m/0.22 mm/0.25 μm, He, 2. K/min, 230. C @ 45. min; Tstart: 60. C |
Capillary | HP-5MS | 932. | Chorianopoulos N., Evergets E., et al., 2006 | 30. m/0.25 mm/0.25 μm, He, 3. K/min; Tstart: 60. C; Tend: 280. C |
Capillary | 5 % Phenyl methyl siloxane | 941. | Djarri, Medjroubi, et al., 2006 | 25. m/0.25 mm/0.25 μm, He, 3. K/min, 280. C @ 20. min; Tstart: 60. C |
Capillary | DB-5 | 939. | Dob, Dahmane, et al., 2006 | 30. m/0.32 mm/0.25 μm, N2, 60. C @ 3. min, 3. K/min, 240. C @ 5. min |
Capillary | DB-5 | 941. | Dob, Dahmane, et al., 2006, 2 | 30. m/0.25 mm/0.25 μm, N2, 60. C @ 3. min, 3. K/min, 240. C @ 3. min |
Capillary | BP-1 | 930. | Duquesnoy, Dinh, et al., 2006 | 50. m/0.22 mm/0.25 μm, He, 2. K/min, 220. C @ 20. min; Tstart: 60. C |
Capillary | DB-5 | 939. | Esmaeili, Nematollahi, et al., 2006 | 50. m/0.2 mm/0.32 μm, N2, 60. C @ 3. min, 5. K/min, 220. C @ 5. min |
Capillary | HP-5 | 941. | Flamini, Tebano, et al., 2006 | 30. m/0.25 mm/0.25 μm, N2, 60. C @ 10. min, 5. K/min; Tend: 220. C |
Capillary | BP-1 | 934. | Gonny, Cavaleiro, et al., 2006 | 50. m/0.22 mm/0.25 μm, He, 2. K/min, 220. C @ 20. min; Tstart: 60. C |
Capillary | HP-5 | 937. | Javidnia, Miri, et al., 2006 | 30. m/0.25 mm/0.25 μm, He, 3. K/min; Tstart: 60. C; Tend: 260. C |
Capillary | HP-5 | 935. | Javidnia, Miri, et al., 2006, 2 | 30. m/0.25 mm/0.25 μm, He, 3. K/min; Tstart: 60. C; Tend: 250. C |
Capillary | HP-5 | 938. | Javidnia K., Miri R., et al., 2006 | 30. m/0.25 mm/0.25 μm, He, 3. K/min; Tstart: 60. C; Tend: 260. C |
Capillary | DB-1 | 937. | Kuiate, Bessière, et al., 2006 | 30. m/0.25 mm/0.25 μm, N2, 4. K/min; Tstart: 50. C; Tend: 220. C |
Capillary | HP-5 | 932. | Liu J.M., Nan P., et al., 2006 | 30. m/0.25 mm/0.25 μm, He, 60. C @ 2. min, 10. K/min, 250. C @ 10. min |
Capillary | DB-5 | 939. | Masoudi, Esmaeili, et al., 2006 | 50. m/0.2 mm/0.32 μm, N2, 60. C @ 3. min, 5. K/min, 220. C @ 5. min |
Capillary | SLB-5ms | 932. | Mondello and Costa, 2006 | 7. K/min, 325. C @ 10. min; Tstart: 50. C |
Capillary | SLB-5ms | 933. | Mondello and Costa, 2006 | 7. K/min, 325. C @ 10. min; Tstart: 50. C |
Capillary | 5 % Phenyl methyl siloxane | 930. | Mondello and Costa, 2006 | 7. K/min, 325. C @ 10. min; Tstart: 50. C |
Capillary | HP-1 | 928. | Nath, Baruah, et al., 2006 | 25. m/0.2 mm/0.33 μm, He, 60. C @ 3. min, 5. K/min, 300. C @ 30. min |
Capillary | RTX-1 | 929. | Paolini J., Desjobert J.M., et al., 2006 | 60. m/0.22 mm/0.25 μm, He, 2. K/min, 230. C @ 35. min; Tstart: 60. C |
Capillary | HP-5MS | 913. | Pavlovic, Kovacevic, et al., 2006 | 30. m/0.25 mm/0.25 μm, He, 3. K/min; Tstart: 60. C; Tend: 280. C |
Capillary | DB-5 | 934. | Pavlovic, Tzakou, et al., 2006 | 30. m/0.32 mm/0.25 μm, He, 3. K/min; Tstart: 60. C; Tend: 280. C |
Capillary | HP-5 | 936. | Perraudin, Popovici, et al., 2006 | 60. m/0.25 mm/0.25 μm, He, 3. K/min; Tstart: 60. C; Tend: 250. C |
Capillary | SPB-1 | 930. | Pinto, Pina-Vaz, et al., 2006 | 30. m/0.2 mm/0.2 μm, He, 3. K/min, 220. C @ 15. min; Tstart: 70. C |
Capillary | SPB-1 | 946. | Radulovic, Lazarevic, et al., 2006 | 30. m/0.25 mm/0.25 μm, He, 50. C @ 3. min, 5. K/min, 250. C @ 15. min |
Capillary | SPB-1 | 940. | Radulovic, Mananjarasoa, et al., 2006 | 30. m/0.25 mm/0.25 μm, He, 50. C @ 3. min, 5. K/min, 250. C @ 15. min |
Capillary | DB-1 | 930. | Ramezani, Behravan, et al., 2006 | 30. m/0.25 mm/0.25 μm, He, 2.5 K/min; Tstart: 50. C; Tend: 265. C |
Capillary | DB-1 | 946. | Rezazadeh, Hamedani, et al., 2006 | 30. m/0.25 mm/0.25 μm, He, 4. K/min; Tstart: 60. C; Tend: 240. C |
Capillary | HP-5 | 939. | Rezazadeh, Hamedani, et al., 2006 | 25. m/0.25 mm/0.25 μm, He, 4. K/min; Tstart: 60. C; Tend: 240. C |
Capillary | OV-1 | 940. | Rubiolo P., Matteodo M., et al., 2006 | 25. m/0.25 mm/0.25 μm, He, 50. C @ 1. min, 3. K/min, 220. C @ 5. min |
Capillary | SPB-1 | 930. | Salgueiro L.R., Pinto E., et al., 2006 | 30. m/0.2 mm/0.2 μm, He, 3. K/min, 220. C @ 15. min; Tstart: 70. C |
Capillary | DB-5 | 939. | Su, Ho, et al., 2006 | 30. m/0.25 mm/0.25 μm, He, 50. C @ 2. min, 5. K/min; Tend: 250. C |
Capillary | DB-5 | 939. | Su, Ho, et al., 2006, 2 | 30. m/0.25 mm/0.25 μm, He, 50. C @ 2. min, 5. K/min; Tend: 250. C |
Capillary | HP-5 | 931. | Vundac, Pfeifhofer, et al., 2006 | 30. m/0.25 mm/0.25 μm, He, 40. C @ 5. min, 4. K/min; Tend: 300. C |
Capillary | HP-5MS | 939.5 | Zhao C.X., Li, et al., 2006 | 30. m/0.25 mm/0.25 μm, He, 4. K/min; Tstart: 80. C; Tend: 300. C |
Capillary | HP-5 | 943. | Zhao J.Y., Liu J.M., et al., 2006 | 30. m/0.25 mm/0.25 μm, He, 60. C @ 2. min, 10. K/min, 250. C @ 10. min |
Capillary | CP Sil 5 CB | 936. | Ziegenbein, Hanssen, et al., 2006 | H2, 10. K/min; Column length: 25. m; Column diameter: 0.25 mm; Tstart: 80. C; Tend: 270. C |
Capillary | CP Sil 5 CB | 936. | Ziegenbein, Hanssen, et al., 2006, 2 | 25. m/0.25 mm/0.4 μm, He, 10. K/min; Tstart: 80. C; Tend: 270. C |
Capillary | DB-5 | 930. | Agnihotri, Agarwal, et al., 2005 | 30. m/0.25 mm/0.25 μm, He, 90. C @ 2. min, 4. K/min; Tend: 220. C |
Capillary | DB-1 | 926. | Agnaniet, Makani, et al., 2005 | 30. m/0.25 mm/0.25 μm, N2, 5. K/min; Tstart: 50. C; Tend: 200. C |
Capillary | SPB-1 | 946. | Boskovic, Radulovic, et al., 2005 | 30. m/0.25 mm/0.25 μm, He, 50. C @ 3. min, 5. K/min, 250. C @ 15. min |
Capillary | DB-5 | 937. | Boskovic, Radulovic, et al., 2005 | 30. m/0.2 mm/0.25 μm, He, 50. C @ 3. min, 5. K/min, 250. C @ 15. min |
Capillary | BP-1 | 931. | Boti J.B., Koukoua G., et al., 2005 | 50. m/0.22 mm/0.25 μm, He, 2. K/min, 220. C @ 20. min; Tstart: 60. C |
Capillary | SE-54 | 933. | Brantner, Pfeifhofer, et al., 2005 | 50. m/0.25 mm/0.27 μm, H2, 5. K/min; Tstart: 50. C; Tend: 300. C |
Capillary | HP-5 | 941. | Celik, Gokturk, et al., 2005 | 30. m/0.25 mm/0.25 μm, N2, 60. C @ 10. min, 5. K/min; Tend: 220. C |
Capillary | DB-5 | 933. | Choi, 2005 | 60. m/0.25 mm/0.25 μm, N2, 70. C @ 2. min, 2. K/min, 230. C @ 20. min |
Capillary | HP-5 | 940. | Cioni, Flamini, et al., 2005 | 30. m/0.25 mm/0.25 μm, N2, 60. C @ 10. min, 5. K/min; Tend: 220. C |
Capillary | RTX-1 | 932. | Cozzani, Muselli, et al., 2005 | 60. m/0.22 mm/0.25 μm, 2. K/min, 220. C @ 20. min; Tstart: 60. C |
Capillary | DB-1 | 924. | Dob, Berramdane, et al., 2005 | 30. m/0.32 mm/0.25 μm, N2, 50. C @ 3. min, 2. K/min, 260. C @ 5. min |
Capillary | DB-1 | 922. | Dob, Berramdane, et al., 2005, 2 | 30. m/0.32 mm/0.25 μm, N2, 50. C @ 3. min, 2. K/min, 260. C @ 5. min |
Capillary | DB-1 | 927. | Dob, Dahmane, et al., 2005 | 30. m/0.32 mm/0.25 μm, 50. C @ 8. min, 2. K/min; Tend: 250. C |
Capillary | MDN-5 | 930. | Dugo, Mondello, et al., 2005 | 30. m/0.25 mm/0.25 μm, He, 3. K/min; Tstart: 50. C; Tend: 250. C |
Capillary | CP-Sil 8CB-MS | 937. | Elmore, Cooper, et al., 2005 | 0. m/0.25 mm/0.25 μm, He, 40. C @ 2. min, 4. K/min, 280. C @ 5. min |
Capillary | 5 % Phenyl methyl siloxane | 956. | Estevez, Ventanas, et al., 2005 | 30. m/0.25 mm/1. μm, He, 40. C @ 10. min, 7. K/min, 250. C @ 5. min |
Capillary | DB-1 | 925. | Fanciullino, Gancel, et al., 2005 | 30. m/0.25 mm/0.25 μm, He, 3. K/min, 250. C @ 20. min; Tstart: 40. C |
Capillary | DB-1 | 910. | de Feo, Urrunaga Soria, et al., 2005 | 30. m/0.25 mm/0.25 μm, He, 40. C @ 5. min, 2. K/min, 260. C @ 20. min |
Capillary | BP-1 | 931. | Ferrari, Tomi, et al., 2005 | 50. m/0.22 mm/0.25 μm, He, 2. K/min, 220. C @ 20. min; Tstart: 60. C |
Capillary | HP-5 | 941. | Flamini, Luigi Cioni, et al., 2005 | 30. m/0.25 mm/0.25 μm, N2, 60. C @ 10. min, 5. K/min; Tend: 220. C |
Capillary | HP-5 | 941. | Flamini, Luigi Cioni, et al., 2005, 2 | 30. m/0.25 mm/0.25 μm, N2, 60. C @ 10. min, 5. K/min; Tend: 220. C |
Capillary | DB-1 | 927. | Gancel, Ollitrault, et al., 2005 | 30. m/0.25 mm/0.25 μm, He, 3. K/min, 250. C @ 20. min; Tstart: 40. C |
Capillary | CP Sil 5 CB | 929. | Idzojtic, Kajba, et al., 2005 | 50. m/0.22 mm/0.13 μm, H2, 4. K/min, 300. C @ 10. min; Tstart: 40. C |
Capillary | HP-5 | 948. | Insausti, Goñi, et al., 2005 | 50. m/0.32 mm/1.05 μm, He, 35. C @ 15. min, 8. K/min, 220. C @ 5. min |
Capillary | DB-1 | 937. | bin Jantan, Yalvema, et al., 2005 | 25. m/0.25 mm/0.25 μm, 60. C @ 10. min, 3. K/min, 180. C @ 10. min |
Capillary | DB-5 | 937. | bin Jantan, Yalvema, et al., 2005, 2 | 25. m/0.25 mm/0.25 μm, N2, 75. C @ 10. min, 3. K/min, 210. C @ 1. min |
Capillary | HP-5 | 937. | Javidnia, Miri, et al., 2005 | He, 3. K/min; Column length: 30. m; Column diameter: 0.25 mm; Tstart: 60. C; Tend: 260. C |
Capillary | RTX-1 | 930. | Paolini, Costa, et al., 2005 | 60. m/0.22 mm/0.25 μm, He, 2. K/min, 230. C @ 35. min; Tstart: 60. C |
Capillary | HP-5MS | 939. | Pino, Mesa, et al., 2005 | 30. m/0.25 mm/0.25 μm, He, 60. C @ 2. min, 4. K/min, 250. C @ 20. min |
Capillary | DB-5 | 928. | Sati and Mathela, 2005 | 30. m/0.25 mm/0.26 μm, He, 3. K/min; Tstart: 60. C; Tend: 210. C |
Capillary | DB-5 | 938. | Senatore, Napolitano, et al., 2005 | 30. m/0.25 mm/0.25 μm, He, 40. C @ 5. min, 2. K/min, 260. C @ 20. min |
Capillary | DB-5MS | 932. | Seo and Baek, 2005 | 60. m/0.25 mm/0.25 μm, He, 2. K/min, 200. C @ 20. min; Tstart: 40. C |
Capillary | SE-54 | 939. | Simionatto, Porto, et al., 2005 | 25. m/0.25 mm/0.2 μm, H2, 4. K/min; Tstart: 50. C; Tend: 250. C |
Capillary | HP-5MS | 910. | Smadja, Rondeau, et al., 2005 | 60. m/0.2 mm/0.25 μm, He, 2. K/min, 200. C @ 10. min; Tstart: 60. C |
Capillary | DB-1 | 931. | Tchoumbougnang, Zollo, et al., 2005 | 30. m/0.25 mm/0.25 μm, N2, 5. K/min; Tstart: 50. C; Tend: 200. C |
Capillary | Mega 5MS | 925. | Verzera, Trozzi, et al., 2005 | 30. m/0.25 mm/0.25 μm, He, 40. C @ 2. min, 3. K/min; Tend: 240. C |
Capillary | DB-5 | 932. | Zhang, Xu, et al., 2005 | 30. m/0.25 mm/0.25 μm, N2, 45. C @ 10. min, 2.5 K/min, 180. C @ 20. min |
Capillary | HP-5MS | 932. | Aligiannis, Kalpoutzakis, et al., 2004 | 30. m/0.25 mm/0.25 μm, He, 3. K/min; Tstart: 60. C; Tend: 280. C |
Capillary | SE-54 | 937. | Alma, Nitz, et al., 2004 | 30. m/0.25 mm/0.25 μm, He, 60. C @ 5. min, 2. K/min; Tend: 260. C |
Capillary | SPB-1 | 930. | Antunes, Sevinate-Pinto, et al., 2004 | 30. m/0.25 mm/0.25 μm, He, 3. K/min, 220. C @ 15. min; Tstart: 70. C |
Capillary | ZB-5 | 939. | Bell, 2004 | 30. m/0.32 mm/0.50 μm, Helium, 7. K/min, 265. C @ 5. min; Tstart: 40. C |
Capillary | DB-5 | 941. | Bell, 2004 | 60. m/0.25 mm/0.25 μm, Helium, 7. K/min; Tstart: 40. C; Tend: 250. C |
Capillary | HP-5 | 942. | Bertoli, Menichini, et al., 2004 | 30. m/0.25 mm/0.25 μm, N2, 60. C @ 10. min, 5. K/min; Tend: 220. C |
Capillary | HP-5 | 940. | Bertoli, Pistelli, et al., 2004 | 30. m/0.25 mm/0.25 μm, N2, 60. C @ 10. min, 5. K/min; Tend: 220. C |
Capillary | SPB-1 | 930. | Cavaleiro, Salgueiro, et al., 2004 | 30. m/0.2 mm/0.2 μm, He, 3. K/min, 220. C @ 15. min; Tstart: 70. C |
Capillary | HP-5 | 940. | Ceccarini, Macchia, et al., 2004 | 30. m/0.25 mm/0.25 μm, 60. C @ 10. min, 5. K/min; Tend: 220. C |
Capillary | HP-5MS | 932. | Chorianopoulos, Kalpoutzakis, et al., 2004 | 30. m/0.25 mm/0.25 μm, He, 3. K/min; Tstart: 60. C; Tend: 280. C |
Capillary | RTX-5 | 930. | Dugo, Mondello, et al., 2004 | 30. m/0.25 mm/0.25 μm, He, 45. C @ 6. min, 3. K/min, 300. C @ 10. min |
Capillary | HP-1 | 923. | Fernández-Ocaña, Gómez-Rodríguez, et al., 2004 | 25. m/0.32 mm/0.17 μm, He, 3. K/min; Tstart: 50. C; Tend: 200. C |
Capillary | HP-5 | 940. | Flamini, Bader, et al., 2004 | 30. m/0.25 mm/0.25 μm, He, 3. K/min; Tstart: 60. C; Tend: 240. C |
Capillary | DB-5 | 940. | Flamini, Cioni, et al., 2004 | 30. m/0.25 mm/0.25 μm, N2, 3. K/min; Tstart: 60. C; Tend: 240. C |
Capillary | DB-5 | 940. | Flamini, Cioni, et al., 2004 | 30. m/0.25 mm/0.25 μm, N2, 3. K/min; Tstart: 60. C; Tend: 240. C |
Capillary | HP-5 | 938. | Flach A., Dondon R.C., et al., 2004 | 30. m/0.25 mm/0.25 μm, He, 4. K/min; Tstart: 50. C; Tend: 290. C |
Capillary | BP-1 | 932. | Gonny, Bradesi, et al., 2004 | 50. m/0.22 mm/0.25 μm, 2. K/min, 220. C @ 20. min; Tstart: 60. C |
Capillary | CP-Sil 8CB-MS | 934. | Hierro, de la Hoz, et al., 2004 | 60. m/0.25 mm/0.25 μm, 40. C @ 2. min, 4. K/min, 280. C @ 5. min |
Capillary | HP-5 | 939. | Javidnia, Miri, et al., 2004 | 30. m/0.25 mm/0.25 μm, He, 3. K/min; Tstart: 60. C; Tend: 260. C |
Capillary | HP-5 | 932. | Javidnia, Miri, et al., 2004, 2 | He, 3. K/min; Column length: 30. m; Column diameter: 0.25 mm; Tstart: 60. C; Tend: 260. C |
Capillary | DB-5 | 939. | Javidnia, Miri, et al., 2004, 3 | 30. m/0.25 mm/0.25 μm, He, 3. K/min; Tstart: 60. C; Tend: 260. C |
Capillary | DB-5MS | 931. | Mardarowicz, Wianowska, et al., 2004 | 30. m/0.25 mm/0.25 μm, He, 40. C @ 2. min, 4. K/min; Tend: 280. C |
Capillary | SPB-1 | 930. | Moldão-Martins, Beirão-da-Costa, et al., 2004 | 30. m/0.2 mm/0.2 μm, He, 3. K/min, 220. C @ 15. min; Tstart: 70. C |
Capillary | SPB-1 | 930. | Moldão-Martins, Beirão-da-Costa, et al., 2004 | 30. m/0.2 mm/0.2 μm, He, 3. K/min, 220. C @ 15. min; Tstart: 70. C |
Capillary | HP-5MS | 932. | Mumm, Tiemann, et al., 2004 | 30. m/0.25 mm/0.25 μm, He, 50. C @ 5. min, 5. K/min; Tend: 300. C |
Capillary | RSL-200 | 936. | Ngassoum, Ousmaila, et al., 2004 | 30. m/0.32 mm/0.25 μm, H2, 40. C @ 5. min, 6. K/min, 280. C @ 5. min |
Capillary | DB-1 | 937. | Omidbaigi, Sefidkon, et al., 2004 | 60. m/0.25 mm/0.25 μm, He, 40. C @ 5. min, 4. K/min; Tend: 280. C |
Capillary | Methyl Silicone | 939. | Özcan and Chalchat, 2004 | He, 3. K/min; Column length: 50. m; Column diameter: 0.25 mm; Tstart: 50. C; Tend: 240. C |
Capillary | SPB-5 | 939. | Pino, Marbot, et al., 2004 | 30. m/0.25 mm/0.25 μm, He, 60. C @ 2. min, 4. K/min, 250. C @ 20. min |
Capillary | SPB-5 | 940. | Pino, Marbot, et al., 2004, 2 | 30. m/0.25 mm/0.25 μm, He, 60. C @ 2. min, 4. K/min, 250. C @ 20. min |
Capillary | BP-1 | 938. | Raina, Kumar, et al., 2004 | 30. m/0.32 mm/0.25 μm, N2, 5. K/min, 220. C @ 13. min; Tstart: 60. C |
Capillary | DB-1 | 924. | Ramezani, Behravan, et al., 2004 | 30. m/0.25 mm/0.25 μm, 2.5 K/min; Tstart: 50. C; Tend: 265. C |
Capillary | DB-5 | 941. | Ramezani, Khaje-Karamoddin, et al., 2004 | 30. m/0.25 mm/0.25 μm, He, 4. K/min; Tstart: 60. C; Tend: 275. C |
Capillary | HP-5MS | 932. | Salido, Valenzuela, et al., 2004 | 30. m/0.25 mm/0.25 μm, He, 3. K/min; Tstart: 50. C; Tend: 250. C |
Capillary | HP-5 | 939. | Stashenko, Jaramillo, et al., 2004 | 50. m/0.2 mm/0.2 μm, He, 40. C @ 15. min, 3. K/min, 250. C @ 40. min |
Capillary | HP-5 | 935. | Stashenko, Jaramillo, et al., 2004, 2 | 50. m/0.2 mm/0.2 μm, He, 35. C @ 15. min, 3. K/min, 250. C @ 40. min |
Capillary | BP-1 | 931. | Tam, Thuam, et al., 2004 | 50. m/0.22 mm/0.25 μm, He, 2. K/min, 220. C @ 20. min; Tstart: 60. C |
Capillary | HP-5MS | 914. | Tzakou, Vagias, et al., 2004 | 30. m/0.25 mm/0.25 μm, He, 3. K/min; Tstart: 60. C; Tend: 280. C |
Capillary | Optima 5 | 925. | Vérité, Nacer, et al., 2004 | 25. m/0.25 mm/0.25 μm, He, 3. K/min, 280. C @ 20. min; Tstart: 60. C |
Capillary | HP-5MS | 938. | Weissbecker, Holighaus, et al., 2004 | 30. m/0.25 mm/0.25 μm, He, 50. C @ 1.5 min, 6. K/min, 200. C @ 5. min |
Capillary | SBP-5 | 954. | Yoo, Kim, et al., 2004 | 60. m/0.25 mm/0.25 μm, Helium, 50. C @ 3. min, 5. K/min, 240. C @ 10. min |
Capillary | DB-5MS | 939. | Yu, Kim, et al., 2004 | 30. m/0.25 mm/0.25 μm, He, 40. C @ 5. min, 4. K/min, 200. C @ 20. min |
Capillary | DB-5MS | 940. | Yu, Kim, et al., 2004 | 30. m/0.25 mm/0.25 μm, He, 40. C @ 5. min, 4. K/min, 200. C @ 20. min |
Capillary | DB-5MS | 935. | Yu, Kim, et al., 2004, 2 | 30. m/0.25 mm/0.25 μm, He, 40. C @ 5. min, 4. K/min, 200. C @ 20. min |
Capillary | DB-5MS | 937. | Yu, Kim, et al., 2004, 2 | 30. m/0.25 mm/0.25 μm, He, 40. C @ 5. min, 4. K/min, 200. C @ 20. min |
Capillary | DB-5MS | 936. | Zheng, Kim, et al., 2004 | 30. m/0.25 mm/0.25 μm, He, 40. C @ 5. min, 4. K/min, 200. C @ 20. min |
Capillary | DB-5MS | 935. | Zheng, Kim, et al., 2004 | 30. m/0.25 mm/0.25 μm, He, 40. C @ 5. min, 4. K/min, 200. C @ 20. min |
Capillary | DB-5 | 937. | bin Ahmad and bin Jantan, 2003 | 25. m/0.25 mm/0.25 μm, N2, 75. C @ 10. min, 3. K/min, 210. C @ 1. min |
Capillary | HP-5 | 941. | Angelini, Carpanese, et al., 2003 | 30. m/0.25 mm/0.25 μm, N2, 60. C @ 10. min, 5. K/min; Tend: 220. C |
Capillary | HP-5 | 941. | Angelini, Carpanese, et al., 2003 | 30. m/0.25 mm/0.25 μm, N2, 60. C @ 10. min, 5. K/min; Tend: 220. C |
Capillary | DB-5 | 940. | Bader, Caponi, et al., 2003 | 30. m/0.25 mm/0.25 μm, He, 3. K/min, 240. C @ 30. min; Tstart: 60. C |
Capillary | DB-5 | 940. | Bader, Caponi, et al., 2003, 2 | 30. m/0.25 mm/0.25 μm, N2, 60. C @ 10. min, 5. K/min; Tend: 220. C |
Capillary | DB-5 | 940. | Bader, Flamini, et al., 2003 | 30. m/0.25 mm/0.25 μm, He, 3. K/min; Tstart: 60. C; Tend: 240. C |
Capillary | BP-1 | 933. | Bianchini, Tomi, et al., 2003 | 50. m/0.22 mm/0.25 μm, He, 2. K/min, 230. C @ 35. min; Tstart: 60. C |
Capillary | BP-1 | 933. | Bianchini, Tomi, et al., 2003 | 50. m/0.22 mm/0.25 μm, He, 2. K/min, 230. C @ 35. min; Tstart: 60. C |
Capillary | OV-1 | 930. | Bicchi, Rubiolo, et al., 2003 | 25. m/0.25 mm/0.3 μm, H2, 50. C @ 1. min, 3. K/min, 200. C @ 20. min |
Capillary | HP-5 | 942. | Bougatsos, Meyer, et al., 2003 | 30. m/0.25 mm/0.25 μm, He, 3. K/min; Tstart: 60. C; Tend: 280. C |
Capillary | DB-1 | 918. | Brat, Rega, et al., 2003 | 30. m/0.25 mm/0.25 μm, He, 3. K/min, 250. C @ 20. min; Tstart: 40. C |
Capillary | SPB-1 | 930. | Cavaleiro, Salgueiro, et al., 2003 | 30. m/0.2 mm/0.2 μm, He, 3. K/min, 220. C @ 15. min; Tstart: 70. C |
Capillary | RTX-1 | 931. | Cavalli, Tomi, et al., 2003 | 60. m/0.22 mm/0.25 μm, He, 2. K/min, 230. C @ 45. min; Tstart: 60. C |
Capillary | Ultra-2 | 932. | Ceva-Antunes, Bizzo, et al., 2003 | 25. m/0.25 mm/0.33 μm, H2, 40. C @ 2. min, 3. K/min, 280. C @ 10. min |
Capillary | SPB-1 | 926. | Chisholm, Wilson, et al., 2003 | 25. m/0.25 mm/0.25 μm, 35. C @ 10. min, 4. K/min; Tend: 225. C |
Capillary | Optima 5 | 927. | Chosson, Vérité, et al., 2003 | 25. m/0.25 mm/0.25 μm, He, 3. K/min, 280. C @ 20. min; Tstart: 60. C |
Capillary | DB-5 | 933. | Choi, 2003 | 30. m/0.25 mm/0.25 μm, N2, 70. C @ 2. min, 2. K/min, 230. C @ 20. min |
Capillary | HP-5 | 941. | Dural, Bagci, et al., 2003 | 30. m/0.25 mm/0.25 μm, N2, 60. C @ 10. min, 5. K/min; Tend: 220. C |
Capillary | HP-5 | 940. | Emilio Tomei, Manganelli, et al., 2003 | 30. m/0.25 mm/0.25 μm, N2, 60. C @ 10. min, 5. K/min; Tend: 220. C |
Capillary | HP-5 | 941. | Ertugrul, Dural, et al., 2003 | 30. m/0.25 mm/0.25 μm, N2, 60. C @ 10. min, 5. K/min; Tend: 220. C |
Capillary | DB-1 | 922. | de Feo, Bruno, et al., 2003 | 30. m/0.25 mm/0.25 μm, He, 40. C @ 5. min, 2. K/min, 250. C @ 20. min |
Capillary | DB-1 | 928. | de Feo, Urrunaga Soria, et al., 2003 | 30. m/0.25 mm/0.25 μm, He, 40. C @ 5. min, 2. K/min; Tend: 250. C |
Capillary | HP-5 | 940. | Flamini, Luigi Cioni, et al., 2003 | 30. m/0.25 mm/0.25 μm, N2, 60. C @ 10. min, 5. K/min; Tend: 220. C |
Capillary | HP-5 | 940. | Flamini, Luigi Cioni, et al., 2003, 2 | 30. m/0.25 mm/0.25 μm, N2, 60. C @ 10. min, 5. K/min; Tend: 220. C |
Capillary | HP-5 | 941. | Flamini, Luigi Cioni, et al., 2003, 3 | 30. m/0.25 mm/0.25 μm, N2, 60. C @ 10. min, 5. K/min; Tend: 220. C |
Capillary | DB-1 | 927. | Gancel, Ollitrault, et al., 2003 | 30. m/0.25 mm/0.25 μm, He, 3. K/min, 250. C @ 20. min; Tstart: 40. C |
Capillary | DB-5 | 934. | Högnadóttir and Rouseff, 2003 | 30. m/0.32 mm/0.5 μm, 7. K/min, 265. C @ 5. min; Tstart: 40. C |
Capillary | DB-5 | 934. | Högnadóttir and Rouseff, 2003 | 30. m/0.32 mm/0.5 μm, 7. K/min, 265. C @ 5. min; Tstart: 40. C |
Capillary | HP-5 | 936. | Isidorov, Vinogorova, et al., 2003 | 25. C @ 5. min, 3. K/min; Column length: 30. m; Column diameter: 0.25 mm; Tend: 150. C |
Capillary | DB-5 | 937. | Jantan, Ling, et al., 2003 | 30. m/0.25 mm/0.25 μm, He, 75. C @ 10. min, 3. K/min, 230. C @ 20. min |
Capillary | DB-5 | 937. | bin Jantan, Yassin, et al., 2003 | 30. m/0.25 mm/0.25 μm, N2, 75. C @ 10. min, 3. K/min; Tend: 230. C |
Capillary | DB-5 | 936. | Javidnia, Miri, et al., 2003 | He, 4. K/min; Column length: 25. m; Column diameter: 0.25 mm; Tstart: 60. C; Tend: 260. C |
Capillary | HP-5 | 939. | Karioti, Skaltsa, et al., 2003 | 30. m/0.25 mm/0.25 μm, He, 60. C @ 5. min, 4. K/min; Tend: 280. C |
Capillary | HP-5 | 941. | Macchioni, Cioni, et al., 2003 | 30. m/0.25 mm/0.25 μm, He, 3. K/min; Tstart: 60. C; Tend: 240. C |
Capillary | HP-5MS | 935. | Mimica-Dukic, Kujundzic, et al., 2003 | 30. m/0.25 mm/0.25 μm, He, 3. K/min; Tstart: 60. C; Tend: 280. C |
Capillary | HP-5 | 939. | Ngassapa, Runyoro, et al., 2003 | 30. m/0.25 mm/0.25 μm, He, 3. K/min; Tstart: 60. C; Tend: 280. C |
Capillary | CP Sil 5 CB | 930. | Pino, Almora, et al., 2003 | 60. m/0.32 mm/0.25 μm, He, 60. C @ 10. min, 3. K/min, 280. C @ 60. min |
Capillary | SPB-5 | 939. | Pino, Marbot, et al., 2003 | 30. m/0.25 mm/0.25 μm, He, 60. C @ 2. min, 4. K/min, 250. C @ 20. min |
Capillary | HP-5MS | 936. | Salido, Altarejos, et al., 2003 | 30. m/0.25 mm/0.25 μm, He, 3. K/min; Tstart: 50. C; Tend: 250. C |
Capillary | MS5 | 940. | Shao, Marriott, et al., 2003 | 25. m/0.25 mm/0.25 μm, 3. K/min; Tstart: 40. C; Tend: 180. C |
Capillary | RTX-5 | 933. | Shellie, Marriott, et al., 2003 | 30. m/0.25 mm/0.25 μm, He, 45. C @ 6. min, 3. K/min; Tend: 250. C |
Capillary | HP-5 | 930. | Shellie and Marriott, 2003 | 30. m/0.25 mm/0.25 μm, He, 3. K/min; Tstart: 40. C; Tend: 240. C |
Capillary | HP-5 | 936. | Skaltsa, Demetzos, et al., 2003 | 30. m/0.25 mm/0.25 μm, He, 60. C @ 5. min, 4. K/min; Tend: 280. C |
Capillary | DB-1 | 924.2 | Sun and Stremple, 2003 | 30. m/0.25 mm/0.25 μm, He, 3. K/min; Tstart: 40. C; Tend: 325. C |
Capillary | DB-1 | 924.3 | Sun and Stremple, 2003 | 30. m/0.25 mm/0.25 μm, He, 3. K/min; Tstart: 40. C; Tend: 325. C |
Capillary | DB-5 | 941. | Tampieri, Galuppi, et al., 2003 | 30. m/0.25 mm/0.25 μm, He, 3. K/min; Tstart: 60. C; Tend: 240. C |
Capillary | HP-5 | 939. | Tsiri, Kretsi, et al., 2003 | 30. m/0.25 mm/0.25 μm, He, 3. K/min; Tstart: 60. C; Tend: 280. C |
Capillary | HP-5 | 939. | Tsiri, Kretsi, et al., 2003 | 30. m/0.25 mm/0.25 μm, He, 3. K/min; Tstart: 60. C; Tend: 280. C |
Capillary | HP-5 | 937. | Tzakou, Couladis, et al., 2003 | 30. m/0.25 mm/0.25 μm, He, 3. K/min; Tstart: 60. C; Tend: 280. C |
Capillary | Mega 5MS | 925. | Verzera, Trozzi, et al., 2003 | 30. m/0.25 mm/0.25 μm, He, 40. C @ 2. min, 3. K/min; Tend: 240. C |
Capillary | DB-5 | 940.9 | Xu, van Stee, et al., 2003 | 30. m/0.25 mm/1. μm, He, 2.5 K/min; Tstart: 50. C; Tend: 200. C |
Capillary | HP-5MS | 935. | Afsharypuor and Suleimany, 2002 | 30. m/0.25 mm/0.25 μm, He, 4. K/min; Tstart: 60. C; Tend: 275. C |
Capillary | SPB-1 | 930. | Cavaleiro, Salgueiro, et al., 2002 | 30. m/0.20 mm/0.20 μm, He, 3. K/min, 220. C @ 15. min; Tstart: 70. C |
Capillary | HP-5MS | 932. | Couladis, Chinou, et al., 2002 | 30. m/0.25 mm/0.25 μm, He, 3. K/min; Tstart: 60. C; Tend: 300. C |
Capillary | CP Sil 8 CB | 937. | Duckham, Dodson, et al., 2002 | 60. m/0.25 mm/0.25 μm, He, 40. C @ 8. min, 4. K/min, 250. C @ 10. min |
Capillary | CP Sil 8 CB | 938. | Duckham, Dodson, et al., 2002 | 60. m/0.25 mm/0.25 μm, He, 40. C @ 8. min, 4. K/min, 250. C @ 10. min |
Capillary | DB-5 | 939. | Economakis, Skaltsa, et al., 2002 | 30. m/0.25 mm/0.25 μm, 50. C @ 5. min, 3. K/min; Tend: 280. C |
Capillary | DB-5 | 940. | Flamini, Cioni, et al., 2002 | 30. m/0.25 mm/0.25 μm, He, 3. K/min; Tstart: 60. C; Tend: 240. C |
Capillary | DB-5 | 940. | Flamini, Cioni, et al., 2002, 2 | 30. m/0.25 mm/0.25 μm, He, 3. K/min; Tstart: 60. C; Tend: 240. C |
Capillary | HP-5 | 940. | Flamini, Cioni, et al., 2002, 3 | 30. m/0.25 mm/0.25 μm, N2, 60. C @ 10. min, 5. K/min; Tend: 220. C |
Capillary | HP-5 | 937. | Fokialakis, Magiatis, et al., 2002 | 30. m/0.25 mm/0.25 μm, 60. C @ 5. min, 3. K/min; Tend: 280. C |
Capillary | RTX-5 MS | 932. | Hudaib, Speroni, et al., 2002 | 30. m/0.25 mm/0.25 μm, He, 45. C @ 10. min, 2.5 K/min; Tend: 180. C |
Capillary | SE-30 | 936. | bin Jantan, Ayop, et al., 2002 | 25. m/0.25 mm/0.25 μm, N2, 60. C @ 10. min, 3. K/min, 180. C @ 10. min |
Capillary | DB-5 | 939. | Javidnia, Miri, et al., 2002 | 30. m/0.25 mm/0.25 μm, He, 4. K/min; Tstart: 60. C; Tend: 260. C |
Capillary | HP-5 | 928. | Kovacevic, Pavlovic, et al., 2002 | 30. m/0.25 mm/0.25 μm, He, 3. K/min; Tstart: 60. C; Tend: 280. C |
Capillary | BP-1 | 930. | Lota, de Rocca Serra, et al., 2002 | 50. m/0.22 mm/0.25 μm, He, 2. K/min, 220. C @ 20. min; Tstart: 60. C |
Capillary | HP-5 | 939. | Magiatis, Skaltsounis, et al., 2002 | 30. m/0.25 mm/0.25 μm, He, 60. C @ 5. min, 3. K/min; Tend: 280. C |
Capillary | DB-5 | 939. | Miri, Ramezani, et al., 2002 | He, 4. K/min; Column length: 25. m; Column diameter: 0.25 mm; Tstart: 70. C; Tend: 260. C |
Capillary | RTX-5 | 932. | Mondello, Zappia, et al., 2002 | 30. m/0.25 mm/0.25 μm, He, 45. C @ 6. min, 3. K/min, 300. C @ 10. min |
Capillary | HP-1 | 928. | Nath, Sarma, et al., 2002 | 24. m/0.32 mm/0.17 μm, He, 60. C @ 2. min, 4. K/min, 250. C @ 20. min |
Capillary | CP Sil 8 CB | 931. | Oruna-Concha, Ames, et al., 2002 | 60. m/0.25 mm/0.25 μm, He, 40. C @ 8. min, 4. K/min, 250. C @ 10. min |
Capillary | CP Sil 5 CB | 921. | Pino, Marbot, et al., 2002 | 25. m/0.25 mm/0.25 μm, N2, 60. C @ 6. min, 4. K/min; Tend: 280. C |
Capillary | SPB-5 | 939. | Pino, Marbot, et al., 2002, 2 | 30. m/0.25 mm/0.25 μm, He, 60. C @ 2. min, 4. K/min, 250. C @ 20. min |
Capillary | CP Sil 5 CB | 928. | Pino, Marbot, et al., 2002, 3 | 30. m/0.25 mm/0.25 μm, H2, 60. C @ 10. min, 2. K/min, 280. C @ 40. min |
Capillary | CP Sil 5 CB | 928. | Pino, Marbot, et al., 2002, 4 | 50. m/0.32 mm/0.4 μm, He, 60. C @ 10. min, 3. K/min, 280. C @ 60. min |
Capillary | DB-1 | 931. | Pintore, Usai, et al., 2002 | 50. m/0.22 mm/0.25 μm, He, 2. K/min, 220. C @ 20. min; Tstart: 60. C |
Capillary | HP-5 | 907. | Pitarokili, Couladis, et al., 2002 | 30. m/0.25 mm/0.25 μm, He, 3. K/min; Tstart: 60. C; Tend: 280. C |
Capillary | HP-5MS | 941. | Shang, Hu, et al., 2002 | 30. m/0.25 mm/0.25 μm, He, 50. C @ 2. min, 5. K/min, 250. C @ 5. min |
Capillary | RTX-5 | 935. | Shellie, Mondello, et al., 2002 | 30. m/0.25 mm/0.25 μm, He, 45. C @ 6. min, 3. K/min; Tend: 250. C |
Capillary | RTX-5 | 939. | Shellie, Mondello, et al., 2002 | 30. m/0.25 mm/0.25 μm, He, 45. C @ 6. min, 3. K/min; Tend: 250. C |
Capillary | HP-5 | 936. | Aligiannis, Kalpoutzakis, et al., 2001 | 30. m/0.25 mm/0.25 μm, He, 60. C @ 5. min, 3. K/min; Tend: 280. C |
Capillary | HP-5 | 937. | Aligiannis, Kalpoutzakis, et al., 2001, 2 | 30. m/0.25 mm/0.25 μm, He, 60. C @ 5. min, 3. K/min; Tend: 280. C |
Capillary | BP-1 | 933. | Bianchini, Tomi, et al., 2001 | 50. m/0.22 mm/0.25 μm, He, 2. K/min, 230. C @ 35. min; Tstart: 60. C |
Capillary | CP-Sil 8CB-MS | 937. | Bruna, Hierro, et al., 2001 | 60. m/0.25 mm/0.25 μm, 40. C @ 2. min, 4. K/min; Tend: 280. C |
Capillary | HP-5 | 940. | Couladis, Baziou, et al., 2001 | 30. m/0.25 mm/0.25 μm, He, 3. K/min, 260. C @ 10. min; Tstart: 60. C |
Capillary | HP-5 | 936. | Couladis, Tsortanidou, et al., 2001 | 30. m/0.25 mm/0.25 μm, He, 3. K/min; Tstart: 60. C; Tend: 380. C |
Capillary | HP-5 | 937. | Couladis, Tzakou, et al., 2001 | 30. m/0.25 mm/0.50 μm, He, 3. K/min; Tstart: 60. C; Tend: 280. C |
Capillary | HP-5MS | 939. | Giamakis, Kretsi, et al., 2001 | 30. m/0.25 mm/0.25 μm, He, 60. C @ 5. min, 3. K/min; Tend: 280. C |
Capillary | HP-1 | 933. | Guilliard, Delgado, et al., 2001 | 60. m/0.25 mm/0.25 μm, He, 50. C @ 5. min, 2.5 K/min; Tend: 250. C |
Capillary | HP-5 | 940. | Guilliard, Delgado, et al., 2001 | 50. m/0.25 mm/0.25 μm, He, 50. C @ 5. min, 2.5 K/min; Tend: 250. C |
Capillary | RTX-5 MS | 931. | Hudaib, Grazia Bellardi, et al., 2001 | 30. m/0.25 mm/0.25 μm, He, 70. C @ 10. min, 4. K/min, 210. C @ 10. min |
Capillary | SE-30 | 937. | bin Jantan, Basni, et al., 2001 | N2, 60. C @ 10. min, 3. K/min, 180. C @ 1. min; Column length: 25. m; Column diameter: 0.20 mm |
Capillary | SPB-1 | 947. | Larráyoz, Addis, et al., 2001 | 30. m/0.32 mm/4. μm, He, 45. C @ 13. min, 5. K/min, 240. C @ 5. min |
Capillary | BP-1 | 930. | Lota, Serra, et al., 2001 | 50. m/0.22 mm/0.25 μm, He, 2. K/min; Tstart: 60. C; Tend: 220. C |
Capillary | BP-1 | 930. | Lota, Serra, et al., 2001 | 50. m/0.22 mm/0.25 μm, He, 2. K/min; Tstart: 60. C; Tend: 220. C |
Capillary | CP Sil 5 CB | 965. | Pino, Marbot, et al., 2001 | 50. m/0.32 mm/0.4 μm, He, 60. C @ 10. min, 3. K/min, 280. C @ 60. min |
Capillary | CP Sil 5 CB | 925. | Pino, Marbot, et al., 2001 | 50. m/0.32 mm/0.4 μm, He, 60. C @ 10. min, 3. K/min, 280. C @ 60. min |
Capillary | BP-1 | 932. | Rezzi, Bighelli, et al., 2001 | 50. m/0.22 mm/0.25 μm, He, 2. K/min, 220. C @ 20. min; Tstart: 60. C |
Capillary | BP-1 | 931. | Rezzi, Cavaleiro, et al., 2001 | 50. m/0.22 mm/0.25 μm, 2. K/min, 220. C @ 20. min; Tstart: 60. C |
Capillary | HP-5MS | 932. | Salido, Altarejos, et al., 2001 | 30. m/0.25 mm/0.25 μm, He, 3. K/min; Tstart: 50. C; Tend: 250. C |
Capillary | HP-5MS | 936. | Skaltsa, Mavrommati, et al., 2001 | 30. m/0.25 mm/0.25 μm, He, 60. C @ 5. min, 4. K/min; Tend: 280. C |
Capillary | SE-54 | 934.08 | Yin, Xiu, et al., 2001 | 35. C @ 3. min, 4. K/min, 230. C @ 10. min; Column length: 25. m; Column diameter: 0.31 mm |
Capillary | SE-54 | 934.63 | Yin, Xiu, et al., 2001 | 35. C @ 3. min, 4. K/min, 230. C @ 10. min; Column length: 25. m; Column diameter: 0.31 mm |
Capillary | BPX-5 | 938. | Zabaras and Wyllie, 2001 | 50. m/0.22 mm/0.25 μm, H2, 60. C @ 5. min, 4. K/min, 180. C @ 5. min |
Capillary | HP-5 | 937. | Alonzo, Bosco, et al., 2000 | 30. m/0.20 mm/0.25 μm, He, 60. C @ 8. min, 4. K/min, 180. C @ 2. min |
Capillary | BP-1 | 931. | Baldovini, Ristorcelli, et al., 2000 | 50. m/0.22 mm/0.25 μm, 2. K/min, 220. C @ 20. min; Tstart: 60. C |
Capillary | DB-5 | 925. | Bartley and Jacobs, 2000 | 60. m/0.25 mm/0.25 μm, He, 40. C @ 2. min, 4. K/min, 290. C @ 5. min |
Capillary | DB-1 | 928. | Brat, Brillouet, et al., 2000 | 30. m/0.32 mm/0.25 μm, H2, 40. C @ 3. min, 3. K/min, 245. C @ 20. min |
Capillary | CP Sil 8 CB | 934. | Chevance, Farmer, et al., 2000 | 60. C @ 5. min, 4. K/min, 220. C @ 30. min |
Capillary | HP-5 | 928. | Kim, Thuy, et al., 2000 | 30. m/0.25 mm/0.25 μm, He, 40. C @ 5. min, 2. K/min, 200. C @ 20. min |
Capillary | HP-5 | 936. | Lazari, Skaltsa, et al., 2000 | 30. m/0.25 mm/0.25 μm, He, 50. C @ 5. min, 4. K/min; Tend: 280. C |
Capillary | BP-1 | 930. | Lota, de Rocca Serra, et al., 2000 | 50. m/0.22 mm/0.25 μm, He, 2. K/min, 230. C @ 35. min; Tstart: 60. C |
Capillary | BP-1 | 930. | Lota, de Rocca Serra, et al., 2000 | 50. m/0.22 mm/0.25 μm, He, 2. K/min, 230. C @ 35. min; Tstart: 60. C |
Capillary | HP-101 | 936. | Milos and Radonic, 2000 | 25. m/0.2 mm/0.2 μm, He, 70. C @ 2. min, 3. K/min, 200. C @ 10. min |
Capillary | RTX-5 | 936. | Mondello, Zappia, et al., 2000 | 10. m/0.1 mm/0.1 μm, He, 12.3 K/min; Tstart: 50. C; Tend: 350. C |
Capillary | SE-30 | 939. | Paramonov, Khalilova, et al., 2000 | 6. K/min; Column length: 50. m; Column diameter: 0.2 mm; Tstart: 50. C; Tend: 250. C |
Capillary | CP Sil 5 CB | 936. | Pfeifhofer, 2000 | 50. m/0.22 mm/0.13 μm, H2, 4. K/min, 300. C @ 10. min; Tstart: 40. C |
Capillary | HP-5 | 940. | Skaltsa, Lazari, et al., 2000 | 30. m/0.25 mm/0.25 μm, He, 50. C @ 5. min, 4. K/min; Tend: 280. C |
Capillary | HP-5 | 925. | Song, Sawamura, et al., 2000 | 30. m/0.25 mm/0.25 μm, He, 2. K/min; Tstart: 70. C; Tend: 230. C |
Capillary | DB-5 | 925. | Song, Sawamura, et al., 2000, 2 | 30. m/0.25 mm/0.25 μm, N2, 2. K/min; Tstart: 70. C; Tend: 230. C |
Capillary | Mega 5MS | 925. | Verzera, la Rosa, et al., 2000 | 30. m/0.25 mm/0.25 μm, He, 40. C @ 2. min, 3. K/min; Tend: 240. C |
Capillary | Mega 5MS | 925. | Verzera, Trozzi, et al., 2000 | 30. m/0.25 mm/0.25 μm, He, 40. C @ 2. min, 3. K/min; Tend: 240. C |
Capillary | CP Sil 8 CB | 928. | Yassaa, Meklati, et al., 2000 | 25. m/0.2 mm/0.25 μm, 40. C @ 8. min, 2. K/min; Tend: 200. C |
Capillary | CP Sil 8 CB | 929. | Yassaa, Meklati, et al., 2000 | 25. m/0.2 mm/0.25 μm, 40. C @ 8. min, 2. K/min; Tend: 200. C |
Capillary | CP Sil 8 CB | 928. | Yassaa, Meklati, et al., 2000 | 25. m/0.2 mm/0.25 μm, 40. C @ 8. min, 2. K/min; Tend: 200. C |
Capillary | CBP-1 | 937. | Zunino, Lopez, et al., 2000 | He, 4. K/min; Column length: 30. m; Column diameter: 0.25 mm; Tstart: 60. C; Tend: 240. C |
Capillary | CP Sil 8 CB | 933. | Chevance and Farmer, 1999 | 60. C @ 5. min, 4. K/min, 220. C @ 30. min; Column length: 50. m; Column diameter: 0.32 mm |
Capillary | CP Sil 8 CB | 928. | Chevance and Farmer, 1999 | 60. C @ 5. min, 4. K/min, 220. C @ 30. min; Column length: 50. m; Column diameter: 0.32 mm |
Capillary | DB-1 | 937.8 | Helmig, Klinger, et al., 1999 | 60. m/0.32 mm/1. μm, -50. C @ 2. min, 6. K/min; Tend: 175. C |
Capillary | DB-1 | 935. | Javidnia and Shafiee, 1999 | He, 3. K/min, 230. C @ 5. min; Column length: 60. m; Column diameter: 0.32 mm; Tstart: 60. C |
Capillary | BP-1 | 930. | Lota, Serra, et al., 1999 | 50. m/0.22 mm/0.25 μm, He, 2. K/min, 230. C @ 35. min; Tstart: 60. C |
Capillary | BP-1 | 930. | Lota, Serra, et al., 1999 | 50. m/0.22 mm/0.25 μm, He, 2. K/min, 230. C @ 35. min; Tstart: 60. C |
Capillary | BP-1 | 930. | Mazzoni, Tomi, et al., 1999 | 50. m/0.22 mm/0.25 μm, He, 2. K/min, 220. C @ 20. min; Tstart: 60. C |
Capillary | OV-101 | 936. | Menut, Bessiere, et al., 1999 | N2, 5. K/min; Column length: 25. m; Column diameter: 0.25 mm; Tstart: 50. C; Tend: 200. C |
Capillary | DB-1 | 937. | Mirza and Sefidkon, 1999 | 60. m/0.25 mm/0.25 μm, He, 4. K/min; Tstart: 50. C; Tend: 220. C |
Capillary | DB-1 | 925. | Muselli, Hoi, et al., 1999 | 30. m/0.25 mm/0.25 μm, 50. C @ 3. min, 3. K/min; Tend: 220. C |
Capillary | HP-1 | 938. | Stashenko, Cervantes, et al., 1999 | 60. m/0.25 mm/0.25 μm, He, 50. C @ 5. min, 2.5 K/min; Tend: 250. C |
Capillary | Methyl Silicone | 943. | Sumathykutty, Rao, et al., 1999 | 50. m/0.25 mm/0.17 μm, N2, 2. K/min; Tstart: 80. C; Tend: 200. C |
Capillary | CP Sil 5 CB | 936. | Weyerstahl, Marschall, et al., 1999 | He, 5. K/min; Column length: 25. m; Column diameter: 0.25 mm; Tstart: 60. C; Tend: 260. C |
Capillary | OV-1 | 931. | Bicchi, Rubiolo, et al., 1998 | 25. m/0.25 mm/0.3 μm, 50. C @ 1. min, 3. K/min, 200. C @ 20. min |
Capillary | DB-5 | 933. | Isidorov, Zenkevich, et al., 1998 | 30. m/0.25 mm/0.25 μm, 3. K/min; Tstart: 50. C; Tend: 250. C |
Capillary | SPB-5 | 942. | Verdier-Metz., Coulon, et al., 1998 | 60. m/0.32 mm/1. μm, He, 40. C @ 5. min, 3. K/min, 200. C @ 2. min |
Capillary | HP-5 | 933. | Oprean, Tamas, et al., 1998 | He, 3. K/min; Column diameter: 0.26 mm; Phase thickness: 0.25 μm; Tstart: 60. C; Tend: 240. C |
Capillary | BP-1 | 936. | Tam, An, et al., 1998 | 50. m/0.22 mm/0.25 μm, He, 2. K/min, 220. C @ 20. min; Tstart: 60. C |
Capillary | Methyl Silicone | 923. | Analytical Methods Committee, 1997 | 4. K/min; Tstart: 50. C; Tend: 250. C |
Capillary | BP-1 | 932. | Mariotti, Costa, et al., 1997 | 50. m/0.22 mm/0.25 μm, He, 2. K/min, 230. C @ 35. min; Tstart: 60. C |
Capillary | DB-1 | 930. | Perry, van Klink, et al., 1997 | 10. m/0.25 mm/0.25 μm, H2, 5. K/min; Tstart: 80. C; Tend: 160. C |
Capillary | DB-5 | 942. | Tzakou, Roussis, et al., 1997 | He, 50. C @ 3. min, 5. K/min; Column length: 60. m; Column diameter: 0.24 mm; Tend: 280. C |
Capillary | DB-1 | 925. | Helmig, Pollock, et al., 1996 | 30. m/0.25 mm/1. μm, 6. K/min; Tstart: -50. C; Tend: 180. C |
Capillary | DB-5 | 936.6 | Helmig, Pollock, et al., 1996 | 60. m/0.33 mm/0.25 μm, 6. K/min; Tstart: -50. C; Tend: 180. C |
Capillary | DB-1 | 933. | Stashenko, Prada, et al., 1996 | 60. m/0.25 mm/0.25 μm, He, 50. C @ 5. min, 3.5 K/min; Tend: 250. C |
Capillary | Methyl Silicone | 941. | Píry, Príbela, et al., 1995 | 25. m/0.2 mm/0.3 μm, He, 2. K/min; Tstart: 40. C; Tend: 200. C |
Capillary | Ultra-1 | 934. | Ahmad, Sirat, et al., 1994 | 25. m/0.32 mm/0.17 μm, He, 6. K/min; Tstart: 50. C; Tend: 320. C |
Capillary | DB-1 | 932. | Combariza, Tirado, et al., 1994 | 60. m/0.25 mm/0.25 μm, He, 70. C @ 5. min, 2.5 K/min, 250. C @ 15. min |
Capillary | Ultra-1 | 926.6 | Farkas, Le Quere, et al., 1994 | 50. m/0.32 mm/0.52 μm, H2, 2. K/min; Tstart: 35. C; Tend: 259. C |
Capillary | Ultra-1 | 926.6 | Farkas, Le Quere, et al., 1994 | 50. m/0.32 mm/0.52 μm, H2, 2. K/min; Tstart: 35. C; Tend: 259. C |
Capillary | Ultra-1 | 926.7 | Farkas, Le Quere, et al., 1994 | 50. m/0.32 mm/0.52 μm, H2, 2. K/min; Tstart: 35. C; Tend: 259. C |
Capillary | OV-101 | 925. | Baaliouamer, Boudarene, et al., 1993 | He, 60. C @ 8. min, 1. K/min, 260. C @ 30. min; Column length: 25. m; Column diameter: 0.20 mm |
Capillary | OV-101 | 931. | Baaliouamer, Boudarene, et al., 1993 | He, 60. C @ 8. min, 1. K/min, 260. C @ 30. min; Column length: 25. m; Column diameter: 0.20 mm |
Capillary | OV-101 | 928. | Baaliouamer, Boudarene, et al., 1993 | He, 60. C @ 0. min, 2. K/min, 260. C @ 30. min; Column length: 25. m; Column diameter: 0.20 mm |
Capillary | OV-101 | 936. | Baaliouamer, Boudarene, et al., 1993 | He, 60. C @ 0. min, 2. K/min, 260. C @ 30. min; Column length: 25. m; Column diameter: 0.20 mm |
Capillary | OV-101 | 928. | Baaliouamer, Boudarene, et al., 1993 | He, 60. C @ 8. min, 2. K/min, 260. C @ 30. min; Column length: 25. m; Column diameter: 0.20 mm |
Capillary | OV-101 | 928. | Baaliouamer, Boudarene, et al., 1993 | He, 60. C @ 8. min, 2. K/min, 260. C @ 30. min; Column length: 25. m; Column diameter: 0.20 mm |
Capillary | OV-101 | 933. | Baaliouamer, Boudarene, et al., 1993 | He, 60. C @ 8. min, 2. K/min, 260. C @ 30. min; Column length: 25. m; Column diameter: 0.20 mm |
Capillary | OV-101 | 934. | Baaliouamer, Boudarene, et al., 1993 | He, 60. C @ 8. min, 2. K/min, 260. C @ 30. min; Column length: 25. m; Column diameter: 0.20 mm |
Capillary | OV-101 | 930. | Baaliouamer, Boudarene, et al., 1993 | He, 60. C @ 8. min, 4. K/min, 260. C @ 30. min; Column length: 25. m; Column diameter: 0.20 mm |
Capillary | OV-101 | 935. | Baaliouamer, Boudarene, et al., 1993 | He, 60. C @ 8. min, 4. K/min, 260. C @ 30. min; Column length: 25. m; Column diameter: 0.20 mm |
Capillary | OV-101 | 928. | Baaliouamer, Boudarene, et al., 1993 | He, 70. C @ 8. min, 2. K/min, 260. C @ 30. min; Column length: 25. m; Column diameter: 0.20 mm |
Capillary | OV-101 | 935. | Baaliouamer, Boudarene, et al., 1993 | He, 70. C @ 8. min, 2. K/min, 260. C @ 30. min; Column length: 25. m; Column diameter: 0.20 mm |
Capillary | OV-101 | 930. | Baaliouamer, Boudarene, et al., 1993 | He, 80. C @ 8. min, 2. K/min, 260. C @ 30. min; Column length: 25. m; Column diameter: 0.20 mm |
Capillary | OV-101 | 937. | Baaliouamer, Boudarene, et al., 1993 | He, 80. C @ 8. min, 2. K/min, 260. C @ 30. min; Column length: 25. m; Column diameter: 0.20 mm |
Capillary | HP-101 | 941. | Chung, Eiserich, et al., 1993 | N2, 3. K/min; Column length: 50. m; Column diameter: 0.25 mm; Tstart: 70. C; Tend: 200. C |
Capillary | OV-101 | 936. | Yang, Sugisawa, et al., 1992 | N2, 2. K/min; Column length: 50. m; Column diameter: 0.25 mm; Tstart: 80. C; Tend: 200. C |
Capillary | OV-101 | 939. | Yang, Sugisawa, et al., 1992 | N2, 2. K/min; Column length: 50. m; Column diameter: 0.25 mm; Tstart: 80. C; Tend: 200. C |
Capillary | DB-5 | 932. | Le Quere and Latrasse, 1990 | 60. m/0.32 mm/1. μm, He, 3. K/min; Tstart: 40. C; Tend: 220. C |
Capillary | HP-1 | 933. | Tang, Zhang, et al., 1990 | 50. m/0.32 mm/1.05 μm, He, 2. K/min, 230. C @ 40. min; Tstart: 40. C |
Capillary | OV-101 | 931. | Pieribattesti, Smadja, et al., 1988 | H2, 2. K/min; Column length: 50. m; Column diameter: 0.32 mm; Tstart: 50. C; Tend: 200. C |
Capillary | CP Sil 5 CB | 940. | Montanarella, Bos, et al., 1986 | N2, 4. K/min; Column length: 25. m; Column diameter: 0.22 mm; Tstart: 70. C; Tend: 295. C |
Capillary | OV-1 | 926. | De Pooter, Omar, et al., 1985 | 30. m/0.5 mm/0.8 μm, He, 2. K/min; Tstart: 40. C; Tend: 220. C |
Capillary | OV-1 | 928. | De Pooter, Omar, et al., 1985 | 30. m/0.5 mm/0.8 μm, He, 2. K/min; Tstart: 40. C; Tend: 220. C |
Capillary | OV-1 | 963. | De Pooter, Omar, et al., 1985 | 30. m/0.5 mm/0.8 μm, He, 2. K/min; Tstart: 40. C; Tend: 220. C |
Capillary | OV-1 | 968. | De Pooter, Omar, et al., 1985 | 30. m/0.5 mm/0.8 μm, He, 2. K/min; Tstart: 40. C; Tend: 220. C |
Packed | OV-101 | 941. | Szabolcs, Benecke, et al., 1985 | Ar, W-AW-DMCS, 2. K/min; Column length: 2. m; Tstart: 100. C |
Capillary | OV-101 | 941. | Benecke, Thieme, et al., 1982 | 2. K/min; Tstart: 100. C |

Van Den Dool and Kratz RI, non-polar column, custom temperature program

Column type | Active phase | I | Reference | Comment |
---|---|---|---|---|
Capillary | SE-52 | 937. | Bruni, Bianchi, et al., 2007 | 30. m/0.32 mm/0.15 μm, He; Program: 45C => 1C/min => 100C => 5C/min => 250C(10min) |
Capillary | BPX-5 | 934. | Dharmawan, Kasapis, et al., 2007 | 30. m/0.25 mm/0.25 μm, He; Program: 35C => 4C/min => 200C => 30C/min => 300C (3min) |
Capillary | HP-5MS | 939. | Pérez, Navarro, et al., 2007 | 30. m/0.25 mm/0.25 μm, He; Program: 50C(4min) => 10C/min => 200C(0.5min) => 20C/min => 260C(5min) |
Capillary | BPX-5 | 937. | Cardeal, da Silva, et al., 2006 | 30. m/0.25 mm/0.25 μm; Program: 35C(5min) => 3C/min => 210C => 40C/min => 240C (4min) |
Capillary | SE-52 | 938. | Guerrini, Sacchetti, et al., 2006 | 30. m/0.32 mm/0.15 μm, He; Program: 45C => 1C/min => 100C => 5C/min => 250C (10min) |
Capillary | DB-5 | 912. | Moon, Cliff, et al., 2006 | 30. m/0.32 mm/0.25 μm, He; Program: 40C(3min) => 3C/min => 180C => 10C/min => 260C(2min) |
Capillary | DB-5 | 939. | Özel, Gögüs, et al., 2006 | Program: not specified |
Capillary | SE-52 | 936. | Sacchetti, Guerrini, et al., 2006 | 30. m/0.32 mm/0.15 μm, He; Program: 45C => 1C/min => 100C => 5C/min => 250C(10min) |
Capillary | DB-5MS | 935. | Selli, Rannou, et al., 2006 | 30. m/0.32 mm/0.5 μm, He; Program: 50C => 5C/min => 200C => 8C/min => 260C(5min) |
Capillary | HP-5MS | 939. | Akpulat, Tepe, et al., 2005 | 30. m/0.25 mm/0.25 μm, He; Program: 50C (3min) => 3C/min => 200C => 6C/min => 240C |
Capillary | SE-52 | 938. | Bruni, Pellati, et al., 2005 | 30. m/0.32 mm/0.15 μm, He; Program: 45C => 1C/min => 100C => 5C/min => 250C(10min) |
Capillary | SE-52 | 926. | Lorenzo, Paz, et al., 2005 | 25. m/0.32 mm/0.43 μm, H2; Program: 60C(8min) => 3C/min => 180C => 20C/min => 250C(10min) |
Capillary | CBP-5 | 930. | Oliveira, Campos, et al., 2005 | 30. m/0.25 mm/0.25 μm, He; Program: 60C => 3C/min => 240C => 10C/min => 280C(10min) |
Capillary | 5 % Phenyl methyl siloxane | 939. | Sacchetti, Maietti, et al., 2005 | 30. m/0.32 mm/0.15 μm, He; Program: 45C => 1C/min => 100C => 5C/min => 250C (10min) |
Capillary | DB-5 | 944. | Wang, Finn, et al., 2005 | 30. m/0.32 mm/1. μm, He; Program: 40C(2min) => 5C/min => 100C => 4C/min => 230C (10min) |
Capillary | DB-5 | 932. | Wang, Finn, et al., 2005 | 30. m/0.32 mm/1. μm, He; Program: 40C(2min) => 5C/min => 100C => 4C/min => 230C (10min) |
Capillary | DB-5MS | 936. | Zheng, Kim, et al., 2005 | 30. m/0.25 mm/0.25 μm, He; Program: 40 (5min) => 4C/min => 140C => 4C/min => 200C (20min) |
Capillary | ZB-5 | 939. | Bell, 2004 | 30. m/0.32 mm/0.50 μm, Helium; Program: not specified |
Capillary | SPB-1 | 933. | Díaz-Maroto, Sánchez Palomo, et al., 2004 | 50. m/0.25 mm/0.25 μm; Program: 70C(3min) => 4C/min => 120C => 8C/min => 250C |
Capillary | SE-52 | 927. | Frizzo, Lorenzo, et al., 2004 | 25. m/0.32 mm/0.43 μm, H2; Program: 60C(8min) => 3C/min => 180C => 20C/min => 250C(10min) |
Capillary | DB-5 | 939. | Klesk, Qian, et al., 2004 | 30. m/0.32 mm/1. μm, He; Program: 40C (2min) => 5C/min => 100C => 4C/min => 230C (10min) |
Capillary | SE-52 | 927. | Lorenzo, Paz, et al., 2004 | 25. m/0.32 mm/0.4 μm; Program: 60C(8min) => 3C/min => 180C => 20C/min => 250C(10min) |
Capillary | SE-52 | 939. | Sacchetti, Medici, et al., 2004 | 30. m/0.52 mm/0.15 μm, He; Program: 45C => 1C/min => 100C => 5C/min => 250C (10min) |
Capillary | SPB-1 | 946. | Sanz, Soria, et al., 2004 | 27. m/0.25 mm/0.25 μm, He; Program: 60C => 3C/min => 180C => 8C/min => 250C (5min) |
Capillary | DB-5MS | 929. | Kim, Lee, et al., 2003 | 30. m/0.25 mm/0.25 μm, He; Program: 40C(5min) => 4C/min => 160C => 8C/min => 240C (15min) |
Capillary | DB-5 | 933. | Klesk and Qian, 2003 | 30. m/0.32 mm/1. μm, He; Program: 40C(2min) => 2C/min => 100C => 10C/min => 230C (5min) |
Capillary | DB-5 | 975. | Klesk and Qian, 2003 | 30. m/0.32 mm/1. μm, He; Program: 40C(2min) => 2C/min => 100C => 10C/min => 230C (5min) |
Capillary | SE-52 | 930. | Lorenzo, Loayza, et al., 2003 | 25. m/0.25 mm/0.25 μm, He; Program: 60C(8min) => 3C/min => 180C => 20C/min => 230C |
Capillary | CP Sil 8 CB | 939. | Mockute and Judzentiene, 2003 | He; Column length: 50. m; Column diameter: 0.32 mm; Program: 60C (2min) => 5C/min => 160C (1min) => 10C/min => 250C (2min) |
Capillary | CBP-5 | 931. | Azevedo, Campos, et al., 2002 | 50. m/0.25 mm/0.25 μm, He; Program: 60C(2min) => 3C/min => 240C => 10C/min => 280C(10min) |
Capillary | HP-5 | 938. | García, Alvarez, et al., 2002 | 50. m/0.2 mm/0.33 μm, He; Program: 50C(2min) => 5C/min => 150C => 10C/min => 250C(30min) |
Capillary | SE-52 | 926. | Lorenzo, Loayza, et al., 2002 | 25. m/0.32 mm/0.40 μm, H2; Program: 60 C (8 min) 3 C/min -> 180 C 20 C/min -> 250 C (10 min) |
Capillary | SE-52 | 928. | Lorenzo, Paz, et al., 2002 | 30. m/0.32 mm/0.42 μm, H2; Program: 60C(8min) => 3C/min => 180C => 20C/min => 250C(10min) |
Capillary | SE-52 | 927. | Lorenzo, Paz, et al., 2002 | 30. m/0.32 mm/0.42 μm, H2; Program: 60C(8min) => 3C/min => 180C => 20C/min => 250C(10min) |
Capillary | CP Sil 8 CB | 935. | Oruna-Concha, Bakker, et al., 2002 | 60. m/0.25 mm/0.25 μm, He; Program: 0C => rapidly => 40C(8min) => 4C/min => 250C(10min) |
Capillary | BP-1 | 931. | Cavalli, Ranarivelo, et al., 2001 | 50. m/0.22 mm/0.25 μm; Program: not specified |
Capillary | CP Sil 8 CB | 932. | Duckham, Dodson, et al., 2001 | 60. m/0.25 mm/0.25 μm; Program: 0C => rapidly => 40C(8min) => 4C/min => 250C(10min) |
Capillary | SE-52 | 930. | Lorenzo, Dellacassa, et al., 2001 | 25. m/0.32 mm/0.40 μm, H2; Program: 60 0C (8 min) 3 K/min -> 180 0C 20 K/min -> 250 0C (10 min) |
Capillary | SE-52 | 926. | Lorenzo, Paz, et al., 2001 | 30. m/0.32 mm/0.40 μm, H2; Program: 60 0C (8 min) 3 K/min -> 180 0C 20 K/min -> 250 0C (10 min) |
Capillary | SE-52 | 937. | Lorenzo, Saavedra, et al., 2001 | 25. m/0.25 mm/0.25 μm, He; Program: 60 0C (8 min) 3 K/min -> 180 0C 20 K/min -> 230 0C |
Capillary | DB-1 | 937. | Eri, Khoo, et al., 2000 | 60. m/0.25 mm/0.25 μm, He; Program: -20C (5min) => 10C/min => 100C => 4C/min => 200C => 10C/min => 280C |
Capillary | BP-1 | 932. | Filippini, Tomi, et al., 2000 | Program: not specified |
Capillary | DB-5 | 939. | Parker, Hassell, et al., 2000 | 50. m/0.32 mm/0.5 μm, He; Program: oC(5min) => 60C/min => 60C (5min) => 4C/min => 250C |
Capillary | Methyl Silicone | 955.02 | Hassoun, Pilling, et al., 1999 | 50. m/0.25 mm/1. μm, He; Program: -50C(2min) => 49.9C/min => 35C(10min) => 3C/min => 200C(2min) => 40C/min => 240C(30min) |
Capillary | SE-54 | 935. | Jagella and Grosch, 1999 | 30. m/0.32 mm/0.25 μm, He; Program: 35C(2min) => 40C/min => 65C => 6C/min => 250C |
Capillary | RTX-5 | 935. | Jagella and Grosch, 1999 | 30. m/0.32 mm/0.25 μm, He; Program: 35C(2min) => 40C/min => 65C => 6C/min => 250C |
Capillary | SE-52 | 926. | Loayza, de Groot, et al., 1999 | 25. m/0.25 mm/0.25 μm, He; Program: 60 0C (8 min) 3 K/min -> 180 0C 20 K/min -> 230 0C |
Capillary | SE-54 | 931. | Tairu, Hofmann, et al., 1999 | 30. m/0.32 mm/0.25 μm, He; Program: 35C (2min) => 40C/min => 60C (2min) => 6C/min => 180C => 10C/min => 230C (5min) |
Capillary | SE-54 | 931. | Tairu, Hofmann, et al., 1999, 2 | 30. m/0.32 mm/0.25 μm, He; Program: 35 0C 40 0C/min -> 60 0C (2 min) 6 0C/min -> 180 0C 10 0C/min -> 230 0C |
Capillary | DB-1 | 932. | Mattinen, Tuominen, et al., 1995 | 30. m/0.32 mm/1. μm, He; Program: 40C(3min) => 5C/min => 150C => 10C/min => 210C(30min) |
Capillary | SE-52 | 933. | Mondello, Dugo, et al., 1995 | 60. m/0.32 mm/0.40 μm, He; Program: 45 C (6 min) 3 C/min -> 111 0C 2 C/min -> 160 C 3 C/min -> 300 C (15 min) |

Van Den Dool and Kratz RI, polar column, temperature ramp

Column type | Active phase | I | Reference | Comment |
---|---|---|---|---|
Capillary | RTX-Wax | 1022. | Bendahou, Muselli, et al., 2008 | 60. m/0.22 mm/0.25 μm, He, 2. K/min, 230. C @ 30. min; Tstart: 60. C |
Capillary | DB-Wax | 1026. | Cho, Namgung, et al., 2008 | 30. m/0.25 mm/0.25 μm, He, 40. C @ 1. min, 4. K/min, 200. C @ 10. min |
Capillary | BP-20 | 1026. | Castilho, Liu, et al., 2007 | 50. m/0.22 mm/0.25 μm, He, 2. K/min, 220. C @ 20. min; Tstart: 60. C |
Capillary | BP-20 | 1027. | Duquesnoy, Castola, et al., 2007 | 50. m/0.22 mm/0.25 μm, He, 2. K/min, 220. C @ 20. min; Tstart: 60. C |
Capillary | HP-Innowax | 1028. | Kundakovic, Fokialakis, et al., 2007 | 30. m/0.25 mm/0.25 μm, He, 3. K/min; Tstart: 60. C; Tend: 280. C |
Capillary | BP-20 | 1023. | Lesueur, de Rocca Serra, et al., 2007 | 50. m/0.22 mm/0.25 μm, He, 2. K/min, 220. C @ 20. min; Tstart: 60. C |
Capillary | FFAP | 1003. | Lozano P.R., Miracle E.R., et al., 2007 | 30. m/0.25 mm/0.25 μm, He, 35. C @ 5. min, 10. K/min, 225. C @ 25. min |
Capillary | HP-20M | 1036. | Maric, Jukic, et al., 2007 | 50. m/0.2 mm/0.2 μm, He, 70. C @ 4. min, 4. K/min, 180. C @ 15. min |
Capillary | RTX-Wax | 1011. | Muselli, Rossi, et al., 2007 | 60. m/0.22 mm/0.25 μm, He, 2. K/min, 230. C @ 30. min; Tstart: 60. C |
Capillary | RTX-Wax | 1024. | Paolini J., Costa J., et al., 2007 | 60. m/0.22 mm/0.25 μm, He, 2. K/min, 230. C @ 35. min; Tstart: 60. C |
Capillary | RTX-Wax | 1024. | Paolini, Muselli, et al., 2007 | 60. m/0.22 mm/0.25 μm, He, 2. K/min, 230. C @ 35. min; Tstart: 60. C |
Capillary | HP-20M | 1030. | Politeo, Jukic, et al., 2007 | 50. m/0.20 mm/0.20 μm, Helium, 70. C @ 4. min, 4. K/min, 180. C @ 15. min |
Capillary | ZB-Wax | 1012. | Wu, Zorn, et al., 2007 | 30. m/0.32 mm/0.25 μm, He, 40. C @ 2. min, 5. K/min, 250. C @ 5. min |
Capillary | Supelcowax-10 | 1030. | Arena, Guarrera, et al., 2006 | 30. m/0.32 mm/0.5 μm, He, 70. C @ 7. min, 4. K/min, 220. C @ 20. min |
Capillary | BP-20 | 1022. | Boti, Bighelli, et al., 2006 | 50. m/0.22 mm/0.25 μm, He, 2. K/min, 220. C @ 20. min; Tstart: 60. C |
Capillary | BP-20 | 1025. | Bousmaha, Boti, et al., 2006 | 50. m/0.25 mm/0.25 μm, He, 2. K/min, 220. C @ 20. min; Tstart: 60. C |
Capillary | RTX-Wax | 1022. | Cavalli, Tomi, et al., 2006 | 60. m/0.22 mm/0.25 μm, He, 2. K/min, 230. C @ 45. min; Tstart: 60. C |
Capillary | DB-Wax | 1026. | Cho, Choi, et al., 2006 | 60. m/0.25 mm/0.25 μm, He, 40. C @ 1. min, 4. K/min, 200. C @ 10. min |
Capillary | Polyethylene Glycol | 1031. | Dob, Dahmane, et al., 2006, 2 | 30. m/0.32 mm/0.25 μm, N2, 50. C @ 10. min, 2. K/min, 230. C @ 15. min |
Capillary | HP-Wax | 1027. | Flamini, Tebano, et al., 2006 | 30. m/0.25 mm/0.25 μm, N2, 60. C @ 10. min, 5. K/min; Tend: 220. C |
Capillary | BP-20 | 1028. | Gonny, Cavaleiro, et al., 2006 | 50. m/0.22 mm/0.25 μm, He, 2. K/min, 220. C @ 20. min; Tstart: 60. C |
Capillary | DB-Wax | 1026. | Osorio, Alarcon, et al., 2006 | 30. m/0.25 mm/0.25 μm, He, 50. C @ 4. min, 4. K/min, 220. C @ 20. min |
Capillary | DB-Wax | 1013. | Pala-Paul, Copeland, et al., 2006 | 60. m/0.32 mm/0.25 μm, He, 3. K/min; Tstart: 35. C; Tend: 220. C |
Capillary | RTX-Wax | 1013. | Paolini J., Desjobert J.M., et al., 2006 | 60. m/0.22 mm/0.25 μm, He, 2. K/min, 230. C @ 35. min; Tstart: 60. C |
Capillary | Supelcowax-10 | 1030. | Pinto, Pina-Vaz, et al., 2006 | 30. m/0.2 mm/0.2 μm, He, 3. K/min, 220. C @ 15. min; Tstart: 70. C |
Capillary | PEG-20M | 1030. | Rubiolo P., Matteodo M., et al., 2006 | 25. m/0.25 mm/0.3 μm, He, 50. C @ 1. min, 3. K/min, 220. C @ 5. min |
Capillary | Supelcowax-10 | 1030. | Salgueiro L.R., Pinto E., et al., 2006 | 30. m/0.2 mm/0.2 μm, He, 3. K/min, 220. C @ 15. min; Tstart: 70. C |
Capillary | HP-20M | 1038. | Skocibusic, Bezic, et al., 2006 | 50. m/0.2 mm/0.2 μm, He, 70. C @ 4. min, 4. K/min, 180. C @ 10. min |
Capillary | DB-Wax | 1008. | Varming, Andersen, et al., 2006 | 30. m/0.25 mm/0.25 μm, He, 40. C @ 10. min, 6. K/min, 240. C @ 25. min |
Capillary | FFAP | 1046. | Agnihotri, Agarwal, et al., 2005 | 20. m/0.25 mm/0.25 μm, He, 90. C @ 2. min, 4. K/min; Tend: 220. C |
Capillary | CP-Wax 52CB | 1015. | Alasalvar, Taylor, et al., 2005 | 60. m/0.25 mm/0.25 μm, 35. C @ 4. min, 3. K/min; Tend: 203. C |
Capillary | DB-Wax | 1038. | Berlinet, Ducruet, et al., 2005 | 30. m/0.25 mm/0.25 μm, He, 3. K/min, 250. C @ 20. min; Tstart: 40. C |
Capillary | BP-20 | 1027. | Boti J.B., Koukoua G., et al., 2005 | 50. m/0.22 mm/0.25 μm, He, 2. K/min, 220. C @ 20. min; Tstart: 60. C |
Capillary | DB-Wax | 1035. | Choi, 2005 | 60. m/0.25 mm/0.25 μm, N2, 70. C @ 2. min, 2. K/min, 230. C @ 20. min |
Capillary | RTX-Wax | 1019. | Cozzani, Muselli, et al., 2005 | 60. m/0.22 mm/0.25 μm, 2. K/min, 220. C @ 20. min; Tstart: 60. C |
Capillary | PEG | 1036. | Dob, Berramdane, et al., 2005, 2 | 30. m/0.32 mm/0.25 μm, N2, 50. C @ 3. min, 2. K/min, 220. C @ 15. min |
Capillary | Supelcowax-10 | 1025. | Elmore, Nisyrios, et al., 2005 | 60. m/0.25 mm/0.25 μm, He, 40. C @ 2. min, 4. K/min; Tend: 280. C |
Capillary | DB-Wax | 1015. | Fanciullino, Gancel, et al., 2005 | 30. m/0.25 mm/0.25 μm, He, 3. K/min, 250. C @ 20. min; Tstart: 40. C |
Capillary | BP-20 | 1022. | Ferrari, Tomi, et al., 2005 | 50. m/0.22 mm/0.25 μm, He, 2. K/min, 220. C @ 20. min; Tstart: 60. C |
Capillary | DB-Wax | 1017. | Gancel, Ollitrault, et al., 2005 | 30. m/0.25 mm/0.25 μm, He, 3. K/min, 250. C @ 20. min; Tstart: 40. C |
Capillary | Innowax | 1056. | Lee, Lee, et al., 2005 | 50. m/0.25 mm/0.25 μm, He, 50. C @ 3. min, 2. K/min, 220. C @ 20. min |
Capillary | DB-Wax | 1021. | Njoroge, Koaze, et al., 2005 | 60. m/0.25 mm/0.25 μm, N2, 70. C @ 2. min, 2. K/min, 230. C @ 20. min |
Capillary | RTX-Wax | 1024. | Paolini, Costa, et al., 2005 | 60. m/0.22 mm/0.25 μm, He, 2. K/min, 230. C @ 35. min; Tstart: 60. C |
Capillary | PEG-20M | 1016. | Simionatto, Porto, et al., 2005 | 4. K/min; Tstart: 50. C; Tend: 250. C |
Capillary | Supelcowax-10 | 1013. | Smadja, Rondeau, et al., 2005 | 60. m/0.2 mm/0.2 μm, He, 2. K/min, 200. C @ 10. min; Tstart: 60. C |
Capillary | Megawax | 1008. | Verzera, Trozzi, et al., 2005 | 30. m/0.25 mm/0.25 μm, He, 40. C @ 6. min, 2. K/min, 220. C @ 10. min |
Capillary | PEG-20M | 1018. | Zhang, Xu, et al., 2005 | 30. m/0.25 mm/0.25 μm, N2, 50. C @ 8. min, 4. K/min, 220. C @ 20. min |
Capillary | DB-Wax | 1038. | Bertoli, Menichini, et al., 2004 | 30. m/0.25 mm/0.25 μm, N2, 60. C @ 10. min, 5. K/min; Tend: 220. C |
Capillary | HP-Wax | 1038. | Bertoli, Pistelli, et al., 2004 | 30. m/0.25 mm/0.25 μm, N2, 60. C @ 10. min, 5. K/min; Tend: 220. C |
Capillary | DB-Wax | 1018. | Brophy, Goldsack, et al., 2004 | 60. m/0.32 mm/0.25 μm, He, 3. K/min; Tstart: 32. C; Tend: 220. C |
Capillary | Supelcowax-10 | 1030. | Cavaleiro, Salgueiro, et al., 2004 | 30. m/0.2 mm/0.2 μm, He, 3. K/min, 220. C @ 15. min; Tstart: 70. C |
Capillary | RTX-Wax | 1012. | Dugo, Mondello, et al., 2004 | 30. m/0.25 mm/0.25 μm, He, 45. C @ 6. min, 3. K/min, 240. C @ 10. min |
Capillary | HP-Wax | 1029. | Flamini, Cioni, et al., 2004 | 30. m/0.25 mm/0.25 μm, N2, 3. K/min; Tstart: 60. C; Tend: 240. C |
Capillary | HP-Wax | 1029. | Flamini, Cioni, et al., 2004 | 30. m/0.25 mm/0.25 μm, N2, 3. K/min; Tstart: 60. C; Tend: 240. C |
Capillary | BP-20 | 1028. | Gonny, Bradesi, et al., 2004 | 50. m/0.22 mm/0.25 μm, 2. K/min, 220. C @ 20. min; Tstart: 60. C |
Capillary | DB-Wax | 1020. | Rega, Fournier, et al., 2004 | 30. m/0.32 mm/0.5 μm, He, 40. C @ 5. min, 5. K/min; Tend: 240. C |
Capillary | HP-20M | 1038. | Skocibusic and Bezic, 2004 | 50. m/0.2 mm/0.2 μm, He, 70. C @ 4. min, 4. K/min, 180. C @ 10. min |
Capillary | BP-20 | 1022. | Tam, Thuam, et al., 2004 | 50. m/0.22 mm/0.25 μm, He, 2. K/min, 220. C @ 20. min; Tstart: 60. C |
Capillary | DB-Wax | 1010. | Yu, Kim, et al., 2004 | 30. m/0.25 mm/0.25 μm, He, 40. C @ 5. min, 4. K/min, 200. C @ 20. min |
Capillary | DB-Wax | 1012. | Yu, Kim, et al., 2004 | 30. m/0.25 mm/0.25 μm, He, 40. C @ 5. min, 4. K/min, 200. C @ 20. min |
Capillary | DB-Wax | 1013. | Yu, Kim, et al., 2004, 2 | 30. m/0.25 mm/0.25 μm, He, 40. C @ 5. min, 4. K/min, 200. C @ 20. min |
Capillary | DB-Wax | 1011. | Yu, Kim, et al., 2004, 2 | 30. m/0.25 mm/0.25 μm, He, 40. C @ 5. min, 4. K/min, 200. C @ 20. min |
Capillary | DB-Wax | 1013. | Zheng, Kim, et al., 2004 | 30. m/0.25 mm/0.25 μm, He, 40. C @ 5. min, 4. K/min, 200. C @ 20. min |
Capillary | DB-Wax | 1008. | Zheng, Kim, et al., 2004 | 30. m/0.25 mm/0.25 μm, He, 40. C @ 5. min, 4. K/min, 200. C @ 20. min |
Capillary | HP-Wax | 1030. | Bader, Caponi, et al., 2003 | 30. m/0.25 mm/0.25 μm, N2, 60. C @ 10. min, 5. K/min; Tend: 220. C |
Capillary | HP-Wax | 1029. | Bader, Caponi, et al., 2003, 2 | 30. m/0.25 mm/0.25 μm, N2, 60. C @ 10. min, 5. K/min; Tend: 220. C |
Capillary | Supelcowax | 1014. | Bassole, Ouattara, et al., 2003 | 30. m/0.25 mm/0.25 μm, He, 2. K/min, 240. C @ 10. min; Tstart: 40. C |
Capillary | HP-20M | 1038. | Bezic, Skocibusic, et al., 2003 | 50. m/0.2 mm/0.2 μm, He, 70. C @ 4. min, 4. K/min, 180. C @ 10. min |
Capillary | BP-20 | 1024. | Bianchini, Tomi, et al., 2003 | 50. m/0.22 mm/0.25 μm, He, 2. K/min, 230. C @ 35. min; Tstart: 60. C |
Capillary | BP-20 | 1024. | Bianchini, Tomi, et al., 2003 | 50. m/0.22 mm/0.25 μm, He, 2. K/min, 230. C @ 35. min; Tstart: 60. C |
Capillary | Carbowax 20M | 1025. | Bicchi, Rubiolo, et al., 2003 | 25. m/0.25 mm/0.3 μm, He, 50. C @ 1. min, 3. K/min, 200. C @ 20. min |
Capillary | DB-Wax | 1010. | Brat, Rega, et al., 2003 | 30. m/0.25 mm/0.25 μm, He, 3. K/min, 250. C @ 20. min; Tstart: 40. C |
Capillary | RTX-Wax | 1025. | Cavalli, Tomi, et al., 2003 | 60. m/0.22 mm/0.25 μm, He, 2. K/min, 230. C @ 45. min; Tstart: 60. C |
Capillary | Supelcowax | 1028. | Chisholm, Wilson, et al., 2003 | 25. m/0.25 mm/0.25 μm, 35. C @ 5. min, 4. K/min, 225. C @ 10. min |
Capillary | DB-Wax | 1034. | Choi, 2003 | 60. m/0.25 mm/0.25 μm, N2, 70. C @ 2. min, 2. K/min, 230. C @ 20. min |
Capillary | HP-Wax | 1029. | Emilio Tomei, Manganelli, et al., 2003 | 30. m/0.25 mm/0.25 μm, N2, 60. C @ 10. min, 5. K/min; Tend: 220. C |
Capillary | DB-Wax | 1017. | Gancel, Ollitrault, et al., 2003 | 60. m/0.32 mm/0.25 μm, H2, 1.5 K/min, 245. C @ 20. min; Tstart: 40. C |
Capillary | DB-Wax | 1027. | Högnadóttir and Rouseff, 2003 | 30. m/0.32 mm/0.5 μm, 7. K/min, 240. C @ 5. min; Tstart: 40. C |
Capillary | HP-20M | 1033. | Jerkovic, Mastelic, et al., 2003 | 50. m/0.2 mm/0.2 μm, He, 70. C @ 4. min, 4. K/min, 180. C @ 10. min |
Capillary | CP-Wax 52CB | 1008. | Kjeldsen, Christensen, et al., 2003 | 50. m/0.25 mm/0.2 μm, He, 32. C @ 1. min, 1. K/min; Tend: 220. C |
Capillary | AT-Wax | 1007. | Pino, Almora, et al., 2003 | 60. m/0.32 mm/0.25 μm, He, 65. C @ 10. min, 2. K/min, 250. C @ 60. min |
Capillary | HP-20M | 1038. | Radonic and Milso, 2003 | 50. m/0.2 mm/0.2 μm, He, 70. C @ 4. min, 5. K/min, 180. C @ 10. min |
Capillary | DB-Wax | 1020. | Rega, Fournier, et al., 2003 | 30. m/0.32 mm/0.5 μm, 35. C @ 5. min, 5. K/min, 240. C @ 5. min |
Capillary | RTX-Wax | 1016. | Shellie, Marriott, et al., 2003 | 30. m/0.25 mm/0.25 μm, He, 45. C @ 6. min, 3. K/min; Tend: 250. C |
Capillary | HP-Innowax | 1030. | Skaltsa, Demetzos, et al., 2003 | 30. m/0.25 mm/0.5 μm, He, 3. K/min; Tstart: 60. C; Tend: 260. C |
Capillary | HP20Wax | 1038. | Skocibusic and Bezic, 2003 | 50. m/0.2 mm/0.2 μm, He, 70. C @ 4. min, 4. K/min, 180. C @ 10. min |
Capillary | HP-Innowax | 1029. | Tzakou, Couladis, et al., 2003 | 30. m/0.25 mm/0.5 μm, He, 3. K/min; Tstart: 60. C; Tend: 260. C |
Capillary | Megawax | 1008. | Verzera, Trozzi, et al., 2003 | 30. m/0.25 mm/0.25 μm, He, 40. C @ 6. min, 2. K/min, 220. C @ 10. min |
Capillary | DB-Wax | 1030. | Choi, Kim. M.-S.L., et al., 2002 | 60. m/0.25 mm/0.25 μm, N2, 2. K/min, 230. C @ 20. min; Tstart: 70. C |
Capillary | Supelcowax-10 | 1019. | Chung, Yung, et al., 2002 | 60. m/0.25 mm/0.25 μm, He, 35. C @ 5. min, 2. K/min, 195. C @ 90. min |
Capillary | Innowax | 1029. | Couladis, Chinou, et al., 2002 | 30. m/0.25 mm/0.5 μm, He, 3. K/min, 260. C @ 10. min; Tstart: 60. C |
Capillary | BP-20 | 1021. | Lota, de Rocca Serra, et al., 2002 | 50. m/0.22 mm/0.25 μm, He, 2. K/min, 220. C @ 20. min; Tstart: 60. C |
Capillary | RTX-Wax | 1011. | Mondello, Zappia, et al., 2002 | 30. m/0.25 mm/0.25 μm, He, 45. C @ 6. min, 3. K/min, 250. C @ 10. min |
Capillary | AT-Wax | 1012. | Pino, Marbot, et al., 2002, 4 | 60. m/0.32 mm/0.25 μm, He, 65. C @ 10. min, 2. K/min, 250. C @ 60. min |
Capillary | BP-20 | 1021. | Pintore, Usai, et al., 2002 | 50. m/0.22 mm/0.25 μm, 2. K/min, 220. C @ 20. min; Tstart: 60. C |
Capillary | RTX-Wax | 1015. | Shellie, Mondello, et al., 2002 | 30. m/0.25 mm/0.25 μm, He, 45. C @ 6. min, 3. K/min; Tend: 250. C |
Capillary | RTX-Wax | 1020. | Shellie, Mondello, et al., 2002 | 30. m/0.25 mm/0.25 μm, He, 45. C @ 6. min, 3. K/min; Tend: 250. C |
Capillary | BP-20 | 1024. | Bianchini, Tomi, et al., 2001 | 50. m/0.22 mm/0.25 μm, He, 2. K/min, 230. C @ 35. min; Tstart: 60. C |
Capillary | Supelcowax-10 | 1019. | Chung, Yung, et al., 2001 | 60. m/0.25 mm/0.25 μm, He, 35. C @ 5. min, 2. K/min, 195. C @ 90. min |
Capillary | HP-Innowax | 1038. | Couladis, Baziou, et al., 2001 | 30. m/0.25 mm/0.50 μm, He, 3. K/min, 260. C @ 10. min; Tstart: 60. C |
Capillary | HP-Innowax | 1029. | Couladis, Tzakou, et al., 2001 | 30. m/0.25 mm/0.50 μm, He, 3. K/min; Tstart: 60. C; Tend: 260. C |
Capillary | CP-Wax 52CB | 1008. | Kjeldsen, Christensen, et al., 2001 | 50. m/0.25 mm/0.2 μm, 32. C @ 1. min, 1. K/min; Tend: 220. C |
Capillary | BP-20 | 1021. | Lota, Serra, et al., 2001 | 50. m/0.22 mm/0.25 μm, He, 2. K/min; Tstart: 60. C; Tend: 220. C |
Capillary | HP-20M | 1038. | Milos, Radonic, et al., 2001 | 50. m/0.20 mm/0.20 μm, He, 70. C @ 4. min, 4. K/min, 180. C @ 10. min |
Capillary | AT-Wax | 1012. | Pino, Marbot, et al., 2001 | 60. m/0.32 mm/0.25 μm, He, 65. C @ 10. min, 2. K/min, 250. C @ 60. min |
Capillary | BP-20 | 1024. | Rezzi, Bighelli, et al., 2001 | 50. m/0.22 mm/0.25 μm, He, 2. K/min, 220. C @ 20. min; Tstart: 60. C |
Capillary | BP-20 | 1022. | Baldovini, Ristorcelli, et al., 2000 | 50. m/0.22 mm/0.25 μm, 2. K/min, 220. C @ 20. min; Tstart: 60. C |
Capillary | DB-Wax | 1041. | Bartley and Jacobs, 2000 | 60. m/0.5 mm/0.32 μm, He, 40. C @ 2. min, 4. K/min, 290. C @ 5. min |
Capillary | DB-Wax | 1020. | Brophy, Goldsack, et al., 2000 | 60. m/0.50 mm/1.0 μm, He, 3. K/min; Tstart: 60. C; Tend: 225. C |
Capillary | DB-Wax | 1020. | Brophy, Goldsack, et al., 2000, 2 | 60. m/0.53 mm/1.0 μm, He, 3. K/min; Tstart: 50. C; Tend: 220. C |
Capillary | DB-Wax | 1020. | Brophy, Goldsack, et al., 2000, 3 | 60. m/0.53 mm/1.0 μm, He, 3. K/min; Tstart: 50. C; Tend: 220. C |
Capillary | CP-Wax 52CB | 1030. | Chagonda, Makanda, et al., 2000 | 25. m/0.25 mm/0.15 μm, 40. C @ 5. min, 3. K/min; Tend: 220. C |
Capillary | CP-Wax 52CB | 1032. | Chagonda, Makanda, et al., 2000 | 25. m/0.25 mm/0.15 μm, 40. C @ 5. min, 3. K/min; Tend: 220. C |
Capillary | CP-Wax 52CB | 1025. | Chevance, Farmer, et al., 2000 | 60. C @ 5. min, 4. K/min, 220. C @ 30. min; Column length: 50. m; Column diameter: 0.32 mm |
Capillary | DB-Wax | 1039. | Choi and Sawamura, 2000 | 60. m/0.25 mm/0.25 μm, N2, 70. C @ 2. min, 2. K/min, 230. C @ 20. min |
Capillary | DB-Wax | 1017. | Kim, Thuy, et al., 2000 | 30. m/0.25 mm/0.25 μm, He, 40. C @ 5. min, 2. K/min, 200. C @ 20. min |
Capillary | BP-20 | 1021. | Lota, de Rocca Serra, et al., 2000 | 50. m/0.22 mm/0.25 μm, He, 2. K/min, 230. C @ 35. min; Tstart: 60. C |
Capillary | BP-20 | 1021. | Lota, de Rocca Serra, et al., 2000 | 50. m/0.22 mm/0.25 μm, He, 2. K/min, 230. C @ 35. min; Tstart: 60. C |
Capillary | HP-20M | 1038. | Milos and Radonic, 2000 | 50. m/0.2 mm/0.2 μm, 70. C @ 4. min, 4. K/min, 180. C @ 10. min |
Capillary | Megawax | 1008. | Verzera, Trozzi, et al., 2000 | 30. m/0.25 mm/0.25 μm, He, 40. C @ 6. min, 2. K/min, 220. C @ 10. min |
Capillary | DB-Wax | 1020. | Brophy, Goldsack, et al., 1999 | He, 3. K/min; Column length: 60. m; Column diameter: 0.53 mm; Tstart: 50. C; Tend: 220. C |
Capillary | CP-Wax 52CB | 1014. | Chevance and Farmer, 1999 | 60. C @ 5. min, 4. K/min, 220. C @ 30. min; Column length: 50. m; Column diameter: 0.32 mm |
Capillary | CP-Wax 52CB | 1026. | Chevance and Farmer, 1999 | 60. C @ 5. min, 4. K/min, 220. C @ 30. min; Column length: 50. m; Column diameter: 0.32 mm |
Capillary | CP-Wax 52CB | 1014. | Chevance and Farmer, 1999, 2 | 60. C @ 5. min, 4. K/min, 220. C @ 30. min; Column length: 50. m; Column diameter: 0.32 mm |
Capillary | CP-Wax 52CB | 1014. | Chevance and Farmer, 1999, 2 | 40. C @ 5. min, 4. K/min, 220. C @ 30. min; Column length: 50. m; Column diameter: 0.32 mm |
Capillary | CP-Wax 52CB | 1026. | Chevance and Farmer, 1999, 2 | 40. C @ 5. min, 4. K/min, 220. C @ 30. min; Column length: 50. m; Column diameter: 0.32 mm |
Capillary | HP-Innowax | 1023. | Christensen, Jakobsen, et al., 1999 | He, 32. C @ 1. min, 2. K/min, 220. C @ 40. min; Column length: 60. m; Column diameter: 0.25 mm |
Capillary | BP-20 | 1021. | Lota, Serra, et al., 1999 | 50. m/0.22 mm/0.25 μm, He, 2. K/min, 230. C @ 35. min; Tstart: 60. C |
Capillary | BP-20 | 1021. | Lota, Serra, et al., 1999 | 50. m/0.22 mm/0.25 μm, He, 2. K/min, 230. C @ 35. min; Tstart: 60. C |
Capillary | BP-20 | 1022. | Mazzoni, Tomi, et al., 1999 | 50. m/0.22 mm/0.25 μm, He, 2. K/min, 220. C @ 20. min; Tstart: 60. C |
Capillary | Carbowax 20M | 1031. | Bicchi, Rubiolo, et al., 1998 | 25. m/0.25 mm/0.3 μm, H2, 50. C @ 1. min, 3. K/min, 200. C @ 20. min |
Capillary | DB-Wax | 1016. | Brophy, Forster, et al., 1998 | He, 3. K/min; Column length: 60. m; Column diameter: 0.32 mm; Tstart: 35. C; Tend: 220. C |
Capillary | SP-1000 | 1020. | Brophy, Forster, et al., 1998, 2 | He, 3. K/min; Column length: 85. m; Column diameter: 0.5 mm; Tstart: 60. C; Tend: 225. C |
Capillary | DB-Wax | 1020. | Brophy, Goldsack, et al., 1998 | He, 3. K/min; Column length: 60. m; Column diameter: 0.32 mm; Tstart: 65. C; Tend: 225. C |
Capillary | DB-Wax | 1020. | Brophy, Goldsack, et al., 1998, 2 | He, 3. K/min; Column length: 60. m; Column diameter: 0.32 mm; Tstart: 35. C; Tend: 220. C |
Capillary | DB-Wax | 1014. | Cha, Kim, et al., 1998 | 60. m/0.25 mm/0.25 μm, 40. C @ 5. min, 3. K/min, 200. C @ 60. min |
Capillary | DB-Wax | 1008. | Cha, Kim, et al., 1998 | 30. m/0.32 mm/0.25 μm, He, 40. C @ 5. min, 6. K/min, 200. C @ 30. min |
Capillary | DB-Wax | 1021. | Ollé, Baumes, et al., 1998 | 30. m/0.32 mm/0.5 μm, 40. C @ 3. min, 3. K/min, 245. C @ 20. min |
Capillary | DB-Wax | 1020. | Brophy, Goldsack, et al., 1997 | He, 3. K/min; Column length: 60. m; Column diameter: 0.32 mm; Tstart: 65. C; Tend: 225. C |
Capillary | SP-1000 | 1020. | Brophy, Goldsack, et al., 1997, 2 | He, 3. K/min; Column length: 85. m; Column diameter: 0.5 mm; Tstart: 65. C; Tend: 225. C |
Capillary | BP-20 | 1025. | Mariotti, Costa, et al., 1997 | 50. m/0.22 mm/0.25 μm, He, 2. K/min, 230. C @ 35. min; Tstart: 60. C |
Capillary | DB-Wax | 1014. | Möllenbeck, König, et al., 1997 | 25. m/0.25 mm/0.25 μm, He, 50. C @ 3. min, 4. K/min; Tend: 240. C |
Capillary | DB-Wax | 1015. | Perry, van Klink, et al., 1997 | H2, 5. K/min; Column length: 10. m; Tstart: 50. C; Tend: 250. C |
Capillary | CP-Wax 52CB | 1017. | Chyau, Mau, et al., 1996 | 50. m/0.23 mm/0.12 μm, H2, 50. C @ 10. min, 1.5 K/min, 200. C @ 10. min |
Capillary | Supelcowax-10 | 1028. | Granicher, Christen, et al., 1995 | 60. m/0.25 mm/0.25 μm, He, 60. C @ 5. min, 5. K/min, 230. C @ 20. min |
Capillary | Carbowax 20M | 1020. | Mondello, Dugo, et al., 1995 | 60. m/0.32 mm/0.425 μm, He, 45. C @ 3. min, 3. K/min, 300. C @ 20. min |
Capillary | Carbowax 20M | 1041. | Píry, Príbela, et al., 1995 | 50. m/0.2 mm/0.2 μm, He, 30. C @ 2. min, 4. K/min, 170. C @ 20. min |
Capillary | DB-Wax | 1021. | Combariza, Tirado, et al., 1994 | 60. m/0.25 mm/0.25 μm, He, 50. C @ 10. min, 2. K/min, 150. C @ 20. min |
Capillary | CP-Wax 52CB | 1034. | Wu and Yang, 1994 | H2, 50. C @ 10. min, 1.5 K/min, 200. C @ 40. min; Column length: 50. m; Column diameter: 0.32 mm |
Capillary | HP-20M | 1034. | Chung, Eiserich, et al., 1993 | He, 3. K/min; Column length: 50. m; Column diameter: 0.25 mm; Tstart: 60. C; Tend: 190. C |
Capillary | HP-FFAP | 1045. | Chung, Eiserich, et al., 1993 | He, 3. K/min; Column length: 50. m; Column diameter: 0.25 mm; Tstart: 60. C; Tend: 210. C |
Capillary | DB-Wax | 1019. | Shiratsuchi, Shimoda, et al., 1993 | 60. m/0.25 mm/0.25 μm, 50. C @ 4. min, 2. K/min, 230. C @ 30. min |
Capillary | Carbowax 20M | 1005. | Kawakami, Sachs, et al., 1990 | He, 60. C @ 4. min, 2. K/min; Column length: 50. m; Column diameter: 0.25 mm; Tend: 180. C |
Capillary | DB-Wax | 1015. | Le Quere and Latrasse, 1990 | 30. m/0.32 mm/0.5 μm, He, 3. K/min; Tstart: 40. C; Tend: 220. C |
Capillary | Carbowax 20M | 1014. | Chen and Ho, 1988 | He, 1.5 K/min, 225. C @ 80. min; Column length: 60. m; Column diameter: 0.32 mm; Tstart: 50. C |

Van Den Dool and Kratz RI, polar column, custom temperature program

Column type | Active phase | I | Reference | Comment |
---|---|---|---|---|
Capillary | Supelcowax-10 | 1012. | Bianchi, Cantoni, et al., 2007 | 30. m/0.25 mm/0.25 μm; Program: 35C(8min) => 4C/min => 60C => 6C/min => 160C => 20C/min => 220C(1min) |
Capillary | Supelcowax-10 | 1010. | Bianchi, Careri, et al., 2007 | 30. m/0.25 mm/0.25 μm, He; Program: 35C(8min) => 4C/min => 60C => 6C/min => 160C => 20C/min => 200C(1min) |
Capillary | Supelcowax-10 | 1017. | Bianchi, Careri, et al., 2007 | 30. m/0.25 mm/0.25 μm, He; Program: 35C(8min) => 4C/min => 60C => 6C/min => 160C => 20C/min => 200C(1min) |
Capillary | Supelcowax-10 | 1012. | Bianchi, Careri, et al., 2007 | 30. m/0.25 mm/0.25 μm, He; Program: 35C(8min) => 4C/min => 60C => 6C/min => 160C => 20C/min => 200C(1min) |
Capillary | HP-Innowax | 1030. | Carrer, Vanderlinde, et al., 2007 | He; Column length: 30. m; Column diameter: 0.25 mm; Program: 40C(8min) => 3C/min => 180C => 20C/min => 230C (20min) |
Capillary | DB-Wax | 1030. | Elston, Lin, et al., 2005 | Program: not specified |
Capillary | Carbowax 20M | 1038. | Lorenzo, Paz, et al., 2005 | 25. m/0.32 mm/0.25 μm, H2; Program: 40C(8min) => 3C/min => 180C => 20C/min => 230C(10min) |
Capillary | Stabilwax | 1038. | Wang, Finn, et al., 2005 | 30. m/0.32 mm/1. μm, He; Program: 40C(2min) => 5C/min => 100C => 4C/min => 230C (10min) |
Capillary | Stabilwax | 1023. | Wang, Finn, et al., 2005 | 30. m/0.32 mm/1. μm, He; Program: 40C(2min) => 5C/min => 100C => 4C/min => 230C (10min) |
Capillary | DB-Wax | 1009. | Zheng, Kim, et al., 2005 | 30. m/0.25 mm/0.25 μm, He; Program: 40 (5min) => 4C/min => 140C => 4C/min => 200C (20min) |
Capillary | DB-Wax | 1011. | Bell, 2004 | 30. m/0.32 mm/0.50 μm, Helium; Program: not specified |
Capillary | RTX-Wax | 1008. | Dugo, Mondello, et al., 2004 | Program: not specified |
Capillary | Carbowax 20M | 1015. | Frizzo, Lorenzo, et al., 2004 | 25. m/0.32 mm/0.25 μm, H2; Program: 40C(8min) => 3C/min => 180C => 20C/min => 230C |
Capillary | CP-Wax 52CB | 1022. | Alasalvar, Shahidi, et al., 2003 | 60. m/0.25 mm/0.25 μm, He; Program: 40C => 5C/min => 60C => 2.5C/min => 155C |
Capillary | DB-Wax | 1023. | Klesk and Qian, 2003 | 30. m/0.25 mm/0.5 μm, He; Program: 40C(2min) => 2C/min => 100C => 10C/min => 230C (5min) |
Capillary | BP-20 | 1012. | Lorenzo, Loayza, et al., 2003 | 25. m/0.25 mm/0.25 μm, He; Program: 40C(8min) => 3C/min => 180C => 20C/min => 230C |
Capillary | Stabilwax | 1018. | Hudaib, Speroni, et al., 2002 | He; Program: 50C(8min) => 4C/min => 180C(10min) => 5C/min => 220C |
Capillary | BP-20 | 1000. | Lorenzo, Loayza, et al., 2002 | 25. m/0.25 mm/0.25 μm, He; Program: 40 0C (8 min) 3 K/min -> 180 0C 20 K/min -> 230 0C |
Capillary | Carbowax 20M | 1037. | Lorenzo, Paz, et al., 2002 | 25. m/0.32 mm/0.25 μm, H2; Program: 40C(8min) => 3C/min => 180C => 20C/min => 230C |
Capillary | Carbowax 20M | 1000. | Lorenzo, Paz, et al., 2002 | 25. m/0.32 mm/0.25 μm, H2; Program: 40C(8min) => 3C/min => 180C => 20C/min => 230C |
Capillary | RTX-Wax | 1023. | Cavalli, Ranarivelo, et al., 2001 | 60. m/0.25 mm/0.25 μm; Program: not specified |
Capillary | Carbowax 20M | 1006. | Lorenzo, Dellacassa, et al., 2001 | 25. m/0.32 mm/0.25 μm, H2; Program: 40 0C (8 min) 3 K/min -> 180 0C 20 K/min -> 230 0C |
Capillary | Carbowax 20M | 1013. | Lorenzo, Saavedra, et al., 2001 | 25. m/0.32 mm/0.25 μm, H2; Program: 40 0C (8 min) 3 K/min -> 180 0C 20 K/min -> 230 0C |
Capillary | DB-Wax | 1029. | Radovic, Careri, et al., 2001 | 30. m/0.25 mm/0.25 μm; Program: 30C(8min) => 4C/min => 60C => 6C/min => 160C => 20C/min => 200C(1min) |
Capillary | BP-20 | 1022. | Filippini, Tomi, et al., 2000 | Program: not specified |
Capillary | FFAP | 1010. | Jagella and Grosch, 1999 | 30. m/0.32 mm/0.25 μm, He; Program: 40C(1min) => 40C/min => 60C => 6C/min => 230C |
Capillary | Carbowax 20M | 1024. | Loayza, de Groot, et al., 1999 | 25. m/0.32 mm/0.25 μm, H2; Program: 40 0C (8 min) 3 K/min -> 180 0C 20 K/min -> 230 0C |
Capillary | FFAP | 1007. | Tairu, Hofmann, et al., 1999 | 30. m/0.32 mm/0.25 μm, He; Program: 35C (2min) => 40C/min => 60C (2min) => 6C/min => 180C => 10C/min => 230C (5min) |
Capillary | HP-Innowax | 1020. | Bisio, Ciarallo, et al., 1998 | 30. m/0.25 mm/0.25 μm, He; Program: 60C(8min) => 3C/min => 180C(5min) => 40C/min => 250C |
Capillary | HP-Innowax | 1022. | Iversen, Jakobsen, et al., 1998 | 60. m/0.25 mm/0.25 μm, He; Program: 32C(1.5min) => 3C/min => 40C (10min) => 3C/min => 200C (10min) |
Capillary | Supelcowax-10 | 1016. | Cadwallader and Xu, 1994 | 60. m/0.25 mm/0.25 μm, He; Program: 40C => (6C/min) => 80C(6min) => (15C/min) => 200C(10min) |
Capillary | Carbowax 20M | 1030. | Whitfield, Shea, et al., 1981 | Column length: 150. m; Column diameter: 0.75 mm; Program: not specified |

Normal alkane RI, non-polar column, isothermal

Column type | Active phase | Temperature (C) | I | Reference | Comment |
---|---|---|---|---|---|
Capillary | DB-5 | 25. | 939. | Hemmateenejad, Jawadnia, et al., 2007 |

Normal alkane RI, non-polar column, temperature ramp

Column type | Active phase | I | Reference | Comment |
---|---|---|---|---|
Capillary | HP-5 | 938. | Bertuzzi, Tirillini, et al., 2013 | 30. m/0.25 mm/0.25 μm, Helium, 60. C @ 3. min, 4. K/min, 300. C @ 15. min |
Capillary | Polydimethyl siloxane: CP-Sil 5 CB | 945. | Bramston-Cook, 2013 | 60. m/0.25 mm/1.0 μm, Helium, 45. C @ 1.45 min, 3.6 K/min, 210. C @ 2.72 min |
Capillary | HP-5 MS | 937. | Sardashti, Valizadeh, et al., 2013 | 60. m/0.25 mm/0.25 μm, Helium, 40. C @ 1. min, 3. K/min, 250. C @ 20. min |
Capillary | HP-1 | 937. | Alizadeh and Shaabani, 2012 | 30. m/0.25 mm/0.25 μm, Helium, 3. K/min; Tstart: 60. C; Tend: 240. C |
Capillary | Optima-5 | 932. | Al-Qudah, Muhaidat, et al., 2012 | 30. m/0.25 mm/0.25 μm, Helium, 60. C @ 1. min, 3. K/min; Tend: 246. C |
Capillary | RTX-1 | 936. | Bendiabdellah, El Amine Dib, et al., 2012 | 60. m/0.22 mm/0.25 μm, Helium, 2. K/min, 230. C @ 5. min; Tstart: 60. C |
Capillary | RTX-1 | 936. | Bendiabdellah, El Amine Dib, et al., 2012 | 60. m/0.22 mm/0.25 μm, Helium, 2. K/min, 230. C @ 5. min; Tstart: 60. C |
Capillary | DB-5 | 930. | Boukhris, Bouaziz, et al., 2012 | 30. m/0.25 mm/0.25 μm, Helium, 100. C @ 1. min, 10. K/min, 260. C @ 10. min |
Capillary | Mega-5 | 935. | Dell'Agli, Sanna, et al., 2012 | 25. m/0.25 mm/0.25 μm, Helium, 50. C @ 1. min, 3. K/min, 220. C @ 5. min |
Capillary | Optima-5 MS | 937. | Goeminne, Vandendriessche, et al., 2012 | 30. m/0.25 mm/0.25 μm, Helium, 35. C @ 3. min, 10. K/min, 250. C @ 5. min |
Capillary | HP-5 MS | 939. | Jian-Yu, Zhu, et al., 2012 | 30. m/0.25 mm/0.25 μm, Helium, 40. C @ 1. min, 3. K/min, 250. C @ 3. min |
Capillary | Polydimethyl siloxane with 5 % Ph | 939. | Priya, Prathapan, et al., 2012 | Helium, 5. K/min, 200. C @ 25. min; Column length: 30. m; Tstart: 80. C |
Capillary | DB-5 | 939. | Silva, Suzuki, et al., 2012 | 35. m/0.20 mm/0.10 μm, Helium, 4. K/min; Tstart: 50. C; Tend: 200. C |
Capillary | HP-5 | 928. | Velickovic, Ristic, et al., 2012 | 25. m/0.32 mm/0.52 μm, Hydrogen, 4. K/min, 280. C @ 10. min; Tstart: 40. C |
Capillary | HP-5 | 928. | Velickovic, Ristic, et al., 2012 | 25. m/0.32 mm/0.52 μm, Hydrogen, 4. K/min, 280. C @ 10. min; Tstart: 40. C |
Capillary | HP-5 | 928. | Velickovic, Ristic, et al., 2012 | 25. m/0.32 mm/0.52 μm, Hydrogen, 4. K/min, 280. C @ 10. min; Tstart: 40. C |
Capillary | RTX-1 | 927. | Yapi, Boti, et al., 2012 | 60. m/0.22 mm/0.25 μm, Helium, 2. K/min, 230. C @ 45. min; Tstart: 60. C |
Capillary | HP-5 MS | 936. | Zouari, Ayadi, et al., 2012 | 30. m/0.25 mm/0.25 μm, Helium, 50. C @ 1. min, 7. K/min, 250. C @ 5. min |
Capillary | HP-1 | 934. | Alizadeh, Khosh-Khui, et al., 2011 | 30. m/0.25 mm/0.25 μm, Helium, 3. K/min; Tstart: 60. C; Tend: 240. C |
Capillary | CP-Sil 5 CB | 933. | Ameen, Usman, et al., 2011 | 25. m/0.25 mm/0.15 μm, Helium; Tstart: 50. C; Tend: 220. C |
Capillary | HP-5 | 939. | Bertoli, Lepnardi, et al., 2011 | 30. m/0.25 mm/0.25 μm, Helium, 3. K/min; Tstart: 60. C; Tend: 240. C |
Capillary | DB-5 | 980. | Cais-Sokolinska, Majcher, et al., 2011 | 25. m/0.20 mm/0.33 μm, Helium, 50. C @ 1. min, 20. K/min; Tend: 240. C |
Capillary | DB-5 | 930. | Cao, Li, et al., 2011 | 30. m/0.25 mm/0.25 μm, Helium, 40. C @ 5. min, 3. K/min, 250. C @ 20. min |
Capillary | DB-5 MS | 944. | Cui, Yang, et al., 2011 | 30. m/0.25 mm/0.25 μm, Helium, 3. K/min; Tstart: 60. C; Tend: 270. C |
Capillary | CP-Sil 5 CB | 943. | Esseien, Aboaba, et al., 2011 | 25. m/0.25 mm/0.15 μm, Hydrogen, 3. K/min; Tstart: 50. C; Tend: 230. C |
Capillary | DB-1 | 942. | Fathi, Sahari, et al., 2011 | 30. m/0.25 mm/0.25 μm, Helium, 5. K/min; Tstart: 40. C; Tend: 210. C |
Capillary | HP-5 MS | 937. | Feizbakhsh and Naeemy, 2011 | 30. m/0.25 mm/0.25 μm, Helium, 60. C @ 20. min, 4. K/min, 220. C @ 20. min |
Capillary | HP-5 MS | 925. | Hammami, Kamoun, et al., 2011 | 30. m/0.25 mm/0.25 μm, Helium, 2. K/min; Tstart: 50. C; Tend: 180. C |
Capillary | HP-5 MS | 930. | Kadri, Zarai, et al., 2011 | 30. m/0.25 mm/0.25 μm, Helium, 35. C @ 3. min, 5. K/min, 250. C @ 10. min |
Capillary | DB-5 | 939. | Karimi, Farmani, et al., 2011 | 30. m/0.25 mm/0.25 μm, Helium, 3. K/min; Tstart: 60. C; Tend: 240. C |
Capillary | VF-5 MS | 932. | Leffingwell and Alford, 2011 | 60. m/0.32 mm/0.25 μm, Helium, 2. K/min, 260. C @ 28. min; Tstart: 30. C |
Capillary | VF-5 MS | 936. | Leffingwell and Alford, 2011 | 60. m/0.32 mm/0.25 μm, Helium, 2. K/min, 260. C @ 28. min; Tstart: 30. C |
Capillary | SE-30 MS | 936. | Menichini, Tundis, et al., 2011 | 30. m/0.25 mm/0.25 μm, Helium, 50. C @ 5. min, 5. K/min, 250. C @ 10. min |
Capillary | DB-1 | 932. | Misharina T., 2011 | 50. m/0.32 mm/0.25 μm, Helium, 8. K/min; Tstart: 60. C; Tend: 250. C |
Capillary | CP-Sil 5 CB | 936. | Mothana, Hasson, et al., 2011 | 30. m/0.25 mm/0.26 μm, Nitrogen, 3. K/min, 280. C @ 22. min; Tstart: 45. C |
Capillary | Methylsiloxane + 5 % Ph-groups | 931. | Nadim, Malik, et al., 2011 | 30. m/0.25 mm/0.25 μm, Helium, 60. C @ 2. min, 7. K/min, 230. C @ 20. min |
Capillary | DB-5 | 930. | Pattiram, Lasekan, et al., 2011 | 30. m/0.32 mm/0.25 μm, Helium, 2. K/min; Tstart: 35. C; Tend: 200. C |
Capillary | HP-5 MS | 923. | Taherpour, Maroofi, et al., 2011 | 30. m/0.25 mm/0.32 μm, Helium, 60. C @ 3. min, 6. K/min, 210. C @ 2. min |
Capillary | HP-5 MS | 932. | Zarai, Kadri, et al., 2011 | 30. m/0.25 mm/0.25 μm, Helium, 30. C @ 3. min, 5. K/min, 250. C @ 10. min |
Capillary | Elite-5 MS | 932. | Baharum, Bunawan, et al., 2010 | 30. m/0.25 mm/0.25 μm, Helium, 4. K/min; Tstart: 40. C; Tend: 220. C |
Capillary | ZB-5 MS | 936. | Boix, Victorio, et al., 2010 | 30. m/0.25 mm/0.25 μm, Helium, 5. K/min; Tstart: 60. C; Tend: 290. C |
Capillary | ZB-5 MS | 939. | Boix, Victorio, et al., 2010 | 30. m/0.25 mm/0.25 μm, Helium, 5. K/min; Tstart: 60. C; Tend: 290. C |
Capillary | HP-5 | 930. | Cavar, Maksimovic, et al., 2010 | 30. m/0.252 mm/0.25 μm, Helium, 3. K/min; Tstart: 60. C; Tend: 240. C |
Capillary | DB-5 MS | 939. | Chalchat, Figueredo, et al., 2010 | 25. m/0.30 mm/0.25 μm, Helium, 3. K/min; Tstart: 50. C; Tend: 240. C |
Capillary | DB-5 MS | 939. | Chalchat, Figueredo, et al., 2010 | 25. m/0.30 mm/0.25 μm, Helium, 3. K/min; Tstart: 50. C; Tend: 240. C |
Capillary | RTx-1 | 936. | Dib, Bendahou, et al., 2010 | 60. m/0.22 mm/0.25 μm, Helium, 2. K/min, 230. C @ 35. min; Tstart: 60. C |
Capillary | RTX-1 | 936. | Dib, Djabou, et al., 2010 | 60. m/0.22 mm/0.25 μm, Helium, 2. K/min, 230. C @ 30. min; Tstart: 60. C |
Capillary | DB-5 | 931. | Georgiou, Koutsaviti, et al., 2010 | 30. m/0.32 mm/0.25 μm, Helium, 3. K/min; Tstart: 60. C; Tend: 280. C |
Capillary | DB-1 | 921. | Hajimahdipoor, Samadi, et al., 2010 | 30. m/0.25 mm/0.25 μm, Helium, 50. C @ 1. min, 2.5 K/min, 265. C @ 20. min |
Capillary | DB-5 | 939. | Ho, Wang, et al., 2010 | 30. m/0.25 mm/0.25 μm, Helium, 2. K/min; Tstart: 50. C; Tend: 250. C |
Capillary | SPB-1 | 947. | Lazarevic, Palic, et al., 2010 | 30. m/0.25 mm/0.25 μm, Helium, 50. C @ 3. min, 5. K/min, 250. C @ 15. min |
Capillary | DB-5 MS | 956. | Majcher, Lawrowski, et al., 2010 | 25. m/0.20 mm/0.33 μm, Helium, 40. C @ 1. min, 10. K/min; Tend: 250. C |
Capillary | DB-5 MS | 939. | Mesa-Arango, Betancur-Galvis, et al., 2010 | 60. m/0.25 mm/0.25 μm, Helium, 40. C @ 15. min, 5. K/min, 250. C @ 15. min |
Capillary | DB-1 | 931. | Meshkatalsadat, Safaei-Ghomi. J., et al., 2010 | 60. m/0.25 mm/0.25 μm, Nitrogen, 5. K/min; Tstart: 60. C; Tend: 250. C |
Capillary | DB-1 | 935. | Mirjalili, Salehi, et al., 2010 | 25. m/0.25 mm/0.25 μm, Nitrogen, 60. C @ 1. min, 4. K/min, 250. C @ 10. min |
Capillary | BP-1 | 934. | Mishra, Chaudhary, et al., 2010 | Nitrogen, 60. C @ 10. min, 5. K/min, 220. C @ 30. min |
Capillary | HP-5 | 934. | Miyazawa, Kawauchi, et al., 2010 | 30. m/0.25 mm/0.25 μm, Helium, 4. K/min, 260. C @ 5. min; Tstart: 40. C |
Capillary | HP-5 | 928. | Monsef-Esfahani, Miri, et al., 2010 | 30. m/0.25 mm/0.25 μm, Helium, 50. C @ 5. min, 3. K/min; Tend: 240. C |
Capillary | SPB-1 | 933. | Neves, Rosa, et al., 2010 | 30. m/0.20 mm/0.20 μm, Helium, 3. K/min, 220. C @ 15. min; Tstart: 70. C |
Capillary | HP-5 MS | 939. | Ogunwande, Flamini, et al., 2010 | 30. m/0.25 mm/0.25 μm, Helium, 60. C @ 10. min, 5. K/min; Tend: 220. C |
Capillary | HP-5 MS | 938. | Pino, Marquez, et al., 2010 | 30. m/0.32 mm/0.25 μm, Helium, 50. C @ 2. min, 4. K/min, 240. C @ 10. min |
Capillary | HP-5 MS | 932. | Pripdeevech, Chumpolsri, et al., 2010 | 30. m/0.25 mm/0.25 μm, Helium, 2. K/min; Tstart: 100. C; Tend: 220. C |
Capillary | HP-5 | 939. | Radulovic, Dordevic, et al., 2010 | 30. m/0.25 mm/0.25 μm, Hydrogen, 5. K/min; Tstart: 70. C; Tend: 290. C |
Capillary | HP-5 MS | 936. | Radulovic, Dordevic, et al., 2010, 2 | 30. m/0.25 mm/0.25 μm, Helium, 5. K/min, 290. C @ 10. min; Tstart: 70. C |
Capillary | HP-5 MS | 935. | Safaei-Ghomi and Batooli, 2010 | 30. m/0.25 mm/0.25 μm, Helium, 60. C @ 3. min, 6. K/min; Tend: 220. C |
Capillary | DB-1 | 933. | Safaei-Ghomi, Meshkatalsadat, et al., 2010 | 60. m/0.25 mm/0.25 μm, Nitrogen, 60. C @ 1. min, 4. K/min, 250. C @ 10. min |
Capillary | SLB-5 MS | 932. | Scandinaro, Tranchida, et al., 2010 | 10. m/0.10 mm/0.10 μm, Helium, 10. K/min; Tstart: 50. C; Tend: 250. C |
Capillary | SLB-5 MS | 933. | Scandinaro, Tranchida, et al., 2010 | 10. m/0.10 mm/0.10 μm, Helium, 10. K/min; Tstart: 50. C; Tend: 250. C |
Capillary | DB-5 | 920. | de Souza, Lopes, et al., 2010 | 30. m/0.25 mm/0.25 μm, Helium, 40. C @ 1. min, 3. K/min; Tend: 240. C |
Capillary | DB-1-MS | 930. | Takeoka, Hobbs, et al., 2010 | 60. m/0.25 mm/0.25 μm, Helium, 30. C @ 4. min, 2. K/min, 200. C @ 35. min |
Capillary | CP Sil 5 CB | 933. | Usman, Zubair, et al., 2010 | 25. m/0.25 mm/0.15 μm, 3. K/min; Tstart: 50. C; Tend: 230. C |
Capillary | DB-5 | 931. | Vahirua-Lechat, Mitermite, et al., 2010 | 30. m/0.25 mm/0.25 μm, Helium, 3. K/min, 240. C @ 2. min; Tstart: 80. C |
Capillary | DB-1 | 927. | Xu, Tang, et al., 2010 | 30. m/0.25 mm/0.25 μm, Helium, 50. C @ 2. min, 4. K/min, 220. C @ 2. min |
Capillary | DB-5 | 927. | Yang, Zhang, et al., 2010 | 30. m/0.25 mm/0.25 μm, Helium, 40. C @ 1. min, 10. K/min, 250. C @ 3. min |
Capillary | HP-5MS | 940. | Zouari, Zouari, et al., 2010 | 30. m/0.25 mm/0.25 μm, Helium, 50. C @ 1. min, 7. K/min, 250. C @ 5. min |
Capillary | DB-5 | 939. | Alim, Goze, et al., 2009 | 30. m/0.25 mm/0.25 μm, Helium, 3. K/min; Tstart: 60. C; Tend: 240. C |
Capillary | OV-101 | 925. | Benites, Moiteiro, et al., 2009 | 50. m/0.25 mm/0.25 μm, Helium, 2. K/min; Tstart: 70. C; Tend: 220. C |
Capillary | SE-54 | 937. | Dayisoylu and Alma, 2009 | 30. m/0.25 mm/0.25 μm, Helium, 60. C @ 5. min, 2. K/min, 260. C @ 999. min |
Capillary | DB-5 | 939. | El-Massry, El-Ghorab, et al., 2009 | 30. m/0.25 mm/0.25 μm, Helium, 3. K/min, 220. C @ 40. min; Tstart: 35. C |
Capillary | HP-5 MS | 937. | Farhat, Ginies, et al., 2009 | 30. m/0.25 mm/0.25 μm, Helium, 60. C @ 8. min, 2. K/min, 250. C @ 15. min |
Capillary | SPB-5 | 939. | Gauvin-Bialecki and Marodon, 2009 | 60. m/0.35 mm/0.25 μm, Nitrogen, 4. K/min, 230. C @ 40. min; Tstart: 60. C |
Capillary | SPB-5 | 936. | Gilani, Shah, et al., 2009 | 30. m/0.53 mm/0.50 μm, Nitrogen, 50. C @ 5. min, 3. K/min, 210. C @ 45. min |
Capillary | DB-5 | 939. | Ho, Wang, et al., 2009 | 30. m/0.25 mm/0.25 μm, Helium, 50. C @ 2. min, 5. K/min; Tend: 250. C |
Capillary | DB-5 | 941. | Jaimand, Rezaee, et al., 2009 | 30. m/0.25 mm/0.25 μm, Helium, 3. K/min; Tstart: 60. C; Tend: 210. C |
Capillary | HP-5 MS | 939. | Karlsson, Birgersson, et al., 2009 | 30. m/0.25 mm/0.25 μm, Hydrogen, 30. C @ 5. min, 8. K/min, 230. C @ 10. min |
Capillary | DB-5 | 939. | Kazemi and Akhavani, 2009 | 50. m/0.20 mm/0.32 μm, Nitrogen, 60. C @ 3. min, 5. K/min; Tend: 220. C |
Capillary | HP-5 MS | 928. | Kim and Chung, 2009 | 30. m/0.25 mm/0.25 μm, Helium, 35. C @ 5. min, 2. K/min, 195. C @ 30. min |
Capillary | DB-5 | 936. | Lawal and Oyedelji, 2009 | 30. m/0.25 mm/0.25 μm, Helium, 5. K/min; Tstart: 70. C; Tend: 240. C |
Capillary | VF-5 | 943. | Li and Zhao, 2009 | 30. m/0.25 mm/0.25 μm, Helium, 60. C @ 2. min, 10. K/min, 300. C @ 10. min |
Capillary | HP-5MS | 939. | Males, Plazibat, et al., 2009 | 60. m/0.25 mm/0.25 μm, Helium, 3. K/min; Tstart: 70. C; Tend: 250. C |
Capillary | VF-1 MS | 934. | Marchesini, Prada, et al., 2009 | 30. m/0.25 mm/0.25 μm, Helium, 60. C @ 5. min, 4. K/min, 280. C @ 10. min |
Capillary | RTX-1 | 931. | Museli, Pau, et al., 2009 | 60. m/0.22 mm/0.25 μm, Helium, 2. K/min, 230. C @ 30. min; Tstart: 60. C |
Capillary | RTX-1 | 936. | Museli, Pau, et al., 2009 | 60. m/0.22 mm/0.25 μm, Helium, 2. K/min, 230. C @ 30. min; Tstart: 60. C |
Capillary | DB-5 | 935. | Porto, Decorti, et al., 2009 | 30. m/0.25 mm/0.25 μm, Helium, 45. C @ 3. min, 3. K/min, 250. C @ 5. min |
Capillary | DB-5 | 936. | Rahmi-Nasrabadi, Gholivand, et al., 2009 | 30. m/0.25 mm/0.25 μm, Nitrogen, 40. C @ 1. min, 3. K/min, 250. C @ 10. min |
Capillary | DB-5 | 939. | Rahimi-Nasrabadi, Gholivand, et al., 2009 | 30. m/0.25 mm/0.25 μm, Nitrogen, 40. C @ 1. min, 3. K/min, 250. C @ 10. min |
Capillary | 5 % Phenyl methyl siloxane | 938. | Retta, Gattuso, et al., 2009 | 60. m/0.25 mm/0.25 μm, Helium, 3. K/min, 225. C @ 3. min; Tstart: 90. C |
Capillary | DB-5 | 940. | Scrivanti, Anton, et al., 2009 | 30. m/0.25 mm/0.25 μm, Nitrogen, 2. K/min; Tstart: 40. C; Tend: 230. C |
Capillary | DB-1 MS | 928. | Seo, Kim, et al., 2009 | 30. m/0.25 mm/0.25 μm, Helium, 40. C @ 1. min, 6. K/min, 250. C @ 4. min |
Capillary | DB-5 | 939. | Shafaghat and Sadeghi, 2009 | 50. m/0.20 mm/0.32 μm, Nitrogen, 60. C @ 3. min, 5. K/min, 220. C @ 5. min |
Capillary | DB-5 MS | 927. | Shimizu, Imayoshi, et al., 2009 | 30. m/0.25 mm/0.25 μm, Helium, 50. C @ 2. min, 3. K/min, 220. C @ 70. min |
Capillary | DB-5 MS | 933. | Shimizu, Imayoshi, et al., 2009 | 30. m/0.25 mm/0.25 μm, Helium, 50. C @ 2. min, 3. K/min, 220. C @ 70. min |
Capillary | SPB-5 | 944. | Sivadier, Ratel, et al., 2009 | 60. m/0.32 mm/1.00 μm, 40. C @ 5. min, 3. K/min, 230. C @ 10. min |
Capillary | DB-5 | 920. | de Souza, Lopes, et al., 2009 | 30. m/0.25 mm/0.25 μm, Helium, 40. C @ 1. min, 3. K/min; Tend: 240. C |
Capillary | DB-5 MS | 935. | Su, Wang, et al., 2009 | 30. m/0.25 mm/0.25 μm, Helium, 40. C @ 2. min, 4. K/min, 250. C @ 2. min |
Capillary | HP-5MS | 939. | Wannes, Mhamdi, et al., 2009 | 30. m/0.25 mm/0.25 μm, Helium, 5. K/min; Tstart: 50. C; Tend: 240. C |
Capillary | HP-5 MS | 927. | Zaibunnisa, Norashikin, et al., 2009 | 30. m/0.25 mm/0.25 μm, Helium, 60. C @ 6. min, 10. K/min, 325. C @ 10. min |
Capillary | HP-5 | 938. | Zhannan, Shiqiong, et al., 2009 | 30. m/0.32 mm/0.25 μm, Helium, 40. C @ 4. min, 4. K/min; Tend: 240. C |
Capillary | HP-5 MS | 932. | Zhao, Zeng, et al., 2009 | 30. m/0.25 mm/0.25 μm, Helium, 4. K/min; Tstart: 50. C; Tend: 280. C |
Capillary | HP-5 | 938. | Aicha, Ines, et al., 2008 | 30. m/0.25 mm/0.25 μm, Helium, 50. C @ 3. min, 9. K/min, 280. C @ 3. min |
Capillary | DB-5 | 932. | Bastos, Ishimoto, et al., 2008 | 30. m/0.25 mm/0.25 μm, Helium, 3. K/min; Tstart: 60. C; Tend: 220. C |
Capillary | HP-5 MS | 940. | Baziou, Couladis, et al., 2008 | 3. K/min; Column length: 30. m; Column diameter: 0.25 mm; Tstart: 60. C; Tend: 280. C |
Capillary | HP-101 | 945. | Blazevic and Mastelic, 2008 | 25. m/0.20 mm/0.25 μm, Helium, 70. C @ 2. min, 3. K/min; Tend: 200. C |
Capillary | Ultra 2 | 932. | Byun and Shin, 2008 | 50. m/0.20 mm/0.11 μm, Helium, 60. C @ 5. min, 2. K/min, 230. C @ 30. min |
Capillary | HP-5 | 941. | Flamini, Tebano, et al., 2008 | 30. m/0.25 mm/0.25 μm, N2, 60. C @ 10. min, 5. K/min; Tend: 220. C |
Capillary | HP-5 MS | 939. | Forero, Quijano, et al., 2008 | 30. m/0.25 mm/0.25 μm, Helium, 50. C @ 4. min, 4. K/min, 230. C @ 10. min |
Capillary | HP-5 | 930. | Isidorov, Lech, et al., 2008 | 30. m/0.25 mm/0.25 μm, Helium, 3. K/min, 300. C @ 30. min; Tstart: 50. C |
Capillary | VF-5MS | 910. | Kowalski, 2008 | 30. m/0.25 mm/0.25 μm, Helium, 240. C @ 1. min, 20. K/min; Tend: 320. C |
Capillary | HP-5 | 939. | Lago, Romoff, et al., 2008 | 30. m/0.32 mm/0.25 μm, Helium, 100. C @ 2. min, 5. K/min, 240. C @ 5. min |
Capillary | SLB-5 MS | 933. | Lo Presti, Sciarrone, et al., 2008 | 30. m/0.25 mm/0.25 μm, Helium, 50. C @ 2. min, 3. K/min, 250. C @ 10. min |
Capillary | ZB-1 | 932. | Mierendorff, Stahl-Biskup, et al., 2008 | 30. m/0.25 mm/0.25 μm, Nitrogen, 3. K/min; Tstart: 45. C; Tend: 230. C |
Capillary | DB-5 | 937. | Mosayebi, Amin, et al., 2008 | 60. m/0.25 mm/0.25 μm, Nitrogen, 5. K/min, 250. C @ 10. min; Tstart: 60. C |
Capillary | DB-5 MS | 986. | Noudogbessi, Yedomonhan, et al., 2008 | 30. m/0.25 mm/0.25 μm, Helium, 50. C @ 5. min, 5. K/min, 300. C @ 5. min |
Capillary | Elite-1 | 930. | Raj, Baby, et al., 2008 | 30. m/0.32 mm/0.25 μm, Helium, 3. K/min; Tstart: 60. C; Tend: 246. C |
Capillary | HP-5 MS | 928. | Sahraoui, Vian, et al., 2008 | 30. m/0.25 mm/0.25 μm, Helium, 60. C @ 8. min, 2. K/min, 250. C @ 15. min |
Capillary | BPX-5 | 934. | Shellie, 2008 | 7.5 m/0.10 mm/10. μm, Helium, 3. K/min; Tstart: 60. C; Tend: 240. C |
Capillary | RTX-5 | 936. | Skalicka-Wozniak, Los, et al., 2008 | 20. m/0.18 mm/0.20 μm, Helium, 50. C @ 1. min, 4. K/min; Tend: 280. C |
Capillary | HP-5 | 941. | Verdian-rizi, 2008 | 25. m/0.25 mm/0.25 μm, Helium, 60. C @ 2. min, 4. K/min; Tend: 240. C |
Capillary | OV-1 | 940. | Wang, Yi, et al., 2008 | 30. m/0.25 mm/0.25 μm, Helium, 6. K/min; Tstart: 65. C; Tend: 260. C |
Capillary | HP-5 | 940. | Yassa and Akhani, 2008 | 30. m/0.25 mm/0.32 μm, Helium, 60. C @ 30. min, 5. K/min; Tend: 250. C |
Capillary | HP-5 MS | 939. | Adams, Beauchamp, et al., 2007 | 30. m/0.25 mm/0.25 μm, Helium, 50. C @ 10. min, 3. K/min, 230. C @ 10. min |
Capillary | SE-54 | 921. | Alma, Ertas, et al., 2007 | 30. m/0.25 mm/0.25 μm, Helium, 60. C @ 5. min, 2. K/min, 260. C @ 20. min |
Capillary | DB-5 | 935. | Amiri, 2007 | 50. m/0.20 mm/0.32 μm, Nitrogen, 60. C @ 3. min, 5. K/min, 220. C @ 5. min |
Capillary | DB-5MS | 938. | Andrade, Oliveira, et al., 2007 | 30. m/0.25 mm/0.25 μm, He, 3. K/min; Tstart: 60. C; Tend: 240. C |
Capillary | HP-5 MS | 931. | Araque, Rojas, et al., 2007 | 30. m/0.25 mm/0.25 μm, Helium, 4. K/min, 200. C @ 20. min; Tstart: 60. C |
Capillary | HP-5 | 934. | Asekun, Olusegun, et al., 2007 | He, 5. K/min; Column length: 30. m; Column diameter: 0.25 mm; Tstart: 70. C; Tend: 240. C |
Capillary | CP Sil 5 CB | 931. | Baran, von Reuss, et al., 2007 | 30. m/0.32 mm/0.25 μm, N2, 4. K/min; Tstart: 60. C; Tend: 300. C |
Capillary | HP-5MS | 934. | Basta, Pavlovic, et al., 2007 | 30. m/0.25 mm/0.25 μm, He, 3. K/min; Tstart: 60. C; Tend: 280. C |
Capillary | HP-5MS | 933. | Basta, Tzakou, et al., 2007 | 30. m/0.25 mm/0.25 μm, He, 3. K/min; Tstart: 60. C; Tend: 280. C |
Capillary | SE-52 | 931. | Bicchi, Cordero, et al., 2007 | 30. m/0.25 mm/0.25 μm, 50. C @ 1. min, 3. K/min, 220. C @ 5. min |
Capillary | DB-5 | 930. | Bos, Woerdenbag, et al., 2007 | 30. m/0.26 mm/0.25 μm, He, 3. K/min; Tstart: 60. C; Tend: 240. C |
Capillary | HP-5MS | 939. | Bozin B., Mlmica-Dukic N., et al., 2007 | 30. m/0.25 mm/0.25 μm, He, 3. K/min; Tstart: 60. C; Tend: 280. C |
Capillary | HP-5 MS | 935. | Capetanos, Saroglou, et al., 2007 | 30. m/0.32 mm/0.25 μm, Helium, 60. C @ 5. min, 4. K/min; Tend: 280. C |
Capillary | HP-5 | 939. | Cheraif, Ben Jannet, et al., 2007 | 30. m/0.25 mm/0.25 μm, N2, 50. C @ 1. min, 5. K/min, 240. C @ 4. min |
Capillary | DB-5 | 944. | Chyau, Tsai, et al., 2007 | 60. m/0.25 mm/0.25 μm, He, 3. K/min; Tstart: 40. C; Tend: 220. C |
Capillary | DB-5 | 912. | Coelho, Grosso, et al., 2007 | 30. m/0.25 mm/0.25 μm, He, 70. C @ 5. min, 3. K/min, 310. C @ 20. min |
Capillary | DB-5MS | 937. | Da Silva J.K.R., Sousa P.J.C., et al., 2007 | 30. m/0.25 mm/0.25 μm, He, 3. K/min; Tstart: 60. C; Tend: 240. C |
Capillary | HP-1 | 935. | Dongmo, Tatsadjieu, et al., 2007 | 30. m/0.25 mm/0.25 μm, Helium, 10. K/min; Tstart: 70. C; Tend: 200. C |
Capillary | DB-5 | 930. | Elfami, Bos, et al., 2007 | 30. m/0.26 mm/0.25 μm, Helium, 3. K/min; Tstart: 60. C; Tend: 290. C |
Capillary | DB-5 | 936. | El-Ghorab A., El-Massry K.F., et al., 2007 | 30. m/0.25 mm/0.25 μm, He, 3. K/min, 220. C @ 40. min; Tstart: 35. C |
Capillary | HP-5 | 931. | Farsam, Amanlou, et al., 2007 | 30. m/0.25 mm/0.26 μm, Helium, 60. C @ 2. min, 4. K/min, 240. C @ 20. min |
Capillary | HP-5MS | 926. | Ferhat, Meklati, et al., 2007 | 30. m/0.25 mm/0.25 μm, He, 60. C @ 8. min, 2. K/min, 250. C @ 15. min |
Capillary | ZP-5 | 957. | Füssel, Dötterl, et al., 2007 | 60. m/0.25 mm/0.25 μm, He, 40. C @ 7. min, 6. K/min, 260. C @ 1. min |
Capillary | DB-1 | 937. | Ghasempour, Shirinpour, et al., 2007 | 60. m/0.25 mm/0.25 μm, Nitrogen, 60. C @ 1. min, 4. K/min, 250. C @ 10. min |
Capillary | DB-5 | 932. | Ghasemi, Yamini, et al., 2007 | 30. m/0.25 mm/0.25 μm, He, 60. C @ 3. min, 30. K/min; Tend: 210. C |
Capillary | DB-5 | 976. | Ghasemi, Yamini, et al., 2007 | 30. m/0.25 mm/0.25 μm, He, 60. C @ 3. min, 30. K/min; Tend: 210. C |
Capillary | 5 % Phenyl methyl siloxane | 954. | Gil A., Van Baren C.M., et al., 2007 | 60. m/0.25 mm/0.25 μm, He, 3. K/min, 225. C @ 15. min; Tstart: 90. C |
Capillary | DB-5 | 939. | Gogus, Ozel, et al., 2007 | 60. m/0.32 mm/1.0 μm, Helium, 35. C @ 7. min, 15. K/min, 240. C @ 10. min |
Capillary | Col-Elite 5MS | 937. | Gudaityte and Venskutonis R.P., 2007 | 30. m/0.25 mm/0.25 μm, He, 3. K/min; Tstart: 30. C; Tend: 246. C |
Capillary | HP-1 | 927. | Hachicha, Skanji, et al., 2007 | 30. m/0.25 mm/0.25 μm, He, 2. K/min, 240. C @ 20. min; Tstart: 60. C |
Capillary | DBP-5 | 907. | Heravi and Sereshti, 2007 | 25. m/0.25 mm/0.22 μm, Helium, 40. C @ 1. min, 3. K/min, 250. C @ 10. min |
Capillary | RTX-5 MS | 941. | Hudaib and Aburjai, 2007 | 30. m/0.25 mm/0.25 μm, He, 3. K/min; Tstart: 45. C; Tend: 210. C |
Capillary | BP-1 | 937. | Kiran, Devi, et al., 2007 | He, 5. K/min, 220. C @ 6. min; Tstart: 60. C |
Capillary | DB-5 | 926. | Limberger, Scopel, et al., 2007 | 30. m/0.25 mm/0.25 μm, He, 3. K/min; Tstart: 60. C; Tend: 300. C |
Capillary | SE-30 | 936. | Loizzo, Tundis, et al., 2007 | 30. m/0.25 mm/0.25 μm, He, 40. C @ 5. min, 5. K/min, 250. C @ 10. min |
Capillary | HP-5 | 933. | Loizzo, Tundis, et al., 2007 | 30. m/0.25 mm/0.25 μm, He, 40. C @ 5. min, 5. K/min, 250. C @ 10. min |
Capillary | DB-5MS | 913. | Marongiu B., Piras A., et al., 2007 | 30. m/0.25 mm/0.25 μm, He, 3. K/min, 280. C @ 30. min; Tstart: 60. C |
Capillary | RTX-5Sil MS | 978. | Matasyoh, Matasyoh, et al., 2007 | 30. m/0.25 mm/0.25 μm, He, 50. C @ 2. min, 5. K/min, 260. C @ 10. min |
Capillary | AT-5 | 931. | Meccia, Rojas, et al., 2007 | 60. m/0.25 mm/0.25 μm, Helium, 4. K/min; Tstart: 60. C; Tend: 260. C |
Capillary | ZB-5 | 933. | Mohottalage, Tabacchi, et al., 2007 | 30. m/0.25 mm/0.25 μm, 60. C @ 5. min, 4. K/min, 220. C @ 20. min |
Capillary | DB-1 | 931. | Monser-Esfahani, Karamkhani, et al., 2007 | 30. m/0.25 mm/0.25 μm, Helium, 50. C @ 1. min, 2.5 K/min, 260. C @ 20. min |
Capillary | DB-5 | 914. | Moreno, Lima, et al., 2007 | 30. m/0.25 mm/0.25 μm, Helium, 3. K/min; Tstart: 60. C; Tend: 300. C |
Capillary | DB-5 | 941. | Morteza-Semnani, Saeedi, et al., 2007 | 30. m/0.25 mm/0.25 μm, Helium, 4. K/min; Tstart: 60. C; Tend: 220. C |
Capillary | DB-5 | 934. | Nori-Shargh, Raftari, et al., 2007 | 30. m/0.25 mm/0.32 μm, He, 5. K/min; Tstart: 50. C; Tend: 250. C |
Capillary | HP-5 | 937. | Oliveira, Leitão, et al., 2007 | 25. m/0.2 mm/0.33 μm, H2, 3. K/min; Tstart: 60. C; Tend: 240. C |
Capillary | Methyl Silicone | 939. | Ozcan and Chalchat, 2007 | Helium, 3. K/min; Column length: 50. m; Column diameter: 0.25 mm; Tstart: 50. C; Tend: 240. C |
Capillary | DB-1 | 932. | Pala-Paul, Brophy, et al., 2007 | 50. m/0.25 mm/0.25 μm, He, 4. K/min; Tstart: 95. C; Tend: 240. C |
Capillary | SPB-1 | 930. | Pinto, Salgueiro, et al., 2007 | 30. m/0.2 mm/0.2 μm, He, 3. K/min, 220. C @ 15. min; Tstart: 70. C |
Capillary | DB-5 | 935. | Pontes, de Olivera, et al., 2007 | 30. m/0.25 mm/0.25 μm, Hydrogen, 4. K/min; Tstart: 50. C; Tend: 250. C |
Capillary | SPB-5 | 930. | Raal, Orav, et al., 2007 | 30. m/0.25 mm/0.25 μm, He, 2. K/min; Tstart: 50. C; Tend: 250. C |
Capillary | BPX-5 | 953. | Rali, Wossa, et al., 2007 | He, 50. C @ 1. min, 4. K/min, 300. C @ 10. min; Column length: 50. m; Column diameter: 0.22 mm |
Capillary | BPX-5 | 952. | Rali, Wossa, et al., 2007, 2 | 50. m/0.22 mm/1. μm, He, 50. C @ 1. min, 4. K/min, 300. C @ 10. min |
Capillary | BPX-5 | 953. | Rali, Wossa, et al., 2007, 2 | 50. m/0.22 mm/1. μm, He, 50. C @ 1. min, 4. K/min, 300. C @ 10. min |
Capillary | 5 % Phenyl methyl siloxane | 935. | Ramirez R. and Cava R., 2007 | 30. m/0.25 mm/1. μm, He, 40. C @ 10. min, 7. K/min, 250. C @ 5. min |
Capillary | DB-1 | 937. | Reza, Ebrahim, et al., 2007 | 60. m/0.25 mm/0.25 μm, Nitrogen, 60. C @ 1. min, 4. K/min, 250. C @ 10. min |
Capillary | HP-5 | 926. | Ristic, Krivokuca-Dokic, et al., 2007 | 30. m/0.25 mm/0.25 μm, Helium, 4. K/min; Tstart: 40. C; Tend: 260. C |
Capillary | HP-5 MS | 930. | Rojas, Velasco, et al., 2007 | 60. m/0.25 mm/0.25 μm, Hydrogen, 4. K/min, 260. C @ 20. min; Tstart: 60. C |
Capillary | HP-5 MS | 930. | Safaei-Ghomi, Bamoniri, et al., 2007 | 30. m/0.25 mm/0.25 μm, Helium, 60. C @ 3. min, 5. K/min, 220. C @ 3. min |
Capillary | DB-1 | 931. | Salehi, Asghari, et al., 2007 | 60. m/0.25 mm/0.25 μm, 5. K/min; Tstart: 60. C; Tend: 250. C |
Capillary | DB-1 | 940. | Salehi, Fakhari, et al., 2007 | 60. m/0.25 mm/0.25 μm, He, 5. K/min; Tstart: 60. C; Tend: 250. C |
Capillary | DB-5 | 934. | Sefidkon, Abbasi, et al., 2007 | 30. m/0.25 mm/0.25 μm, He, 4. K/min; Tstart: 50. C; Tend: 240. C |
Capillary | DBP-5 | 907. | Sereshti and Samadi, 2007 | 25. m/0.25 mm/0.22 μm, Helium, 40. C @ 1. min, 3. K/min, 250. C @ 10. min |
Capillary | DB-5 | 941. | Smelcerovic, Spiteller, et al., 2007 | 30. m/0.25 mm/0.25 μm, He, 10. K/min, 320. C @ 4. min; Tstart: 60. C |
Capillary | DB-1 | 934. | Sonboli, Kanani, et al., 2007 | 60. m/0.25 mm/0.25 μm, Nitrogen, 5. K/min, 250. C @ 10. min; Tstart: 60. C |
Capillary | DB-5 | 939. | Sylvestre, Longtin, et al., 2007 | 30. m/0.25 mm/0.25 μm, 2. K/min, 210. C @ 33. min; Tstart: 40. C |
Capillary | DB-5 | 938. | Sylvestre, Pichette, et al., 2007 | 30. m/0.25 mm/0.25 μm, 2. K/min, 250. C @ 33. min; Tstart: 40. C |
Capillary | HP-5 | 932. | Tapia, Perich, et al., 2007 | 25. m/0.2 mm/0.32 μm, 40. C @ 1. min, 5. K/min; Tend: 250. C |
Capillary | HP-5 | 933. | Tapia, Perich, et al., 2007 | 25. m/0.2 mm/0.32 μm, 40. C @ 1. min, 5. K/min; Tend: 250. C |
Capillary | Elite-5MS | 932. | Tava, Pecetti, et al., 2007 | 30. m/0.32 mm/0.5 μm, He, 40. C @ 5. min, 4. K/min, 280. C @ 10. min |
Capillary | DB-5 | 930. | Tiwary, Nail, et al., 2007 | Helium, 2. K/min, 200. C @ 20. min; Column length: 30. m; Column diameter: 0.25 mm; Tstart: 60. C |
Capillary | DB-5 | 939. | Tiwary, Nail, et al., 2007 | Helium, 2. K/min, 200. C @ 20. min; Column length: 30. m; Column diameter: 0.25 mm; Tstart: 60. C |
Capillary | HP-5 MS | 941. | Tsokou, Georgopoulos, et al., 2007 | 30. m/0.25 mm/0.25 μm, Helium, 3. K/min; Tstart: 60. C; Tend: 280. C |
Capillary | HP-5MS | 918. | Tzakou, Bazos, et al., 2007 | 30. m/0.25 mm/0.25 μm, He, 3. K/min; Tstart: 60. C; Tend: 280. C |
Capillary | HP-5 MS | 939. | Vagionas, Graikou, et al., 2007 | 30. m/0.25 mm/0.25 μm, Helium, 3. K/min; Tstart: 60. C; Tend: 280. C |
Capillary | SPB-5 | 942. | Vasta, Ratel, et al., 2007 | 60. m/0.32 mm/1. μm, 40. C @ 5. min, 3. K/min, 230. C @ 5. min |
Capillary | HP-5MS | 929. | Vichi, Riu-Aumatell, et al., 2007 | 30. m/0.25 mm/0.25 μm, He, 40. C @ 5. min, 3. K/min, 250. C @ 10. min |
Capillary | HP-5 | 940. | Yassa and Akhani, 2007 | 30. m/0.25 mm/0.32 μm, He, 60. C @ 30. min, 5. K/min; Tend: 250. C |
Capillary | DB-5 | 935. | Zeller and Rychlik, 2007 | 25. m/0.32 mm/0.25 μm, He, 40. C @ 1. min, 6. K/min; Tend: 230. C |
Capillary | HP-5 | 936. | Abdelwahed, Hayder, et al., 2006 | 30. m/0.25 mm/0.25 μm, N2, 50. C @ 3. min, 9. K/min, 280. C @ 3. min |
Capillary | HP-5 | 937. | Abdelwahed, Hayder, et al., 2006 | 30. m/0.25 mm/0.25 μm, N2, 50. C @ 3. min, 9. K/min, 280. C @ 3. min |
Capillary | DB-5 | 928. | Apel, Sobral, et al., 2006 | 30. m/0.25 mm/0.25 μm, He, 3. K/min; Tstart: 60. C; Tend: 300. C |
Capillary | DB-5 | 930. | Apel, Sobral, et al., 2006, 2 | 30. m/0.25 mm/0.25 μm, 3. K/min; Tstart: 60. C; Tend: 300. C |
Capillary | CP Sil 5 CB | 936. | Ayoub, Al-Azizi, et al., 2006 | He, 10. K/min; Column length: 25. m; Tstart: 80. C; Tend: 270. C |
Capillary | DB-5 | 940. | Bazargani, Almasirad, et al., 2006 | 30. m/0.25 mm/0.25 μm, He, 50. C @ 1. min, 2.5 K/min, 265. C @ 20. min |
Capillary | HP-1 | 923. | Berlioz, Cordella, et al., 2006 | 50. m/0.2 mm/0.33 μm, N2, 2. K/min, 250. C @ 20. min; Tstart: 60. C |
Capillary | ZB-5 | 936. | Biondi, Sari, et al., 2006 | 30. m/0.25 mm/0.25 μm, 2. K/min; Tstart: 40. C; Tend: 300. C |
Capillary | AT-5 | 940. | Borges, Rojas, et al., 2006 | 60. m/0.25 mm/0.25 μm, He, 4. K/min, 200. C @ 20. min; Tstart: 60. C |
Capillary | BP-1 | 932. | Boti, Yao, et al., 2006 | 50. m/0.22 mm/0.25 μm, 2. K/min, 220. C @ 20. min; Tstart: 60. C |
Capillary | HP-5MS | 935. | Bozin, Mimicá-Dukic, et al., 2006 | 30. m/0.25 mm/0.25 μm, He, 3. K/min; Tstart: 60. C; Tend: 280. C |
Capillary | HP-1 | 929. | Castel, Fernandez, et al., 2006 | 50. m/0.2 mm/0.33 μm, He, 60. C @ 4. min, 2. K/min, 250. C @ 30. min |
Capillary | HP-1 | 930. | Castel, Fernandez, et al., 2006 | 50. m/0.2 mm/0.33 μm, He, 60. C @ 4. min, 2. K/min, 250. C @ 30. min |
Capillary | SPB-1 | 930. | Cavaleiro, Pinto, et al., 2006 | 30. m/0.20 mm/0.20 μm, Helium, 3. K/min, 220. C @ 15. min; Tstart: 70. C |
Capillary | DB-1 | 931. | Chen, Sheu, et al., 2006 | Nitrogen, 40. C @ 1. min, 2. K/min, 200. C @ 9. min; Column length: 60. m; Column diameter: 0.25 mm |
Capillary | DB-5 | 936. | Choi, 2006 | 30. m/0.25 mm/0.25 μm, N2, 70. C @ 2. min, 2. K/min, 230. C @ 20. min |
Capillary | HP-5 | 936. | Coronel, Cerda-Garcia-Rojas, et al., 2006 | 30. m/0.32 mm/0.25 μm, He, 3. K/min; Tstart: 60. C; Tend: 246. C |
Capillary | DB-5 | 939. | Damjanovic, Skala, et al., 2006 | 30. m/0.32 mm/0.25 μm, 3. K/min, 230. C @ 15. min; Tstart: 60. C |
Capillary | HP-5MS | 940. | Ebrahim Sajjadi and Mehregan, 2006 | 30. m/0.25 mm/0.25 μm, 4. K/min; Tstart: 60. C; Tend: 280. C |
Capillary | DB-5 | 930. | Elfami, Komar, et al., 2006 | 30. m/0.26 mm/0.25 μm, Helium, 3. K/min; Tstart: 60. C; Tend: 290. C |
Capillary | BP-1 | 931. | Fanciullino, Tomi, et al., 2006 | 50. m/0.22 mm/0.25 μm, He, 2. K/min, 220. C @ 20. min; Tstart: 60. C |
Capillary | HP-5MS | 939. | Farah, Afifi, et al., 2006 | 30. m/0.25 mm/0.25 μm, He, 2. K/min; Tstart: 50. C; Tend: 250. C |
Capillary | HP-1 | 929. | Fernandez, Pintaric, et al., 2006 | 50. m/0.2 mm/0.33 μm, He, 2. K/min, 250. C @ 60. min; Tstart: 60. C |
Capillary | HP-5 | 933. | Figuérédo, Cabassu, et al., 2006 | 30. m/0.25 mm/0.25 μm, He, 50. C @ 5. min, 5. K/min, 300. C @ 5. min |
Capillary | HP-1 | 931. | Filippi, Lanfranchi, et al., 2006 | 50. m/0.2 mm/0.33 μm, He, 2. K/min, 250. C @ 40. min; Tstart: 60. C |
Capillary | DB-5 | 939. | Garneau F.X., Collin G., et al., 2006 | 30. m/0.25 mm/0.25 μm, 40. C @ 2. min, 2. K/min, 210. C @ 33. min |
Capillary | DB-1 | 942. | Gohari, Hadjiakhoondi, et al., 2006 | 60. m/0.25 mm/0.25 μm, He, 60. C @ 2. min, 5. K/min; Tend: 240. C |
Capillary | DB-5 | 937. | Gohari, Hadjiakhoondi, et al., 2006 | 30. m/0.25 mm/0.25 μm, He, 60. C @ 2. min, 5. K/min; Tend: 240. C |
Capillary | DB-1 | 942. | Gohari A.R., Hadjiakhoondi A., et al., 2006 | 60. m/0.25 mm/0.25 μm, He, 60. C @ 2. min, 5. K/min; Tend: 240. C |
Capillary | DB-5 | 937. | Gohari A.R., Hadjiakhoondi A., et al., 2006 | 30. m/0.25 mm/0.25 μm, He, 60. C @ 2. min, 5. K/min; Tend: 240. C |
Capillary | DB-5 | 936. | Havlik, Kokoska, et al., 2006 | 30. m/0.25 mm/0.25 μm, He, 3. K/min, 250. C @ 10. min; Tstart: 50. C |
Capillary | CP Sil 5 CB | 939. | Hymete, Rohloff, et al., 2006 | 30. m/0.25 mm/0.25 μm, 3. K/min, 220. C @ 3. min; Tstart: 40. C |
Capillary | HP-5 | 939. | Ibañez and Usubillaga, 2006 | 30. m/0.25 mm/0.25 μm, He, 4. K/min; Tstart: 60. C; Tend: 240. C |
Capillary | HP-5MS | 939. | Ibanez and Usubillaga, 2006 | 30. m/0.25 mm/0.25 μm, He, 4. K/min; Tstart: 60. C; Tend: 260. C |
Capillary | DB-5 | 937. | Javidnia, Miri, et al., 2006, 3 | 30. m/0.25 mm/0.25 μm, Helium, 3. K/min; Tstart: 60. C; Tend: 260. C |
Capillary | HP-5MS | 935. | Kim, Abd El-Aty, et al., 2006 | 30. m/0.25 mm/0.25 μm, He, 50. C @ 4. min, 5. K/min, 280. C @ 10. min |
Capillary | HP-5MS | 942. | Kim, Abd El-Aty, et al., 2006 | 30. m/0.25 mm/0.25 μm, He, 50. C @ 4. min, 5. K/min, 280. C @ 10. min |
Capillary | HP-5MS | 941. | Kim, El-Aty, et al., 2006 | 30. m/0.25 mm/0.25 μm, He, 50. C @ 4. min, 5. K/min, 280. C @ 10. min |
Capillary | BP-1 | 937. | Kiran, Bhavani, et al., 2006 | Helium, 5. K/min, 220. C @ 6. min; Tstart: 60. C |
Capillary | Methyl Silicone | 934. | Kitchlu, Bakshi, et al., 2006 | 25. m/0.25 mm/0.25 μm, He, 90. C @ 2. min, 7. K/min; Tend: 220. C |
Capillary | HP-5 | 939. | Kucuk, Gulec, et al., 2006 | 30. m/0.32 mm/0.25 μm, Helium, 60. C @ 2. min, 5. K/min, 260. C @ 13. min |
Capillary | RTX-1 | 939. | Kula, Izydorczyk, et al., 2006 | 30. m/0.32 mm/0.25 μm, He, 4. K/min; Tstart: 60. C; Tend: 300. C |
Capillary | CP Sil 5 CB | 933. | Kurowska and Galazka, 2006 | 30. m/0.25 mm/0.25 μm, N2, 60. C @ 4. min, 5. K/min; Tend: 300. C |
Capillary | DB-1 | 934. | Lan Phi N.T., Nishiyama C., et al., 2006 | 60. m/0.25 mm/0.25 μm, 70. C @ 2. min, 2. K/min, 230. C @ 20. min |
Capillary | CP Sil 8 CB | 937. | Li, Lee, et al., 2006 | 30. m/0.25 mm/0.25 μm, 40. C @ 5. min, 3. K/min, 250. C @ 20. min |
Capillary | CP Sil 5 CB | 928. | Lis and Milczarek, 2006 | 30. m/0.32 mm/0.25 μm, N2, 4. K/min; Tstart: 50. C; Tend: 300. C |
Capillary | CP Sil 5 CB | 932. | Martin, Joseph, et al., 2006 | 30. m/0.25 mm/0.25 μm, N2, 5. K/min; Tstart: 50. C; Tend: 200. C |
Capillary | HP-5 MS | 939. | Marzouk, Mansour, et al., 2006 | 30. m/0.25 mm/0.25 μm, Nitrogen, 5. K/min, 280. C @ 5. min; Tstart: 50. C |
Capillary | HP-5 | 939. | Marzouk, Neffati, et al., 2006 | 30. m/0.25 mm/0.52 μm, N2, 5. K/min, 280. C @ 5. min; Tstart: 50. C |
Capillary | DB-5MS | 918. | Maronigiu, Piras, et al., 2006 | 30. m/0.25 mm/0.25 μm, He, 3. K/min, 280. C @ 30. min; Tstart: 60. C |
Capillary | 5 % Phenyl methyl siloxane | 913. | Marongiu, Piras, et al., 2006 | 30. m/0.25 mm/0.25 μm, Helium, 3. K/min, 280. C @ 30. min; Tstart: 60. C |
Capillary | HP-101 | 945. | Mastelic, Jerkovic, et al., 2006 | 25. m/0.2 mm/0.2 μm, He, 70. C @ 2. min, 3. K/min, 200. C @ 15. min |
Capillary | DB-5 | 935. | Mirza, Navaei, et al., 2006 | 30. m/0.25 mm/0.25 μm, Helium, 50. C @ 5. min, 3. K/min; Tend: 250. C |
Capillary | BP-1 | 940. | Moody, Gundidza, et al., 2006 | He, 70. C @ 2. min, 4. K/min, 220. C @ 10. min; Column length: 25. m; Column diameter: 0.3 mm |
Capillary | DB-5 | 940. | Morteza-Semnani, Akbarzadeh, et al., 2006 | 30. m/0.25 mm/0.25 μm, He, 4. K/min; Tstart: 60. C; Tend: 220. C |
Capillary | DB-5 | 940. | Morteza-Semnani K., Akbarzadeh M., et al., 2006 | 30. m/0.25 mm/0.25 μm, He, 60. C @ 5. min, 4. K/min; Tend: 220. C |
Capillary | DB-5 | 940. | Morteza-Semnani K., Saeedi M., et al., 2006 | 30. m/0.25 mm/0.25 μm, He, 60. C @ 5. min, 4. K/min; Tend: 220. C |
Capillary | DB-5 | 938. | Najafpour Navaei, Mirza, et al., 2006 | 30. m/0.25 mm/0.25 μm, He, 4. K/min; Tstart: 50. C; Tend: 250. C |
Capillary | CP-Sil 5 CB | 939. | Olawore, Usman, et al., 2006 | 25. m/0.25 mm/0.15 μm, Hydrogen, 3. K/min; Tstart: 50. C; Tend: 230. C |
Capillary | NB-30 | 930. | Orav, Raal, et al., 2006 | 30. m/0.2 mm/0.25 μm, He, 2. K/min; Tstart: 50. C; Tend: 250. C |
Capillary | DB-5 | 940. | Ouamba, Ouabonzi, et al., 2006 | 25. m/0.25 mm/0.15 μm, N2, 50. C @ 3. min, 4. K/min; Tend: 200. C |
Capillary | SE-52 | 939. | Ozcan, Chalchat, et al., 2006 | Helium, 3. K/min; Column length: 50. m; Column diameter: 0.25 mm; Tstart: 50. C; Tend: 240. C |
Capillary | DB-5 | 939. | Ozel, Gogus, et al., 2006 | 30. m/0.32 mm/0.25 μm, He, 60. C @ 0.5 min, 5. K/min, 280. C @ 2. min |
Capillary | DB-1 | 938. | Pala-Paul J., Perez-Alonso M.J., et al., 2006 | 50. m/0.25 mm/0.25 μm, N2, 4. K/min; Tstart: 95. C; Tend: 240. C |
Capillary | HP-5MS | 932. | Petrovic, Ristic, et al., 2006 | 30. m/0.25 mm/0.25 μm, He, 4. K/min; Tstart: 40. C; Tend: 260. C |
Capillary | HP-5 | 937. | Pintore G., Chessa M., et al., 2006 | 30. m/0.25 mm/0.25 μm, He, 60. C @ 10. min, 5. K/min; Tend: 220. C |
Capillary | DB-5 | 939. | Pino, Marbot, et al., 2006 | 30. m/0.25 mm/0.25 μm, Hydrogen, 70. C @ 4. min, 4. K/min; Tend: 280. C |
Capillary | DB-5 | 938. | Pino, Marbot, et al., 2006 | 30. m/0.25 mm/0.25 μm, Hydrogen, 70. C @ 4. min, 4. K/min; Tend: 280. C |
Capillary | DB-5 | 938. | Pino, Marbot, et al., 2006 | 30. m/0.25 mm/0.25 μm, Hydrogen, 70. C @ 4. min, 4. K/min; Tend: 280. C |
Capillary | HP-5 | 939. | Pino, Sauri-Duch, et al., 2006 | 30. m/0.25 mm/0.25 μm, H2, 50. C @ 2. min, 4. K/min, 280. C @ 10. min |
Capillary | HP-5MS | 918. | Pitarokili, Tzakou, et al., 2006 | 30. m/0.25 mm/0.25 μm, He, 3. K/min; Tstart: 60. C; Tend: 280. C |
Capillary | HP-5 | 938. | Potzernheim, Bizzo, et al., 2006 | 25. m/0.32 mm/0.25 μm, H2, 3. K/min; Tstart: 60. C; Tend: 240. C |
Capillary | HP-5MS | 933. | Robinson, 2006 | 30. m/0.25 mm/0.25 μm, 50. C @ 5. min, 10. K/min; Tend: 250. C |
Capillary | DB-5 | 938. | Rout, Naik, et al., 2006 | 30. m/0.25 mm/0.25 μm, He, 2. K/min, 200. C @ 60. min; Tstart: 60. C |
Capillary | DB-5 | 936. | Sabulal, Dan, et al., 2006 | 30. m/0.25 mm/0.25 μm, He, 5. K/min; Tstart: 60. C; Tend: 260. C |
Capillary | ZB-5 | 936. | Sari M., Biondi D.M., et al., 2006 | 30. m/0.25 mm/0.25 μm, He, 2. K/min; Tstart: 40. C; Tend: 300. C |
Capillary | DB-1 | 935. | Sawamura, Onishi, et al., 2006 | 60. m/0.25 mm/0.25 μm, 70. C @ 2. min, 2. K/min, 230. C @ 20. min |
Capillary | Ultra-2 | 938. | Schlumpberger B.O., Clery R.A., et al., 2006 | 50. m/0.25 mm/0.32 μm, He, 2. K/min; Tstart: 50. C; Tend: 270. C |
Capillary | FSOT-RSL-200 | 939. | Schmidt, Jirovetz, et al., 2006 | 30. m/0.32 mm/0.25 μm, Hydrogen, 40. C @ 5. min, 6. K/min, 280. C @ 5. min |
Capillary | DB-5 | 939. | Sefidkon, Abbasi, et al., 2006 | 30. m/0.25 mm/0.25 μm, He, 4. K/min; Tstart: 50. C; Tend: 240. C |
Capillary | DB-5 | 940. | Sefidkon, Abbasi, et al., 2006 | 30. m/0.25 mm/0.25 μm, He, 4. K/min; Tstart: 50. C; Tend: 240. C |
Capillary | DB-5 | 938. | Sefidkon and Jamzad, 2006 | 30. m/0.25 mm/0.25 μm, He, 4. K/min; Tstart: 40. C; Tend: 240. C |
Capillary | DB-1 | 942. | Sefidkon, Jamzad, et al., 2006 | He, 4. K/min; Column length: 60. m; Column diameter: 0.25 mm; Tstart: 40. C; Tend: 250. C |
Capillary | HP-5 | 938. | Shafi, Jose, et al., 2006 | 25. m/0.2 mm/0.33 μm, N2, 3. K/min; Tstart: 30. C; Tend: 280. C |
Capillary | DB-1 | 933. | Sonboli, Mirjalili, et al., 2006 | 60. m/0.25 mm/0.25 μm, Helium, 5. K/min, 250. C @ 10. min; Tstart: 60. C |
Capillary | CP Sil 5 CB | 943. | Tesso, König, et al., 2006 | H2, 3. K/min; Column length: 25. m; Column diameter: 0.25 mm; Tstart: 50. C; Tend: 230. C |
Capillary | CP Sil 5 CB | 935. | Tesso, Kubeczka, et al., 2006 | 3. K/min; Column length: 25. m; Column diameter: 0.25 mm; Tstart: 50. C; Tend: 230. C |
Capillary | HP-5 MS | 932. | Tigrine-Kordiani, Meklati, et al., 2006 | 30. m/0.25 mm/0.25 μm, Helium, 60. C @ 8. min, 2. K/min, 250. C @ 15. min |
Capillary | Methyl Silicone | 941. | Tonzibo, Coffy, et al., 2006 | 25. m/0.3 mm/0.15 μm, N2, 50. C @ 5. min, 2. K/min; Tend: 210. C |
Capillary | SPB-5 | 943. | Tornambe, Cornu, et al., 2006 | 60. m/0.32 mm/1. μm, He, 40. C @ 5. min, 3. K/min, 230. C @ 2. min |
Capillary | DB-5 | 939. | Trilles, Bombarda, et al., 2006 | 30. m/0.25 mm/0.25 μm, N2, 4. K/min; Tstart: 60. C; Tend: 240. C |
Capillary | DB-1 | 924. | Velasco-Negueruela, Pérez-Alonso, et al., 2006 | 50. m/0.25 mm/0.25 μm, N2, 4. K/min; Tstart: 90. C; Tend: 240. C |
Capillary | HP-5 | 935. | Wang, Kong, et al., 2006 | 25. m/0.32 mm/0.52 μm, H2, 50. C @ 5. min, 2.5 K/min; Tend: 280. C |
Capillary | SPB-1 | 929. | Wong, Lim, et al., 2006 | 50. m/0.2 mm/0.33 μm, He, 50. C @ 1. min, 4. K/min, 220. C @ 10. min |
Capillary | SPB-1 | 936. | Wong, Sivasothy, et al., 2006 | 30. m/0.25 mm/0.25 μm, He, 50. C @ 1. min, 4. K/min, 250. C @ 10. min |
Capillary | DB-5 | 931. | Yadegarinia, Gachkar, et al., 2006 | 30. m/0.25 mm/0.25 μm, He, 4. K/min; Tstart: 40. C; Tend: 250. C |
Capillary | SE-30 | 930. | Ahuja, Bakshi, et al., 2005 | He, 90. C @ 2. min, 7. K/min; Column length: 30. m; Tend: 220. C |
Capillary | DB-5 | 937. | Askari and Sefidkon, 2005 | 30. m/0.25 mm/0.25 μm, He, 60. C @ 5. min, 3. K/min; Tend: 210. C |
Capillary | HP-5MS | 931. | Basta, Tzakou, et al., 2005 | 30. m/0.25 mm/0.25 μm, He, 3. K/min; Tstart: 60. C; Tend: 280. C |
Capillary | HP-1 | 932. | Bendimerad and Bendiab, 2005 | 50. m/0.2 mm/0.5 μm, He, 2. K/min, 250. C @ 60. min; Tstart: 60. C |
Capillary | DB-5 | 931. | Bos, Stojanova, et al., 2005 | 30. m/0.249 mm/0.25 μm, He, 3. K/min; Tstart: 60. C; Tend: 290. C |
Capillary | DB-5MS | 939. | Busman, Zoghbi, et al., 2005 | 30. m/0.25 mm/0.25 μm, He, 3. K/min; Tstart: 60. C; Tend: 240. C |
Capillary | DB-1 | 942. | Cégiéla-Carlioz, Bessière, et al., 2005 | 25. m/0.25 mm/0.25 μm, He, 50. C @ 3. min, 3. K/min; Tend: 250. C |
Capillary | DB-5 | 936. | Chagonda and Chalchat, 2005 | 50. m/0.3 mm/0.25 μm, 2. K/min; Tstart: 60. C; Tend: 240. C |
Capillary | DB-5 | 937. | Chaverri and Cicció, 2005 | 30. m/0.25 mm/0.25 μm, He, 3. K/min; Tstart: 60. C; Tend: 240. C |
Capillary | Methyl Silicone | 932. | Chalchat and Özcan, 2005 | He, 3. K/min; Column length: 60. m; Column diameter: 0.3 mm; Tstart: 50. C; Tend: 240. C |
Capillary | SPB-5 | 944. | Cornu, Kondjoyan, et al., 2005 | 60. m/0.32 mm/1. μm, He, 40. C @ 5. min, 3. K/min; Tend: 230. C |
Capillary | Polymethylsiloxane, (PMS-20000) | 940. | Dohou, Yamni, et al., 2005 | He, 50. C @ 3. min, 3. K/min; Column length: 25. m; Column diameter: 0.20 mm; Tend: 250. C |
Capillary | ZB-5 | 957. | Dötterl, Wolfe, et al., 2005 | 60. m/0.25 mm/0.25 μm, He, 40. C @ 7. min, 6. K/min, 250. C @ 1. min |
Capillary | HP-5 | 931. | Duarte, Figueira, et al., 2005 | 25. m/0.2 mm/0.33 μm, He, 3. K/min, 240. C @ 7. min; Tstart: 60. C |
Capillary | DB-1 | 940. | Facundo, Pinto, et al., 2005 | 30. m/0.25 mm/0.25 μm, He, 60. C @ 5. min, 5. K/min, 250. C @ 15. min |
Capillary | DB-1 | 936. | Fakhari, Salehi, et al., 2005 | 60. m/0.25 mm/0.25 μm, He, 5. K/min; Tstart: 60. C; Tend: 250. C |
Capillary | DB-1 | 939. | Fakhari A.R., Sonboli A., et al., 2005 | 60. m/0.25 mm/0.25 μm, N2, 5. K/min, 250. C @ 10. min; Tstart: 60. C |
Capillary | DB-5 | 926. | Ferraz, Limberger, et al., 2005 | 30. m/0.25 mm/0.25 μm, He, 60. C @ 3. min, 3. K/min; Tend: 300. C |
Capillary | HP-1 | 934. | Fernandez, Lizzani-Cuvelier, et al., 2005 | 50. m/0.2 mm/0.25 μm, 60. C @ 60. min, 2. K/min; Tend: 250. C |
Capillary | HP-5 | 939. | Ferretti, Maggi, et al., 2005 | 30. m/0.25 mm/0.25 μm, He, 60. C @ 3. min, 4. K/min, 30. C @ 15. min |
Capillary | HP-5 | 933. | Figuérédo, Cabassu, et al., 2005 | 30. m/0.25 mm/0.25 μm, He, 50. C @ 5. min, 5. K/min, 300. C @ 5. min |
Capillary | HP-5MS | 944. | Ghasemi Y., Faridi P., et al., 2005 | He, 50. C @ 3. min, 3. K/min, 250. C @ 10. min; Column length: 25. m; Column diameter: 0.25 mm |
Capillary | CP Sil 5 CB | 939. | Jassbi, Mehrdad, et al., 2005 | 30. m/0.25 mm/0.25 μm, N2, 5. K/min, 250. C @ 10. min; Tstart: 60. C |
Capillary | RSL-200 | 953. | Jirovetz, Buchbauer, et al., 2005 | 30. m/0.25 mm/0.25 μm, 40. C @ 2. min, 6. K/min, 280. C @ 10. min |
Capillary | DB-1 | 923. | Khanavi, Ghasemian, et al., 2005 | 30. m/0.25 mm/0.25 μm, He, 50. C @ 1. min, 2.5 K/min, 265. C @ 20. min |
Capillary | DB-1 | 922. | Khalighi-Sigaroodi, Hadijiakhoondi, et al., 2005 | 30. m/0.25 mm/0.25 μm, He, 50. C @ 1. min, 2.5 K/min, 265. C @ 30. min |
Capillary | DB-5 | 938. | Khayyat and Karimi, 2005 | He, 3. K/min; Column length: 30. m; Column diameter: 0.32 mm; Tstart: 60. C; Tend: 240. C |
Capillary | DB-1 | 938. | Khajeh, Yamini, et al., 2005 | 60. m/0.25 mm/0.25 μm, He, 50. C @ 5. min, 4. K/min; Tend: 250. C |
Capillary | DB-5 | 931. | Kowalski and Wolski, 2005 | 30. m/0.25 mm/0.25 μm, 35. C @ 2. min, 4. K/min; Tend: 280. C |
Capillary | DB-5 | 931. | Kowalski, 2005 | 30. m/0.25 mm/0.25 μm, Helium, 35. C @ 2. min, 4. K/min; Tend: 280. C |
Capillary | HP-5MS | 934. | Krist, Stuebiger, et al., 2005 | 30. m/0.25 mm/0.25 μm, 38. C @ 1. min, 5. K/min, 220. C @ 2. min |
Capillary | HP-5 | 940.0 | Leffingwell and Alford, 2005 | 60. m/0.32 mm/0.25 μm, He, 30. C @ 2. min, 2. K/min, 260. C @ 28. min |
Capillary | DB-5MS | 916. | Marongiu, Piras, et al., 2005 | 30. m/0.25 mm/0.25 μm, He, 60. C @ 30. min, 3. K/min; Tend: 280. C |
Capillary | DB-5 | 939. | Morteza-Semnani, Akbarzadeh, et al., 2005 | 30. m/0.25 mm/0.25 μm, He, 60. C @ 5. min, 4. K/min; Tend: 220. C |
Capillary | DB-5 | 939. | Morteza-Semnani, Akbarzadeh, et al., 2005, 2 | 30. m/0.25 mm/0.25 μm, He, 60. C @ 5. min, 4. K/min; Tend: 220. C |
Capillary | DB-5 | 941. | Morteza-Semnani and Saeedi, 2005 | 30. m/0.25 mm/0.25 μm, He, 60. C @ 4. min, 4. K/min; Tend: 220. C |
Capillary | DB-5 | 940. | Najafpour Navaei, Mirza, et al., 2005 | 30. m/0.25 mm/0.25 μm, He, 50. C @ 5. min, 3. K/min; Tend: 250. C |
Capillary | CP Sil 5 CB | 941. | Ogunwande, Olawore, et al., 2005 | 25. m/0.25 mm/0.15 μm, 3. K/min; Tstart: 50. C; Tend: 230. C |
Capillary | CP Sil 5 CB | 941. | Olawore, Ogunwande, et al., 2005 | 25. m/0.25 mm/0.15 μm, 3. K/min; Tstart: 50. C; Tend: 230. C |
Capillary | DB-5 | 935. | de Oliveira, Dias, et al., 2005 | He, 40. C @ 1. min, 4. K/min; Column length: 30. m; Column diameter: 0.25 mm; Tend: 220. C |
Capillary | DB-5 | 939. | Özel, Gögüs, et al., 2005 | 30. m/0.32 mm/0.25 μm, He, 40. C @ 0.5 min, 5. K/min, 250. C @ 2. min |
Capillary | DB-1 | 932. | Palá-Paúl, Pérez-Alonso, et al., 2005 | 50. m/0.25 mm/0.25 μm, N2, 4. K/min; Tstart: 95. C; Tend: 240. C |
Capillary | DB-1 | 932. | Pala-Paul, Perez-Alonso, et al., 2005 | 50. m/0.25 mm/0.25 μm, N2, 4. K/min; Tstart: 95. C; Tend: 240. C |
Capillary | HP-5MS | 939. | Petrakis, Roussis, et al., 2005 | 3. K/min; Column length: 30. m; Column diameter: 0.2 mm; Tstart: 60. C; Tend: 280. C |
Capillary | SPB-5 | 939. | Pino, Marbot, et al., 2005 | 30. m/0.25 mm/0.25 μm, He, 60. C @ 2. min, 4. K/min, 250. C @ 20. min |
Capillary | HP-5MS | 936. | Pourmortazavi, Ghadiri, et al., 2005 | 30. m/0.25 mm/0.32 μm, He, 60. C @ 3. min, 5. K/min; Tend: 250. C |
Capillary | DB-1 | 929. | Rasooli and Owlia, 2005 | 60. m/0.25 mm/0.25 μm, He, 4. K/min; Tstart: 50. C; Tend: 250. C |
Capillary | CP Sil 5 CB | 939. | Rohloff and Bones, 2005 | 30. m/0.25 mm/0.25 μm, He, 40. C @ 1. min, 4. K/min; Tend: 220. C |
Capillary | CP Sil 5 CB | 939. | Rohloff and Bones, 2005 | 30. m/0.25 mm/0.25 μm, He, 40. C @ 1. min, 4. K/min; Tend: 220. C |
Capillary | HP-5 | 937. | Saeidnia, Gohari, et al., 2005 | He, 5. K/min; Column length: 30. m; Column diameter: 0.25 mm; Tstart: 60. C; Tend: 240. C |
Capillary | HP-5MS | 940. | Safaei-Ghomi, Bamoniri, et al., 2005 | 30. m/0.25 mm/0.25 μm, He, 60. C @ 3. min, 6. K/min; Tend: 220. C |
Capillary | HP-5MS | 937. | Sajjadi S.E. and Eskandari B., 2005 | 30. m/0.25 mm/0.25 μm, He, 4. K/min; Tstart: 60. C; Tend: 280. C |
Capillary | HP-5MS | 937. | Sajjadi and Ghannadi, 2005 | 30. m/0.25 mm/0.25 μm, He, 4. K/min; Tstart: 60. C; Tend: 275. C |
Capillary | HP-5MS | 935. | Sajjadi, 2005 | 30. m/0.25 mm/0.25 μm, He, 4. K/min; Tstart: 60. C; Tend: 280. C |
Capillary | DB-5 | 933. | Salehi, Sefidkon, et al., 2005 | 30. m/0.25 mm/0.25 μm, He, 60. C @ 4. min, 3. K/min; Tend: 220. C |
Capillary | DB-1 | 935. | Salehi, Sonboli, et al., 2005 | 60. m/0.25 mm/0.25 μm, He, 5. K/min, 250. C @ 10. min; Tstart: 60. C |
Capillary | DB-1 | 927. | Sarkhail, Amin, et al., 2005 | 30. m/0.25 mm/0.25 μm, He, 50. C @ 1. min, 2.5 K/min, 265. C @ 20. min |
Capillary | DB-5 | 938. | Sefidkon and Jamzad, 2005 | He, 4. K/min; Column length: 30. m; Column diameter: 0.25 mm; Tstart: 40. C; Tend: 240. C |
Capillary | HP-5MS | 937. | Setzer, Noletto, et al., 2005 | 30. m/0.25 mm/0.25 μm, He, 60. C @ 5. min, 3. K/min; Tend: 280. C |
Capillary | DB-5MS | 939. | da Silva, Andrade, et al., 2005 | 30. m/0.25 mm/0.25 μm, He, 3. K/min; Tstart: 60. C; Tend: 240. C |
Capillary | DB-5 | 927. | Simoes-Pires C.A., Debenedetti S., et al., 2005 | 30. m/0.25 mm/0.25 μm, He, 3. K/min; Tstart: 60. C; Tend: 300. C |
Capillary | DB-5 | 927. | Simoes-Pires C.A., Debenedetti S., et al., 2005 | 30. m/0.25 mm/0.25 μm, He, 3. K/min; Tstart: 60. C; Tend: 300. C |
Capillary | DB-5 | 928. | Simoes-Pires C.A., Debenedetti S., et al., 2005 | 30. m/0.25 mm/0.25 μm, He, 3. K/min; Tstart: 60. C; Tend: 300. C |
Capillary | DB-5 | 939. | Skoula and Grayer, 2005 | 30. m/0.25 mm/0.25 μm, He, 3. K/min, 230. C @ 20. min; Tstart: 60. C |
Capillary | HP-5MS | 929. | Slavkovska, Couladis, et al., 2005 | 30. m/0.25 mm/0.25 μm, He, 3. K/min; Tstart: 60. C; Tend: 280. C |
Capillary | RTX-1 | 939. | Sonboli A., Fakhari A.R., et al., 2005 | 60. m/0.25 mm/0.25 μm, He, 5. K/min, 250. C @ 10. min; Tstart: 60. C |
Capillary | RTX-1 | 935. | Sonboli, Salehi, et al., 2005 | 60. m/0.25 mm/0.25 μm, He, 5. K/min, 25. C @ 10. min; Tstart: 60. C |
Capillary | DB-1 | 934. | Sonboli, Salehi, et al., 2005, 2 | 60. m/0.25 mm/0.25 μm, He, 5. K/min, 250. C @ 10. min; Tstart: 60. C |
Capillary | BP-1 | 932. | Srivastava, Srivastava, et al., 2005 | 30. m/0.32 mm/0.25 μm, N2, 5. K/min, 220. C @ 15. min; Tstart: 60. C |
Capillary | DB-5 | 940. | Stevanovic, Garneau, et al., 2005 | 30. m/0.25 mm/0.25 μm, 40. C @ 2. min, 2. K/min, 210. C @ 33. min |
Capillary | HP-5MS | 916. | Tepe B., Sokmen M., et al., 2005 | 30. m/0.25 mm/0.25 μm, He, 50. C @ 3. min, 3. K/min; Tend: 240. C |
Capillary | HP-5MS | 939. | Tesevic, Nikicevic, et al., 2005 | 30. m/0.25 mm/0.25 μm, He, 4.3 K/min; Tstart: 60. C; Tend: 285. C |
Capillary | HP-5 MS | 937. | Topçu, Barla, et al., 2005 | 30. m/0.25 mm/0.50 μm, He, 3. K/min, 260. C @ 20. min; Tstart: 60. C |
Capillary | HP-5MS | 918. | Tzakou, Bazos, et al., 2005 | 30. m/0.25 mm/0.25 μm, He, 3. K/min; Tstart: 60. C; Tend: 280. C |
Capillary | HP-5 MS | 939. | Urdampilleta, Amat, et al., 2005 | 30. m/0.25 mm/0.25 μm, Helium, 3. K/min; Tstart: 60. C; Tend: 240. C |
Capillary | DB-1 | 924. | Velasco-Negueruela, Pérez-Alonso, et al., 2005 | 50. m/0.25 mm/0.25 μm, N2, 4. K/min; Tstart: 90. C; Tend: 240. C |
Capillary | DB-1 | 926. | Velasco-Negueruela, Pérez-Alonso, et al., 2005, 2 | 50. m/0.25 mm/0.25 μm, 3. K/min; Tstart: 60. C; Tend: 240. C |
Capillary | HP-5MS | 929. | Vichi, Riu-Aumatell, et al., 2005 | 30. m/0.25 mm/0.25 μm, 40. C @ 5. min, 3. K/min, 220. C @ 10. min |
Capillary | SPB-1 | 935. | Wong, Lee, et al., 2005 | 50. m/0.2 mm/0.33 μm, He, 50. C @ 3. min, 4. K/min, 220. C @ 30. min |
Capillary | HP-5 | 927. | N/A | 30. m/0.32 mm/0.25 μm, Helium, 40. C @ 2. min, 5. K/min, 250. C @ 5. min |
Capillary | HP-5 | 940. | Yayli, Yasar, et al., 2005 | 30. m/0.32 mm/0.25 μm, He, 60. C @ 2. min, 5. K/min, 260. C @ 13. min |
Capillary | CP Sil 5 CB | 931. | Agnaniet, Menut, et al., 2004 | 30. m/0.25 mm/0.25 μm, N2, 5. K/min; Tstart: 50. C; Tend: 200. C |
Capillary | DB-5 | 931. | Agnihotri, Thappa, et al., 2004 | 30. m/0.25 mm/0.25 μm, He, 90. C @ 2. min, 7. K/min, 220. C @ 5. min |
Capillary | BP-1 | 931. | Blanc, Muselli, et al., 2004 | 50. m/0.22 mm/0.25 μm, 2. K/min, 220. C @ 20. min; Tstart: 60. C |
Capillary | SE-52 | 916. | Cakir, Kordali, et al., 2004 | 25. m/0.32 mm/0.15 μm, N2, 45. C @ 5. min, 3. K/min, 200. C @ 30. min |
Capillary | HP-1 | 929. | Cavalli, Fernandez, et al., 2004 | 50. m/0.2 mm/0.33 μm, N2, 2. K/min, 250. C @ 20. min; Tstart: 60. C |
Capillary | DB-1 | 939. | Choi, 2004 | 60. m/0.25 mm/0.25 μm, N2, 70. C @ 2. min, 2. K/min, 230. C @ 20. min |
Capillary | DB-5 | 939. | Cicció, 2004 | 30. m/0.25 mm/0.25 μm, He, 2. K/min; Tstart: 60. C; Tend: 240. C |
Capillary | SPB-5 | 935. | Gauvin, Ravaomanarivo, et al., 2004 | 60. m/0.32 mm/1. μm, He, 4. K/min, 200. C @ 30. min; Tstart: 60. C |
Capillary | HP-5 MS | 934. | Ghannadi, Sajjadi, et al., 2004 | 30. m/0.25 mm/0.25 μm, Helium, 4. K/min; Tstart: 60. C; Tend: 275. C |
Capillary | HP-5MS | 929. | Hajhashemi V., Ghannadi A., et al., 2004 | 30. m/0.25 mm/0.25 μm, He, 4. K/min; Tstart: 60. C; Tend: 275. C |
Capillary | DB-1 | 937. | bin Jantan, Ayop, et al., 2004 | 25. m/0.25 mm/0.25 μm, 60. C @ 10. min, 3. K/min, 180. C @ 10. min |
Capillary | DB-5 | 937. | JAvidnia, Mojab, et al., 2004 | 25. m/0.25 mm/0.25 μm, Nitrogen, 3. K/min; Tstart: 60. C; Tend: 240. C |
Capillary | ZB-5 | 946. | Jürgens and Dötterl, 2004 | 60. m/0.25 mm/0.25 μm, He, 40. C @ 4.6 min, 6. K/min, 260. C @ 1. min |
Capillary | DB-5 | 934. | Kalvandi, Sefidkon, et al., 2004 | 60. m/0.25 mm/0.25 μm, He, 40. C @ 4. min, 4. K/min; Tend: 280. C |
Capillary | RTX-1 | 935. | Kalemba and Thiem, 2004 | 30. m/0.25 mm/0.25 μm, N2, 4. K/min; Tstart: 60. C; Tend: 300. C |
Capillary | SE-54 | 935. | Kilic, Hafizoglu, et al., 2004 | 30. m/0.25 mm/0.25 μm, He, 60. C @ 5. min, 2. K/min; Tend: 260. C |
Capillary | SE-54 | 952. | Kilic, Hafizoglu, et al., 2004 | 30. m/0.053 mm/1.5 μm, He, 5. K/min; Tstart: 100. C; Tend: 250. C |
Capillary | HP-5MS | 912. | Li and Jiang, 2004 | 30. m/0.25 mm/0.25 μm, He, 50. C @ 2. min, 5. K/min, 230. C @ 10. min |
Capillary | DB-5MS | 939. | paz Lima, Silva, et al., 2004 | 30. m/0.25 mm/0.25 μm, He, 3. K/min; Tstart: 60. C; Tend: 240. C |
Capillary | DB-5 | 931. | Limberger, Sobral, et al., 2004 | 30. m/0.25 mm/0.25 μm, He, 3. K/min; Tstart: 60. C; Tend: 300. C |
Capillary | RTX-1 | 932. | Lis, Boczek, et al., 2004 | 30. m/0.32 mm/0.25 μm, N2, 4. K/min; Tstart: 60. C; Tend: 300. C |
Capillary | DB-5 | 939. | Lopez Arze, Collin, et al., 2004 | 30. m/0.25 mm/0.25 μm, 40. C @ 2. min, 2. K/min, 210. C @ 33. min |
Capillary | HP-5MS | 935. | Malencic, Couladis, et al., 2004 | 30. m/0.25 mm/0.25 μm, He, 3. K/min; Tstart: 60. C; Tend: 280. C |
Capillary | HP-5MS | 934. | Malencic, Couladis, et al., 2004 | 30. m/0.25 mm/0.25 μm, He, 3. K/min; Tstart: 60. C; Tend: 280. C |
Capillary | DB-5MS | 911. | Marongiu, Piras, et al., 2004 | 30. m/0.25 mm/0.25 μm, He, 3. K/min, 280. C @ 30. min; Tstart: 60. C |
Capillary | DB-5MS | 915. | Marongiu, Porcedda, et al., 2004 | 30. m/0.25 mm/0.25 μm, He, 3. K/min, 280. C @ 30. min; Tstart: 60. C |
Capillary | HP-5MS | 939. | Mehrabani, Asadipour, et al., 2004 | 30. m/0.25 mm/0.25 μm, He, 4. K/min; Tstart: 60. C; Tend: 275. C |
Capillary | DB-5 | 930. | Mevy, Bessiere, et al., 2004 | 30. m/0.25 mm/0.15 μm, 60. C @ 3. min, 3. K/min; Tend: 220. C |
Capillary | HP-5MS | 937. | Mimica-Dukic, Bozin, et al., 2004 | 30. m/0.25 mm/0.25 μm, He, 3. K/min; Tstart: 60. C; Tend: 280. C |
Capillary | DB-1 | 940. | Nik, Mirza, et al., 2004 | 60. m/0.25 mm/0.25 μm, He, 4. K/min; Tstart: 50. C; Tend: 270. C |
Capillary | NB-30 | 931. | Orav, Stulova, et al., 2004 | 50. m/0.2 mm/0.25 μm, He, 2. K/min; Tstart: 50. C; Tend: 250. C |
Capillary | NB-30 | 932. | Orav, Stulova, et al., 2004 | 50. m/0.2 mm/0.25 μm, He, 2. K/min; Tstart: 50. C; Tend: 250. C |
Capillary | DB-1 | 934. | Palá-Paúl, García-Jiménez, et al., 2004 | 50. m/0.22 mm/0.25 μm, He, 4. K/min; Tstart: 70. C; Tend: 220. C |
Capillary | DB-1 | 928. | Palá-Paúl, Velasco-Negueruela, et al., 2004 | 50. m/0.25 mm/0.25 μm, N2, 4. K/min; Tstart: 95. C; Tend: 240. C |
Capillary | NB-30 | 931. | Raal, Arak, et al., 2004 | 50. m/0.2 mm/0.25 μm, He, 2. K/min; Tstart: 50. C; Tend: 250. C |
Capillary | NB-30 | 929. | Raal, Paaver, et al., 2004 | 50. m/0.20 mm/0.25 μm, He, 2. K/min; Tstart: 50. C; Tend: 250. C |
Capillary | DB-1 | 929. | Rasooli and Razzaghi Abyaneh, 2004 | 60. m/0.25 mm/0.25 μm, He, 4. K/min; Tstart: 50. C; Tend: 250. C |
Capillary | DB-5 | 939. | Rohloff, Mordal, et al., 2004 | 30. m/0.25 mm/0.25 μm, He, 2.5 K/min, 220. C @ 6. min; Tstart: 35. C |
Capillary | Methyl Silicone | 932. | Rojas, Usubillaga, et al., 2004 | 60. m/0.25 mm/0.25 μm, He, 60. C @ 1. min, 4. K/min, 200. C @ 20. min |
Capillary | HP-5 MS | 932. | Royas, Usubillaga, et al., 2004 | 30. m/0.25 mm/0.25 μm, Helium, 60. C @ 1. min, 4. K/min, 200. C @ 20. min |
Capillary | HP-5MS | 933. | Sadeghpour, Asghari, et al., 2004 | 30. m/0.25 mm/0.25 μm, He, 4. K/min; Tstart: 60. C; Tend: 280. C |
Capillary | HP-5MS | 937. | Sajjadi and Shahpiri, 2004 | 30. m/0.25 mm/0.25 μm, He, 4. K/min; Tstart: 60. C; Tend: 280. C |
Capillary | DB-1 | 927. | Sarkhail, Amin, et al., 2004 | 30. m/0.25 mm/0.25 μm, He, 50. C @ 1. min, 2.5 K/min, 265. C @ 20. min |
Capillary | DB-1 | 940. | Sawamura, Son, et al., 2004 | 60. m/0.25 mm/0.25 μm, 70. C @ 2. min, 2. K/min, 230. C @ 20. min |
Capillary | DB-1 | 940. | Sawamura, Sou, et al., 2004 | 60. m/0.25 mm/0.25 μm, Nitrogen, 70. C @ 2. min, 2. K/min; Tend: 230. C |
Capillary | DB-5 | 938. | Sefidkon, Jamzad, et al., 2004 | 30. m/0.25 mm/0.25 μm, 50. C @ 5. min, 3. K/min; Tend: 250. C |
Capillary | DB-1 | 941. | Sefidkon and Shaabani, 2004 | 60. m/0.25 mm/0.25 μm, He, 40. C @ 5. min, 4. K/min; Tend: 280. C |
Capillary | HP-1 | 935. | Senatore, Napolitano, et al., 2004 | 30. m/0.25 mm/0.33 μm, He, 40. C @ 5. min, 2. K/min, 260. C @ 20. min |
Capillary | DB-5 | 938. | Senatore, Rigano, et al., 2004 | 30. m/0.25 mm/0.25 μm, He, 40. C @ 5. min, 2. K/min, 250. C @ 20. min |
Capillary | HP-5 | 938. | Shafi, Nambiar, et al., 2004 | 25. m/0.2 mm/0.5 μm, N2, 3. K/min; Tstart: 30. C; Tend: 280. C |
Capillary | HP-5 | 939. | Simic, Sokovic, et al., 2004 | 25. m/0.32 mm/0.52 μm, H2, 4. K/min; Tstart: 40. C; Tend: 240. C |
Capillary | DB-5 | 927. | Suyenaga, Apel, et al., 2004 | 30. m/0.25 mm/0.25 μm, 3. K/min; Tstart: 60. C; Tend: 300. C |
Capillary | DB-5 | 936. | Tellez, Khan, et al., 2004 | 30. m/0.25 mm/0.25 μm, He, 3. K/min; Tstart: 60. C; Tend: 240. C |
Capillary | CP Sil 5 CB | 930. | Thappa, Bakshi, et al., 2004 | 20. m/0.25 mm/0.25 μm, He, 100. C @ 2. min, 8. K/min; Tend: 270. C |
Capillary | DB-5 | 939. | Tirillini, Pellegrino, et al., 2004 | 30. m/0.25 mm/0.25 μm, He, 3. K/min; Tstart: 60. C; Tend: 300. C |
Capillary | BPX-5 | 941. | Vilaseca, Guy, et al., 2004 | 25. m/0.22 mm/1. μm, He, 60. C @ 5. min, 3. K/min, 250. C @ 10. min |
Capillary | CP Sil 8 CB | 935. | Wang, Guo, et al., 2004 | 30. m/0.32 mm/0.25 μm, 50. C @ 5. min, 5. K/min; Tend: 200. C |
Capillary | DB-5 | 931. | Woerdenbag, Windono, et al., 2004 | 30. m/0.249 mm/0.25 μm, He, 3. K/min; Tstart: 60. C; Tend: 300. C |
Capillary | DB-5HT | 940. | Yusufoglu, Celik, et al., 2004 | He, 50. C @ 2. min, 2. K/min, 250. C @ 20. min; Column length: 27. m; Column diameter: 0.25 mm |
Capillary | HP-5MS | 939. | Afsharypuor and Jahromy, 2003 | 30. m/0.25 mm/0.25 μm, He, 4. K/min; Tstart: 60. C; Tend: 275. C |
Capillary | HP-5 | 944. | Bertoli, Menichini, et al., 2003 | 30. m/0.25 mm/0.25 μm, N2, 60. C @ 10. min, 5. K/min; Tend: 220. C |
Capillary | DB-5 | 937. | Cabanillas, Lopez, et al., 2003 | 30. m/0.25 mm/0.25 μm, He, 4. K/min; Tstart: 60. C; Tend: 240. C |
Capillary | DB-1 | 940. | Choi, 2003, 2 | 60. m/0.25 mm/0.25 μm, He, 70. C @ 2. min, 2. K/min, 230. C @ 20. min |
Capillary | HP-5MS | 936. | Couladis, Özcan, et al., 2003 | 30. m/0.25 mm/0.25 μm, He, 3. K/min; Tstart: 60. C; Tend: 280. C |
Capillary | Methyl Silicone | 942. | Curini, Bianchi, et al., 2003 | He, 4. K/min; Column length: 12.5 m; Column diameter: 0.25 mm; Tstart: 50. C; Tend: 270. C |
Capillary | DB-1 | 944. | Dabiri and Sefidkon, 2003 | He, 4. K/min; Column length: 60. m; Column diameter: 0.25 mm; Tstart: 50. C; Tend: 250. C |
Capillary | RTX-5Sil | 935. | Dudai, Larkov, et al., 2003 | 30. m/0.25 mm/0.25 μm, He, 4. K/min, 200. C @ 10. min; Tstart: 70. C |
Capillary | DB-1 | 962. | Ebrahimzadeh, Yamini, et al., 2003 | 60. m/0.25 mm/0.25 μm, He, 4. K/min; Tstart: 50. C; Tend: 250. C |
Capillary | DB-5 | 934. | Edris and Farrag, 2003 | He, 3. K/min; Column length: 60. m; Column diameter: 0.32 mm; Tstart: 50. C; Tend: 220. C |
Capillary | DB-5 | 934. | Edris and Farrag, 2003 | He, 3. K/min; Column length: 60. m; Column diameter: 0.32 mm; Tstart: 50. C; Tend: 220. C |
Capillary | DB-5 | 934. | Edris, Shalaby, et al., 2003 | He, 3. K/min; Column length: 60. m; Column diameter: 0.32 mm; Tstart: 50. C; Tend: 200. C |
Capillary | DB-5 | 936. | Edris, Shalaby, et al., 2003, 2 | He, 3. K/min; Column length: 60. m; Column diameter: 0.32 mm; Tstart: 50. C; Tend: 220. C |
Capillary | HP-5MS | 944. | Feizbaksh, Saber Tehrani, et al., 2003 | 30. m/0.25 mm/0.25 μm, He, 60. C @ 20. min, 5. K/min, 220. C @ 20. min |
Capillary | HP-1 | 934. | Fekam Boyom, Amvam Zollo, et al., 2003 | 30. m/0.25 mm/0.25 μm, He, 10. K/min; Tstart: 70. C; Tend: 200. C |
Capillary | DB-1 | 920. | Fekam Boyom, Ngouana, et al., 2003 | 30. m/0.25 mm/0.25 μm, N2, 5. K/min; Tstart: 50. C; Tend: 200. C |
Capillary | HP-5MS | 936. | Ghannadi, Aghazari, et al., 2003 | 30. m/0.25 mm/0.25 μm, He, 4. K/min; Tstart: 60. C; Tend: 275. C |
Capillary | HP-5MS | 939. | Ghasemi, Asghari, et al., 2003 | 30. m/0.25 mm/0.25 μm, He, 4. K/min; Tstart: 60. C; Tend: 280. C |
Capillary | HP-5 | 936. | Ghannadi and Zolfaghari, 2003 | 30. m/0.25 mm/0.25 μm, He, 4. K/min; Tstart: 60. C; Tend: 275. C |
Capillary | HP-5MS | 935. | Hajhashemi, Ghannadi, et al., 2003 | 30. m/0.25 mm/0.25 μm, He, 4. K/min; Tstart: 60. C; Tend: 275. C |
Capillary | RSL-200 | 932. | Jirovetz, Buchbauer, et al., 2003 | 30. m/0.32 mm/0.25 μm, H2, 40. C @ 5. min, 6. K/min, 280. C @ 5. min |
Capillary | RSL-200 | 953. | Jirovetz, Buchbauer, et al., 2003, 2 | 30. m/0.25 mm/0.25 μm, H2, 40. C @ 2. min, 6. K/min, 280. C @ 10. min |
Capillary | RSL-200 | 937. | Jirovetz, Buchbauer, et al., 2003, 3 | 30. m/0.32 mm/0.25 μm, H2, 40. C @ 5. min, 6. K/min, 280. C @ 5. min |
Capillary | DB-5 | 926. | Juteau, Jerkovic, et al., 2003 | 50. m/0.2 mm/0.25 μm, He, 50. C @ 2. min, 3. K/min, 220. C @ 10. min |
Capillary | SE-30 | 929. | Kambouche and El-Abed, 2003 | 12. m/0.22 mm/0.3 μm, He, 3. K/min; Tstart: 70. C; Tend: 220. C |
Capillary | CP Sil 5 CB | 928. | Kanjilal, Kotoky, et al., 2003 | 25. m/0.25 mm/0.25 μm, He, 35. C @ 2.5 min, 5. K/min; Tend: 280. C |
Capillary | DB-5 | 931. | Lago, de Ávila, et al., 2003 | 30. m/0.25 mm/0.25 μm, He, 5. K/min; Tstart: 60. C; Tend: 280. C |
Capillary | DB-5 | 929. | Limberger, Simões-Pires, et al., 2003 | 30. m/0.25 mm/0.25 μm, He, 3. K/min; Tstart: 60. C; Tend: 250. C |
Capillary | DB-1 | 925. | Mahalwal and Ali, 2003 | 30. m/0.25 mm/0.25 μm, N2, 4. K/min; Tstart: 80. C; Tend: 250. C |
Capillary | DB-5MS | 938. | Maia, Taveira, et al., 2003 | 30. m/0.25 mm/0.25 μm, He, 3. K/min; Tstart: 60. C; Tend: 240. C |
Capillary | DB-5 | 929. | Marongiu, Porcedda, et al., 2003 | 30. m/0.25 mm/0.25 μm, He, 3. K/min, 280. C @ 30. min; Tstart: 60. C |
Capillary | DB-5 | 933. | Marongiu, Porcedda, et al., 2003 | 30. m/0.25 mm/0.25 μm, He, 3. K/min, 280. C @ 30. min; Tstart: 60. C |
Capillary | DB-5 | 935. | Masotti, Juteau, et al., 2003 | 50. m/0.2 mm/0.25 μm, He, 50. C @ 2. min, 3. K/min; Tend: 220. C |
Capillary | CP Sil 5 CB | 936. | Mazloomifar, Saber-Tehrani, et al., 2003 | 25. m/0.25 mm/0.39 μm, 5. K/min; Tstart: 60. C; Tend: 220. C |
Capillary | ZB-1 | 932. | Mierendorff, Stahl-Biskup, et al., 2003 | 30. m/0.25 mm/0.25 μm, N2, 3. K/min; Tstart: 45. C; Tend: 230. C |
Capillary | DB-1 | 942. | Mirza and Nik, 2003 | 60. m/0.25 mm/0.25 μm, He, 4. K/min; Tstart: 50. C; Tend: 270. C |
Capillary | DB-1 | 942. | Mirza, Nik, et al., 2003 | 60. m/0.25 mm/0.25 μm, He, 4. K/min; Tstart: 50. C; Tend: 270. C |
Capillary | HP-5 | 934. | Mookdasanit, Tamura, et al., 2003 | Helium, 2. K/min, 210. C @ 60. min; Column length: 30. m; Column diameter: 0.32 mm; Tstart: 70. C |
Capillary | OV-101 | 928. | Orav, Kailas, et al., 2003 | 50. m/0.2 mm/0.5 μm, He, 2. K/min; Tstart: 50. C; Tend: 250. C |
Capillary | CP Sil 5 CB | 931. | Oyedeji, Ekundayo, et al., 2003 | 25. m/0.25 mm/0.15 μm, H2, 3. K/min; Tstart: 50. C; Tend: 230. C |
Capillary | DB-1 | 942. | Perez-Alonso, Velasco-Negueruela, et al., 2003 | 50. m/0.25 mm/0.25 μm, N2, 4. K/min; Tstart: 95. C; Tend: 240. C |
Capillary | DB-5 | 939. | Pino, Marbot, et al., 2003, 2 | 30. m/0.25 mm/0.25 μm, H2, 60. C @ 10. min, 4. K/min, 280. C @ 40. min |
Capillary | HP-5 | 918. | Pitarokili, Tzakou, et al., 2003 | 30. m/0.25 mm/0.25 μm, He, 3. K/min; Tstart: 60. C; Tend: 280. C |
Capillary | DB-1 | 942. | Pourmortazavi, Sefidkon, et al., 2003 | 60. m/0.25 mm/0.25 μm, He, 4. K/min; Tstart: 50. C; Tend: 250. C |
Capillary | DB-5 | 940. | Priestap, van Baren, et al., 2003 | 30. m/0.2 mm/0.25 μm, He, 75. C @ 4. min, 3. K/min; Tend: 220. C |
Capillary | NB-30 | 932. | Raal, Arak, et al., 2003 | 50. m/0.2 mm/0.5 μm, He, 2. K/min; Tstart: 50. C; Tend: 250. C |
Capillary | DB-1 | 931. | Rasooli and Mirmostafa, 2003 | 60. m/0.25 mm/0.25 μm, He, 4. K/min; Tstart: 40. C; Tend: 220. C |
Capillary | DB-5 | 939. | Rotman, Ahumada, et al., 2003 | 30. m/0.25 mm/0.25 μm, N2, 2. K/min; Tstart: 40. C; Tend: 230. C |
Capillary | HP-5MS | 937. | Sadraei, Ghannadi, et al., 2003 | 30. m/0.25 mm/0.25 μm, He, 4. K/min; Tstart: 60. C; Tend: 275. C |
Capillary | HP-5 | 939. | Sajjadi and Mehregan, 2003 | 30. m/0.25 mm/0.25 μm, He, 4. K/min; Tstart: 60. C; Tend: 280. C |
Capillary | HP-5 | 937. | Sajjadi and Mehregan, 2003, 2 | 30. m/0.25 mm/0.25 μm, He, 4. K/min; Tstart: 60. C; Tend: 280. C |
Capillary | Methyl Silicone | 926. | Santos and Cordeiro, 2003 | He, 4. K/min; Tstart: 35. C; Tend: 180. C |
Capillary | SPB-5 | 943. | Sebastian, Viallon-Fernandez, et al., 2003 | 60. m/0.32 mm/1.0 μm, Helium, 3. K/min; Tstart: 30. C; Tend: 230. C |
Capillary | DB-1 | 941. | Sefidkon, Naderi Nik, et al., 2003 | 60. m/0.25 mm/0.25 μm, He, 40. C @ 5. min, 4. K/min; Tend: 260. C |
Capillary | DB-1 | 940. | Shahmir, Ahmadi, et al., 2003 | 60. m/0.25 mm/0.25 μm, He, 4. K/min; Tstart: 50. C; Tend: 280. C |
Capillary | DB-5 | 937. | da Silva, Luz, et al., 2003 | 30. m/0.25 mm/0.25 μm, He, 3. K/min; Tstart: 60. C; Tend: 240. C |
Capillary | HP-5 | 935. | Stashenko, Jaramillo, et al., 2003 | 60. m/0.25 mm/0.25 μm, 40. C @ 15. min, 5. K/min; Tend: 250. C |
Capillary | HP-5 | 935. | Stashenko, Jaramillo, et al., 2003 | 60. m/0.25 mm/0.25 μm, 40. C @ 15. min, 5. K/min; Tend: 250. C |
Capillary | CP Sil 5 CB | 938. | Taiwo and Bolanle, 2003 | 25. m/0.25 mm/0.15 μm, 3. K/min; Tstart: 50. C; Tend: 230. C |
Capillary | DB-5MS | 938. | Taveira, de Lima, et al., 2003 | 30. m/0.25 mm/0.25 μm, He, 3. K/min; Tstart: 60. C; Tend: 240. C |
Capillary | DB-1 | 938. | Tu, Onishi, et al., 2003 | 60. m/0.25 mm/0.25 μm, N2, 70. C @ 2. min, 2. K/min, 230. C @ 20. min |
Capillary | DB-1 | 945. | Tu, Onishi, et al., 2003, 2 | 60. m/0.25 mm/0.25 μm, N2, 70. C @ 2. min, 2. K/min, 230. C @ 20. min |
Capillary | HP-1 | 932. | Valette, Fernandez, et al., 2003 | 50. m/0.2 mm/0.5 μm, He, 2. K/min, 220. C @ 40. min; Tstart: 60. C |
Capillary | DB-1 | 912. | Velasco-Negueruela, Pérez-Alonso, et al., 2003 | 50. m/0.25 mm/0.25 μm, N2, 4. K/min; Tstart: 90. C; Tend: 240. C |
Capillary | Cross-Linked Methylsilicone | 924. | Velasco-Negueruela, Pérez-Alonso, et al., 2003, 2 | 25. m/0.2 mm/0.33 μm, He, 4. K/min; Tstart: 70. C; Tend: 250. C |
Capillary | HP-5 | 938. | Velickovic, Randjelovic, et al., 2003 | 25. m/0.32 mm/0.53 μm, H2, 4. K/min; Tstart: 40. C; Tend: 280. C |
Capillary | HP-5 | 939. | Velickovic, Randjelovic, et al., 2003 | 25. m/0.32 mm/0.53 μm, H2, 4. K/min; Tstart: 40. C; Tend: 280. C |
Capillary | HP-5 | 928. | Velickovic, Ristic, et al., 2003 | 25. m/0.32 mm/0.53 μm, Helium, 4. K/min; Tstart: 40. C; Tend: 280. C |
Capillary | HP-5 | 939. | Velickovic, Ristic, et al., 2003 | 25. m/0.32 mm/0.53 μm, Helium, 4. K/min; Tstart: 40. C; Tend: 280. C |
Capillary | SPB-1 | 913. | Vichi, Castellote, et al., 2003 | 30. m/0.25 mm/0.25 μm, He, 40. C @ 10. min, 3. K/min; Tend: 200. C |
Capillary | SPB-1 | 927. | Vichi, Pizzale, et al., 2003 | 30. m/0.25 mm/0.25 μm, He, 40. C @ 10. min, 3. K/min; Tend: 200. C |
Capillary | HP-5 | 945. | Yassa, Akhani, et al., 2003 | 30. m/0.25 mm/0.32 μm, He, 60. C @ 30. min, 5. K/min; Tend: 250. C |
Capillary | DB-5 | 938. | Zoghbi, Andrade, et al., 2003 | 30. m/0.25 mm/0.25 μm, He, 3. K/min; Tstart: 60. C; Tend: 240. C |
Capillary | DB-5 | 938. | Zrira, Elamrani, et al., 2003 | 25. m/0.25 mm/0.25 μm, N2, 4. K/min, 250. C @ 10. min; Tstart: 50. C |
Capillary | DB-1 | 942. | Ahmadi, Mirza, et al., 2002 | 60. m/0.25 mm/0.25 μm, He, 4. K/min; Tstart: 50. C; Tend: 280. C |
Capillary | DB-1 | 942. | Baher, Mirza, et al., 2002 | 60. m/0.25 mm/0.25 μm, He, 4. K/min; Tstart: 60. C; Tend: 220. C |
Capillary | DB-5 | 932. | Bos, Koulman, et al., 2002 | 30. m/0.249 mm/0.25 μm, He, 3. K/min, 300. C @ 5. min; Tstart: 60. C |
Capillary | OV-101 | 934. | Boyom, Keumedjio, et al., 2002 | 5. K/min; Column length: 25. m; Column diameter: 0.32 mm; Tstart: 50. C; Tend: 200. C |
Capillary | DB-5 | 931. | Caredda, Marongiu, et al., 2002 | 30. m/0.25 mm/0.25 μm, He, 3. K/min, 280. C @ 30. min; Tstart: 60. C |
Capillary | HP-1 | 930. | Cavaleiro, Salgueiro, et al., 2002, 2 | 30. m/0.25 mm/0.25 μm, He, 3. K/min, 220. C @ 15. min; Tstart: 70. C |
Capillary | 5 % Phenyl methyl siloxane | 939. | Cicció and Gómez-Laurito, 2002 | 30. m/0.25 mm/0.25 μm, He, 75. C @ 4. min, 3. K/min, 200. C @ 8. min |
Capillary | DB-1 | 938. | Cimanga, Apers, et al., 2002 | 60. m/0.32 mm/0.25 μm, He, 50. C @ 6. min, 3. K/min; Tend: 200. C |
Capillary | DB-5MS | 946. | Congiu, Falconieri, et al., 2002 | 30. m/0.25 mm/0.25 μm, He, 3. K/min; Tstart: 60. C; Tend: 280. C |
Capillary | DB-5MS | 936. | Damon, Hernández, et al., 2002 | He, 50. C @ 2. min, 15. K/min, 280. C @ 10. min; Column length: 30. m; Column diameter: 0.25 mm |
Capillary | BP-1 | 932. | Das, Ram, et al., 2002 | 25. m/0.50 mm/0.25 μm, N2, 5. K/min, 220. C @ 10. min; Tstart: 60. C |
Capillary | DB-5 | 939. | Farah, Fechtal, et al., 2002 | 30. m/0.25 mm/0.25 μm, N2, 4. K/min; Tstart: 50. C; Tend: 250. C |
Capillary | HP-5 | 938. | Farah, Fechtal. M., et al., 2002 | 30. m/0.25 mm/0.25 μm, N2, 50. C @ 5. min, 4. K/min; Tend: 250. C |
Capillary | DB-5 | 940. | Flamini, Ertugrul, et al., 2002 | 30. m/0.25 mm/0.25 μm, He, 3. K/min; Tstart: 60. C; Tend: 240. C |
Capillary | DB-1 | 918. | Gancel, Ollé, et al., 2002 | 30. m/0.32 mm/0.25 μm, H2, 40. C @ 20. min, 3. K/min; Tend: 245. C |
Capillary | HP-5 | 933. | Ghannadi, Sajjadi, et al., 2002 | 30. m/0.25 mm/0.25 μm, He, 4. K/min; Tstart: 60. C; Tend: 275. C |
Capillary | BP-1 | 928. | Hayes R.A., Richardson B.J., et al., 2002 | 25. m/0.2 mm/0.1 μm, He, 40. C @ 5. min, 8. K/min; Tend: 250. C |
Capillary | SE-30 | 942. | Iñigo, Palá-Paúl, et al., 2002 | 50. m/0.25 mm/0.25 μm, He, 4. K/min; Tstart: 70. C; Tend: 240. C |
Capillary | HP-5 | 936. | Isidorov and Jdanova, 2002 | 3. K/min; Column length: 30. m; Column diameter: 0.25 mm; Tstart: 50. C; Tend: 200. C |
Capillary | RSL-200 | 943. | Jirovetz, Buchbauer, et al., 2002 | 30. m/0.32 mm/0.25 μm, H2, 40. C @ 5. min, 6. K/min, 280. C @ 5. min |
Capillary | RSL-200 | 939. | Jirovetz, Ngassoum, et al., 2002 | 30. m/0.32 mm/0.25 μm, H2, 50. C @ 5. min, 6. K/min, 280. C @ 5. min |
Capillary | CP Sil 8 CB | 936. | Juteau, Masotti, et al., 2002 | 30. m/0.25 mm/0.25 μm, He, 50. C @ 2. min, 3. K/min; Tend: 220. C |
Capillary | DB-1 | 944. | Khallouki, Younos, et al., 2002 | 25. m/0.23 mm/0.20 μm, He, 50. C @ 3. min, 3. K/min, 200. C @ 30. min |
Capillary | SPB-5 | 942. | Kim and Lee, 2002 | 60. m/0.25 mm/0.25 μm, He, 50. C @ 3. min, 5. K/min, 240. C @ 10. min |
Capillary | DB-5 | 938. | Kobaisy, Tellez, et al., 2002 | 30. m/0.25 mm/0.25 μm, He, 3. K/min; Tstart: 60. C; Tend: 240. C |
Capillary | DB-5 | 933. | Krauze-Baranowska, Mardarowicz, et al., 2002 | 30. m/0.25 mm/0.25 μm, He, 35. C @ 2. min, 3. K/min, 280. C @ 15. min |
Capillary | DB-5 | 933. | Krauze-Baranowska, Mardarowicz, et al., 2002, 2 | 30. m/0.25 mm/0.25 μm, He, 35. C @ 2. min, 4. K/min, 280. C @ 15. min |
Capillary | OV-101 | 934. | Kuiate, Bessière, et al., 2002 | He, 5. K/min; Column length: 25. m; Column diameter: 0.32 mm; Tstart: 50. C; Tend: 200. C |
Capillary | DB-5 | 929. | Limberger, Simões-Pires, et al., 2002 | 30. m/0.25 mm/0.25 μm, He, 3. K/min; Tstart: 60. C; Tend: 250. C |
Capillary | DB-5 | 933. | Lin, Rouseff, et al., 2002 | 30. m/0.32 mm/0.25 μm, He, 7. K/min; Tstart: 40. C; Tend: 290. C |
Capillary | HP-5 | 928. | Lockwood, Asghari, et al., 2002 | 30. m/0.25 mm/0.25 μm, 60. C @ 4. min, 4. K/min; Tend: 275. C |
Capillary | DB-5 | 939. | Mahmout, Bessière, et al., 2002 | 25. m/0.23 mm/0.15 μm, N2, 3. K/min; Tstart: 50. C; Tend: 250. C |
Capillary | DB-5 | 940. | Maia, da Silva, et al., 2002 | 30. m/0.25 mm/0.25 μm, He, 3. K/min; Tstart: 60. C; Tend: 240. C |
Capillary | DB-5MS | 935. | Maia, Zoghbi, et al., 2002 | 30. m/0.25 mm/0.25 μm, He, 3. K/min; Tstart: 60. C; Tend: 240. C |
Capillary | OV-101 | 931. | Menut, Bessière, et al., 2002 | He, 5. K/min; Column length: 25. m; Column diameter: 0.32 mm; Tstart: 50. C; Tend: 200. C |
Capillary | CP Sil 5 CB | 936. | Monfared, Davarani, et al., 2002 | He, 5. K/min; Column length: 25. m; Column diameter: 0.25 mm; Tstart: 60. C; Tend: 220. C |
Capillary | DB-5 | 939. | Morteza-Semnani, Saeedi, et al., 2002 | 30. m/0.25 mm/0.25 μm, He, 60. C @ 5. min, 4. K/min; Tend: 220. C |
Capillary | DB-1 | 930. | Norouzi-Arasi, Yavari, et al., 2002 | 30. m/0.25 mm/0.25 μm, He, 60. C @ 10. min, 4. K/min; Tend: 250. C |
Capillary | HP-5 | 937. | Novak, Langbehn, et al., 2002 | 30. m/0.25 mm/0.25 μm, 3. K/min; Tstart: 60. C; Tend: 240. C |
Capillary | HP-5 | 939. | Novak, Langbehn, et al., 2002 | 30. m/0.25 mm/0.25 μm, 3. K/min; Tstart: 60. C; Tend: 240. C |
Capillary | OV-101 | 930. | Orav, Kailas, et al., 2002 | 50. m/0.2 mm/0.5 μm, He, 2. K/min; Tstart: 50. C; Tend: 250. C |
Capillary | DB-1 | 926. | Palá-Paúl, Pérez-Alonso, et al., 2002, 2 | 50. m/0.25 mm/0.25 μm, N2, 4. K/min; Tstart: 80. C; Tend: 225. C |
Capillary | DB-5MS | 938. | Phutdhawong, Korth, et al., 2002 | 30. m/0.32 mm/0.25 μm, He, 4. K/min, 280. C @ 5. min; Tstart: 40. C |
Capillary | SPB-5 | 939. | Pino, Marbot, et al., 2002, 5 | 30. m/0.25 mm/0.25 μm, Helium, 60. C @ 2. min, 4. K/min, 250. C @ 20. min |
Capillary | HP-1 | 929. | Priestap, van Baren, et al., 2002 | 50. m/0.25 mm/0.25 μm, N2, 3. K/min; Tstart: 90. C; Tend: 220. C |
Capillary | DB-5 | 927. | Ruberto, Biondi, et al., 2002 | 30. m/0.25 mm/0.25 μm, He, 2. K/min; Tstart: 60. C; Tend: 300. C |
Capillary | DB-5 | 936. | Schwob, Bessière, et al., 2002 | He, 3. K/min; Column length: 25. m; Column diameter: 0.2 mm; Tstart: 60. C; Tend: 220. C |
Capillary | DB-1 | 940. | Sefidkon, Dabiri, et al., 2002 | He, 4. K/min; Column length: 60. m; Column diameter: 0.25 mm; Tstart: 40. C; Tend: 250. C |
Capillary | DB-1 | 942. | Sefidkon, Jalili, et al., 2002 | 60. m/0.25 mm/0.25 μm, He, 40. C @ 5. min, 4. K/min; Tend: 280. C |
Capillary | DB-1 | 943. | Sefidkon, 2002 | 60. m/0.25 mm/0.25 μm, He, 40. C @ 5. min, 4. K/min; Tend: 280. C |
Capillary | DB-1 | 924. | Velasco-Negueruela, Pérez-Alonso, et al., 2002 | 50. m/0.25 mm/0.25 μm, N2, 4. K/min; Tstart: 95. C; Tend: 240. C |
Capillary | DB-1 | 926. | Velasco-Negueruela, Pérez-Alonso, et al., 2002, 2 | 50. m/0.25 mm/0.25 μm, N2, 3. K/min; Tstart: 60. C; Tend: 240. C |
Capillary | HP-5 | 939. | Velickovic, Randjelovic, et al., 2002 | 30. m/0.25 mm/0.25 μm, H2, 4. K/min; Tstart: 40. C; Tend: 280. C |
Capillary | DB-1 | 928. | Yamini, Sefidkon, et al., 2002 | 60. m/0.25 mm/0.25 μm, He, 50. C @ 5. min, 4. K/min; Tend: 250. C |
Capillary | DB-5MS | 936. | Zoghbi, Andrade, et al., 2002 | 30. m/0.25 mm/0.25 μm, He, 3. K/min; Tstart: 60. C; Tend: 270. C |
Capillary | DB-5 | 940. | Zoghbi, Andrade, et al., 2002, 2 | 30. m/0.25 mm/0.25 μm, He, 3. K/min; Tstart: 60. C; Tend: 240. C |
Capillary | DB-5MS | 933. | Cherchi, Deidda, et al., 2001 | 30. m/0.25 mm/0.25 μm, He, 3. K/min; Tstart: 60. C; Tend: 240. C |
Capillary | SPB-5 | 939. | Cornu, Carnat, et al., 2001 | He, 40. C @ 5. min, 3. K/min, 220. C @ 15. min; Column length: 60. m; Column diameter: 0.32 mm |
Capillary | DB-1 | 925. | Dabiri and Sefidkon, 2001 | 60. m/0.25 mm/0.25 μm, He, 40. C @ 5. min, 4. K/min; Tend: 280. C |
Capillary | DB-1 | 927. | Dabiri and Sefidkon, 2001 | 60. m/0.25 mm/0.25 μm, He, 40. C @ 5. min, 4. K/min; Tend: 280. C |
Capillary | DB-5MS | 938. | Fernando and Grün, 2001 | 60. m/0.25 mm/0.25 μm, He, 35. C @ 5. min, 3. K/min; Tend: 250. C |
Capillary | DB-5MS | 938. | Fernando and Grün, 2001 | 60. m/0.25 mm/0.25 μm, He, 35. C @ 5. min, 3. K/min; Tend: 250. C |
Capillary | HP-5 | 940. | Flamini, Cioni, et al., 2001 | 30. m/0.25 mm/0.25 μm, N2, 60. C @ 10. min, 5. K/min; Tend: 220. C |
Capillary | OV-101 | 920. | Friedrich, Acree, et al., 2001 | 6. K/min; Column length: 15. m; Column diameter: 0.32 mm; Tstart: 35. C; Tend: 250. C |
Capillary | OV-1 | 930. | Gallori, Bilia, et al., 2001 | 30. m/0.32 mm/0.3 μm, H2, 50. C @ 1. min, 3. K/min, 250. C @ 20. min |
Capillary | HP-5 | 940. | Gallori, Flamini, et al., 2001 | 30. m/0.25 mm/0.25 μm, N2, 60. C @ 10. min, 5. K/min; Tend: 220. C |
Capillary | BP-1 | 936. | Gupta, Mallavarapu, et al., 2001 | 30. m/0.25 mm/0.25 μm, N2, 5. K/min; Tstart: 60. C; Tend: 220. C |
Capillary | Optima-5 | 929. | Jacquemond-Collet, Bessière, et al., 2001 | He, 50. C @ 3. min, 3. K/min; Column length: 30. m; Column diameter: 0.2 mm; Tend: 250. C |
Capillary | RSL-200 | 932. | Jirovetz L., Buchbauer G., et al., 2001 | 30. m/0.32 mm/0.25 μm, H2, 40. C @ 5. min, 6. K/min, 280. C @ 5. min |
Capillary | RTX-1 | 934. | Kalemba, Marschall, et al., 2001 | 30. m/0.25 mm/0.25 μm, N2, 4. K/min; Tstart: 60. C; Tend: 300. C |
Capillary | SPB-1 | 930. | Kamath, Asha, et al., 2001 | 30. m/0.25 mm/0.25 μm, N2, 70. C @ 2. min, 2. K/min, 180. C @ 1. min |
Capillary | SPB-5 | 944. | Kim and Lee, 2001 | 60. m/0.25 mm/0.25 μm, Helium, 50. C @ 3. min, 3. K/min, 240. C @ 10. min |
Capillary | BP-1 | 930. | Lota, de Rocca Serra, et al., 2001 | 50. m/0.22 mm/0.25 μm, He, 2. K/min, 230. C @ 35. min; Tstart: 60. C |
Capillary | CBP-1 | 929. | Ly, Yamauchi, et al., 2001 | 25. m/0.25 mm/0.25 μm, Nitrogen, 50. C @ 2. min, 3. K/min; Tend: 210. C |
Capillary | DB-5MS | 917. | Marongiu, Porcedda, et al., 2001 | 30. m/0.25 mm/0.25 μm, He, 3. K/min, 240. C @ 30. min; Tstart: 60. C |
Capillary | DB-5MS | 921. | Marongiu, Porcedda, et al., 2001 | 30. m/0.25 mm/0.25 μm, He, 3. K/min, 240. C @ 30. min; Tstart: 60. C |
Capillary | DB-1 | 942. | Mirza, Ahmadi, et al., 2001 | 60. m/0.25 mm/0.25 μm, He, 4. K/min; Tstart: 50. C; Tend: 270. C |
Capillary | OV-101 | 926. | Orav, Kailas, et al., 2001 | 50. m/0.2 mm/0.5 μm, He, 2. K/min; Tstart: 50. C; Tend: 250. C |
Capillary | OV-101 | 927. | Orav and Kann, 2001 | He, 2. K/min; Column length: 50. m; Column diameter: 0.2 mm; Tstart: 50. C; Tend: 250. C |
Capillary | OV-101 | 927. | Orav and Kann, 2001 | He, 2. K/min; Column length: 50. m; Column diameter: 0.2 mm; Tstart: 50. C; Tend: 250. C |
Capillary | DB-1 | 925. | Palá-Paúl, Pérez-Alonso, et al., 2001 | 30. m/0.25 mm/0.25 μm, N2, 4. K/min; Tstart: 80. C; Tend: 225. C |
Capillary | DB-5 | 940. | Rousis, Papadogianni, et al., 2001 | He, 50. C @ 5. min, 3. K/min; Column length: 60. m; Column diameter: 0.25 mm; Tend: 250. C |
Capillary | DB-5 | 930. | Santos-Gomes and Fernandes-Ferreira, 2001 | 30. m/0.25 mm/0.25 μm, H2, 3. K/min; Tstart: 60. C; Tend: 285. C |
Capillary | DB-1 | 936.5 | Santos, Moreira, et al., 2001 | He, 3. K/min; Column length: 30. m; Column diameter: 0.2 mm; Tstart: 60. C; Tend: 240. C |
Capillary | CP Sil 5 CB | 936. | Sayyah, Kamalinejad, et al., 2001 | 25. m/0.25 mm/0.39 μm, He, 5. K/min; Tstart: 60. C; Tend: 220. C |
Capillary | CP-Sil 5 CB | 936. | Sayyah, Kamalinejad, et al., 2001, 2 | 25. m/0.25 mm/0.39 μm, Nitrogen, 5. K/min; Tstart: 60. C; Tend: 220. C |
Capillary | HP-5 MS | 941. | Shang, Hu, et al., 2001 | 30. m/0.25 mm/0.25 μm, Helium, 50. C @ 2. min, 5. K/min, 250. C @ 5. min |
Capillary | DB-5 | 939. | Tellez M., Estell R., et al., 2001 | 30. m/0.25 mm/0.25 μm, He, 3. K/min; Tstart: 60. C; Tend: 240. C |
Capillary | SPB-1 | 929. | Vijayanand, Rao, et al., 2001 | 30. m/0.32 mm/0.25 μm, He, 2. K/min; Tstart: 50. C; Tend: 250. C |
Capillary | OV-101 | 939. | Yang, 2001 | N2, 2. K/min; Column length: 50. m; Column diameter: 0.25 mm; Tstart: 80. C; Tend: 200. C |
Capillary | OV-101 | 939. | Yang, 2001, 2 | N2, 2. K/min; Column length: 50. m; Column diameter: 0.25 mm; Tstart: 80. C; Tend: 200. C |
Capillary | CP Sil 5 CB | 931. | Asekun and Ekundayo, 2000 | 25. m/0.25 mm/0.15 μm, 3. K/min; Tstart: 50. C; Tend: 230. C |
Capillary | DB-1 | 942. | Bailac, Dellacasa, et al., 2000 | 60. m/0.25 mm/0.25 μm, N2, 60. C @ 5. min, 3. K/min, 220. C @ 22. min |
Capillary | CP Sil 5 CB | 968. | Baser, Özek, et al., 2000 | 25. m/0.25 mm/0.4 μm, He, 60. C @ 40. min, 5. K/min; Tend: 260. C |
Capillary | CP Sil 5 CB | 931. | Baser, Özek, et al., 2000 | 25. m/0.25 mm/0.4 μm, He, 60. C @ 40. min, 5. K/min; Tend: 260. C |
Capillary | SPB-1 | 938. | Fraternale, Giamperi, et al., 2000 | 30. m/0.2 mm/0.2 μm, He, 80. C @ 3. min, 5. K/min; Tend: 300. C |
Capillary | HP-5 | 944. | García, Martín, et al., 2000 | 60. m/0.32 mm/1. μm, He, 3. K/min; Tstart: 40. C; Tend: 240. C |
Capillary | BP-1 | 941. | Health Safety Executive, 2000 | 50. m/0.22 mm/0.75 μm, He, 5. K/min; Tstart: 50. C; Tend: 200. C |
Capillary | RSL-200 | 944. | Jirovetz, Puschmann, et al., 2000 | 60. m/0.32 mm/0.25 μm, H2, 6. K/min; Tstart: 40. C; Tend: 250. C |
Capillary | SPB-5 | 942. | Kim, Kim, et al., 2000 | 60. m/0.25 mm/0.25 μm, He, 70. C @ 8. min, 5. K/min, 240. C @ 20. min |
Capillary | HP-5 | 935. | Lis-Balchin and Roth, 2000 | He, 9. K/min, 200. C @ 10. min; Column length: 30. m; Column diameter: 0.25 mm; Tstart: 80. C |
Capillary | DB-5 | 935. | Maia, Zoghbi, et al., 2000 | 30. m/0.25 mm/0.25 μm, He, 3. K/min; Tstart: 60. C; Tend: 240. C |
Capillary | DB-1 | 937. | Mallavarapu, Rao, et al., 2000 | 25. m/0.50 mm/0.25 μm, Nitrogen, 5. K/min; Tstart: 60. C; Tend: 220. C |
Capillary | DB-5 | 936. | Mitiku, Sawamura, et al., 2000 | 30. m/0.22 mm/0.25 μm, N2, 70. C @ 2. min, 4. K/min, 230. C @ 20. min |
Capillary | BP-1 | 937. | Mohagheghzadeh, Shams-Ardakani, et al., 2000 | 25. m/0.33 mm/1.0 μm, N2, 4. K/min; Tstart: 60. C; Tend: 275. C |
Capillary | HP-5 | 936. | Mohagheghzadeh, Shams-Ardakani, et al., 2000, 2 | 30. m/0.25 mm/0.25 μm, He, 4. K/min; Tstart: 60. C; Tend: 275. C |
Capillary | HP-5 | 940. | Novak, Novak, et al., 2000 | 30. m/0.25 mm/0.25 μm, He, 40. C @ 5. min, 3. K/min; Tend: 240. C |
Capillary | DB-1 | 928. | Senatore, Napolitano, et al., 2000 | 30. m/0.25 mm/0.25 μm, He, 40. C @ 5. min, 2. K/min, 260. C @ 2. min |
Capillary | OV-101 | 938. | Tamura, Boonbumrung, et al., 2000 | Nitrogen, 40. C @ 10. min, 2. K/min; Column length: 50. m; Column diameter: 0.25 mm; Tend: 200. C |
Capillary | DB-5 | 939. | Tellez, Dayan, et al., 2000 | 30. m/0.25 mm/0.25 μm, He, 3. K/min; Tstart: 60. C; Tend: 240. C |
Capillary | SE-30 | 929. | Ali N.A.M. and Jantan, 1999 | He, 3. K/min; Column length: 25. m; Column diameter: 0.2 mm; Tstart: 60. C; Tend: 230. C |
Capillary | CP Sil 5 CB | 932. | Asekun and Ekundayo, 1999 | 25. m/0.25 mm/0.15 μm, H2, 3. K/min; Tstart: 50. C; Tend: 320. C |
Capillary | OV-101 | 935. | Ayedoun, Adéoti, et al., 1999 | N2, 5. K/min; Column length: 25. m; Column diameter: 0.25 mm; Tstart: 50. C; Tend: 200. C |
Capillary | Methyl Silicone | 931.02 | Baraldi, Rapparini, et al., 1999 | 60. m/0.25 mm/0.25 μm, 40. C @ 10. min, 5. K/min; Tend: 220. C |
Capillary | OV-1 | 922. | Bicchi, Binello, et al., 1999 | 25. m/0.32 mm/0.30 μm, Hydrogen, 50. C @ 1. min, 3. K/min, 200. C @ 10. min |
Capillary | OV-1 | 923. | Bicchi, Binello, et al., 1999 | 25. m/0.32 mm/0.30 μm, Hydrogen, 50. C @ 1. min, 3. K/min, 200. C @ 10. min |
Capillary | OV-1 | 923. | Bicchi, Binello, et al., 1999 | 25. m/0.32 mm/0.30 μm, Hydrogen, 50. C @ 1. min, 3. K/min, 200. C @ 10. min |
Capillary | OV-1 | 924. | Bicchi, Binello, et al., 1999 | 25. m/0.32 mm/0.30 μm, Hydrogen, 50. C @ 1. min, 3. K/min, 200. C @ 10. min |
Capillary | SPB-1 | 926. | Choo, Wong, et al., 1999 | 50. m/0.2 mm/0.33 μm, 4. K/min; Tstart: 60. C; Tend: 260. C |
Capillary | OV-101 | 930. | Dzumayev, Tkachenko, et al., 1999 | 52. m/0.26 mm/0.13 μm, Helium, 50. C @ 0. min, 3. K/min, 220. C @ 0. min |
Capillary | DB-1 | 937. | Eikani, Goodarznia, et al., 1999 | 60. m/0.25 mm/0.25 μm, He, 4. K/min; Tstart: 50. C; Tend: 230. C |
Capillary | DB-5MS | 953. | Griffiths, Robertson, et al., 1999 | 25. m/0.25 mm/0.25 μm, He, 55. C @ 5. min, 4. K/min; Tend: 350. C |
Capillary | SE-30 | 933. | Jassbi, Ahmad, et al., 1999 | 30. m/0.25 mm/0.25 μm, N2, 60. C @ 10. min, 4. K/min; Tend: 220. C |
Capillary | RTX-1 | 934. | Kalemba, 1999 | 30. m/0.25 mm/0.25 μm, N2, 4. K/min; Tstart: 60. C; Tend: 300. C |
Capillary | DB-1 | 932. | Koulman, 1999 | 25. m/0.25 mm/0.25 μm, He, 4. K/min; Tstart: 50. C; Tend: 290. C |
Capillary | OV-101 | 934. | Kuiate, Zollo, et al., 1999, 2 | 5. K/min; Column length: 25. m; Column diameter: 0.32 mm; Tstart: 50. C; Tend: 200. C |
Capillary | CBP-1 | 937. | Labuckas, Zygadlo, et al., 1999 | He, 4. K/min; Column length: 25. m; Column diameter: 0.3 mm; Tstart: 60. C; Tend: 240. C |
Capillary | DB-5 | 934. | Meynier, Novelli, et al., 1999 | 30. m/0.32 mm/1. μm, 40. C @ 5. min, 3. K/min; Tend: 200. C |
Capillary | SE-30 | 929. | Mohd and Jantan, 1999 | He, 60. C @ 10. min, 3. K/min; Column length: 25. m; Column diameter: 0.2 mm; Tend: 230. C |
Capillary | DB-1 | 938. | Nori-Shargh, Norouzi-Arasi, et al., 1999 | 30. m/0.25 mm/0.25 μm, He, 4. K/min; Tstart: 50. C; Tend: 200. C |
Capillary | OV-1 | 927. | Oberhofer, Nikiforov, et al., 1999 | 25. m/0.25 mm/0.25 μm, H2, 40. C @ 5. min, 3. K/min, 220. C @ 5. min |
Capillary | OV-1 | 967. | Orav, Kailas, et al., 1999 | 2. K/min; Tstart: 50. C; Tend: 160. C |
Capillary | CP Sil 5 CB | 936. | Oyedeji, Olawore, et al., 1999 | He, 3. K/min; Column length: 25. m; Column diameter: 0.25 mm; Tstart: 50. C; Tend: 230. C |
Capillary | DB-1 | 925. | Palá-Paúl, Pérez-Alonso, et al., 1999 | 50. m/0.25 mm/0.25 μm, He, 4. K/min; Tstart: 70. C; Tend: 240. C |
Capillary | OV-101 | 941. | Pateira, Nogueira, et al., 1999 | 50. m/0.25 mm/0.25 μm, He, 70. C @ 5. min, 2. K/min; Tend: 220. C |
Capillary | SE-30 | 933. | Prikhod'ko, Klyuev, et al., 1999 | 30. m/0.25 mm/0.20 μm, Helium, 60. C @ 4. min, 3. K/min; Tend: 200. C |
Capillary | Ultra-2 | 933. | Quiroz, Fuentes-Contreras, et al., 1999 | 40. C @ 4. min, 5. K/min; Column length: 25. m; Column diameter: 0.2 mm; Tend: 300. C |
Capillary | BP-1 | 933. | Rao, Bhattacharya, et al., 1999 | N2, 5. K/min, 220. C @ 10. min; Column length: 25. m; Column diameter: 0.5 mm; Tstart: 60. C |
Capillary | CP Sil 5 CB | 936. | Rustaiyan, Masoudi, et al., 1999 | 25. m/0.25 mm/0.39 μm, He, 60. C @ 5. min, 5. K/min, 220. C @ 20. min |
Capillary | CP Sil 5 CB | 935. | Rustaiyan and Nadji, 1999 | 25. m/0.25 mm/0.39 μm, N2, 5. K/min; Tstart: 60. C; Tend: 220. C |
Capillary | DB-1 | 932. | Sefidkon, Dabiri, et al., 1999 | 60. m/0.25 mm/0.25 μm, He, 40. C @ 5. min, 4. K/min; Tend: 280. C |
Capillary | DB-5 | 932. | Sefidkon and Khajavi, 1999 | 30. m/0.25 mm/0.25 μm, He, 40. C @ 5. min, 4. K/min; Tend: 220. C |
Capillary | DB-1 | 938. | Sefidkon and Mirza, 1999 | 60. m/0.25 mm/0.25 μm, He, 4. K/min; Tstart: 50. C; Tend: 220. C |
Capillary | DB-1 | 935. | Shafiee, Javidnia, et al., 1999 | He, 3. K/min, 230. C @ 5. min; Column length: 60. m; Column diameter: 0.32 mm; Tstart: 60. C |
Capillary | DB-5 | 938. | Sun and Petracek, 1999 | H2, 32. C @ 5. min, 7. K/min, 260. C @ 5. min; Column length: 30. m; Column diameter: 0.32 mm |
Capillary | DB-5 | 939. | Tellez, Canel, et al., 1999 | 30. m/0.25 mm/0.25 μm, He, 3. K/min; Tstart: 60. C; Tend: 240. C |
Capillary | SPB-5 | 943. | Viallon C., Verdier-Metz I., et al., 1999 | 60. m/0.32 mm/1. μm, He, 40. C @ 5. min, 3. K/min, 200. C @ 2. min |
Capillary | CP Sil 5 CB | 937. | Weyerstahl, Marschall, et al., 1999, 2 | N2, 5. K/min; Column length: 25. m; Phase thickness: 0.39 μm; Tstart: 60. C; Tend: 220. C |
Capillary | OV-101 | 935. | Zenkevich, Kosman, et al., 1999 | He, 6. K/min; Column length: 25. m; Column diameter: 0.20 mm; Tstart: 80. C; Tend: 240. C |
Capillary | DB-5 | 936. | Zoghbi, Andrade, et al., 1999 | 30. m/0.25 mm/0.25 μm, He, 3. K/min; Tstart: 60. C; Tend: 240. C |
Capillary | DB-5MS | 936. | Zoghbi, Andrade, et al., 1999, 2 | 30. m/0.25 mm/0.25 μm, He, 3. K/min; Tstart: 60. C; Tend: 240. C |
Capillary | SPB-5 | 936. | Doneanu and Anitescu, 1998 | 50. m/0.32 mm/0.25 μm, He, 3. K/min, 240. C @ 20. min; Tstart: 60. C |
Capillary | DB-5 | 931. | El-Sakhawy, El-Tantawy, et al., 1998 | 30. m/0.25 mm/0.25 μm, He, 3. K/min; Tstart: 60. C; Tend: 240. C |
Capillary | SE-30 | 937. | Jantan, Ahmad, et al., 1998 | He, 60. C @ 10. min, 3. K/min; Column length: 25. m; Column diameter: 0.2 mm; Tend: 180. C |
Capillary | OV-1 | 935. | Kökdil, Kurucu, et al., 1998 | 50. m/0.32 mm/0.25 μm, He, 50. C @ 5. min, 10. K/min, 250. C @ 20. min |
Capillary | DB-5 | 937. | Maia, Zohhbi, et al., 1998 | 30. m/0.25 mm/0.25 μm, He, 3. K/min; Tstart: 60. C; Tend: 240. C |
Capillary | HP-101 | 937. | Milso, Mastelic, et al., 1998 | 25. m/0.2 mm/0.2 μm, He, 70. C @ 2. min, 3. K/min, 200. C @ 10. min |
Capillary | HP-5 | 940. | Poiana, Sicari, et al., 1998 | 25. m/0.2 mm/0.33 μm, He, 70. C @ 8. min, 3. K/min, 290. C @ 20. min |
Capillary | HP-1 | 938. | Stashenko, Cervantes, et al., 1998 | 60. m/0.25 mm/0.25 μm, He, 50. C @ 5. min, 4. K/min; Tend: 280. C |
Capillary | OV-101 | 935. | Zollo, Biyiti, et al., 1998 | 5. K/min; Column length: 25. m; Column diameter: 0.32 mm; Tstart: 50. C; Tend: 200. C |
Capillary | CP Sil 5 CB | 926. | Bos, Woerdenbag, et al., 1997 | 25. m/0.32 mm/0.25 μm, N2, 4. K/min; Tstart: 50. C; Tend: 290. C |
Capillary | CP Sil 5 CB | 926. | Bos, Woerdenbag, et al., 1997 | 25. m/0.32 mm/0.25 μm, N2, 4. K/min; Tstart: 50. C; Tend: 290. C |
Capillary | CP Sil 5 CB | 926. | Bos, Woerdenbag, et al., 1997, 2 | 25. m/0.25 mm/0.25 μm, He, 6. K/min; Tstart: 60. C; Tend: 300. C |
Capillary | OV-1 | 928. | Kökdil, Kurucu, et al., 1997 | 30. m/0.32 mm/0.25 μm, He, 40. C @ 4. min, 2. K/min; Tend: 270. C |
Capillary | SPB-Sulfur | 947. | Mariaca, Berger, et al., 1997 | 30. m/0.32 mm/4. μm, He, 45. C @ 13. min, 5. K/min, 240. C @ 5. min |
Capillary | SPB-Sulfur | 947. | Mariaca, Berger, et al., 1997 | 30. m/0.32 mm/4. μm, He, 45. C @ 13. min, 5. K/min, 240. C @ 5. min |
Capillary | DB-1 | 930. | Salgueiro, Vila, et al., 1997 | 6. K/min; Tstart: 80. C; Tend: 220. C |
Capillary | DB-5 | 938. | Tellez, Estell, et al., 1997, 2 | 30. m/0.25 mm/0.25 μm, Helium, 3. K/min; Tstart: 60. C; Tend: 240. C |
Capillary | DB-5 | 939. | Zunino, Novillo-Newton, et al., 1997 | He, 4. K/min; Column length: 30. m; Column diameter: 0.25 mm; Tstart: 60. C; Tend: 240. C |
Capillary | CBP-1 | 937. | Zygadlo, Ariza-Espinar, et al., 1997 | He, 5. K/min; Column length: 25. m; Column diameter: 0.22 mm; Tstart: 60. C; Tend: 240. C |
Capillary | HP-1 | 928. | Ayedoun, Adeoti, et al., 1996 | 23. m/0.32 mm/0.17 μm, He, 60. C @ 3. min, 5. K/min, 250. C @ 30. min |
Capillary | OV-101 | 941. | Chacko, Jayalekshmy, et al., 1996 | 50. m/0.25 mm/0.17 μm, N2, 5. K/min; Tstart: 50. C; Tend: 220. C |
Capillary | DB-5 | 932.0 | Gawdzik, Mardarowicz, et al., 1996 | 30. m/0.25 mm/0.25 μm, 60. C @ 2. min, 4. K/min, 300. C @ 5. min |
Capillary | HP-1 | 935. | Malizia, Molli, et al., 1996 | 30. m/0.53 mm/0.88 μm, N2, 8. K/min, 300. C @ 15. min; Tstart: 60. C |
Capillary | OV-101 | 929. | Orav, Kailas, et al., 1996 | He, 2. K/min; Column length: 50. m; Column diameter: 0.25 mm; Tstart: 50. C; Tend: 250. C |
Capillary | DB-1 | 976. | Sagrero-Nieves and Bartley, 1996 | 60. m/0.32 mm/0.50 μm, He, 50. C @ 1. min, 8. K/min, 250. C @ 6. min |
Capillary | DB-5 | 940. | Sohounhloue, Dangou, et al., 1996 | 40. C @ 2. min, 2. K/min, 210. C @ 33. min; Column length: 30. m; Column diameter: 0.25 mm |
Capillary | DB-1 | 963. | Stashenko, Puertas, et al., 1996 | 60. m/0.25 mm/0.25 μm, He, 50. C @ 5. min, 2.5 K/min; Tend: 250. C |
Capillary | HP-1 | 928. | Thanh, Dung, et al., 1996 | 25. m/0.32 mm/0.25 μm, Helium, 60. C @ 2. min, 4. K/min, 220. C @ 20. min |
Capillary | SPB-1 | 930. | Wong and Lai, 1996 | 50. m/0.2 mm/0.33 μm, He, 40. C @ 3. min, 3. K/min, 200. C @ 30. min |
Capillary | HP-5 | 942. | Larsen and Frisvad, 1995 | 35. C @ 2. min, 6. K/min; Tend: 200. C |
Capillary | OV-101 | 930. | Orav, Kuningas, et al., 1995 | 50. m/0.2 mm/0.5 μm, He, 1. K/min; Tstart: 70. C; Tend: 180. C |
Capillary | DB-1 | 930. | Stashenko, Torres, et al., 1995 | 60. m/0.25 mm/0.25 μm, He, 50. C @ 5. min, 3.5 K/min; Tend: 250. C |
Capillary | DB-1 | 932. | Tirado, Stashenko, et al., 1995 | 60. m/0.25 mm/0.25 μm, He, 70. C @ 5. min, 2.5 K/min; Tend: 270. C |
Capillary | DB-1 | 932. | Tirado, Stashenko, et al., 1995 | 60. m/0.25 mm/0.25 μm, He, 70. C @ 5. min, 2.5 K/min; Tend: 270. C |
Capillary | HP-5 | 942. | Larsen and Frisvad, 1994 | 35. C @ 2. min, 6. K/min; Tend: 200. C |
Capillary | OV-1 | 934. | Ramanoelina, Viano, et al., 1994 | 50. m/0.27 mm/0.2 μm, N2, 3. K/min; Tstart: 80. C; Tend: 240. C |
Capillary | HP-5 | 938. | Collin, Deslauriers, et al., 1993 | 2. K/min; Tstart: 40. C; Tend: 210. C |
Capillary | HP-5 | 939. | Collin, Deslauriers, et al., 1993 | 2. K/min; Tstart: 40. C; Tend: 210. C |
Capillary | HP-101 | 929. | Demarne and van der Walt, 1993 | 50. m/0.32 mm/0.3 μm, H2, 65. C @ 5. min, 2. K/min; Tend: 300. C |
Capillary | OV-101 | 942. | Egolf and Jurs, 1993 | 2. K/min; Column length: 50. m; Column diameter: 0.22 mm; Tstart: 80. C; Tend: 200. C |
Capillary | Methyl Silicone | 942. | Gopalakrishnan, Menon, et al., 1993 | 50. m/0.25 mm/0.17 μm, N2, 2. K/min; Tstart: 80. C; Tend: 200. C |
Capillary | Methyl Silicone | 943. | Gopalakrishnan, Menon, et al., 1993 | 50. m/0.25 mm/0.17 μm, N2, 3. K/min; Tstart: 80. C; Tend: 200. C |
Capillary | CP Sil 5 CB | 936. | Kaul, Singh, et al., 1993 | 5. K/min; Column length: 25. m; Column diameter: 0.25 mm; Tstart: 60. C; Tend: 280. C |
Capillary | Methyl Silicone | 938. | Mallavarapu, Ramesh, et al., 1993 | 5. K/min; Column length: 25. m; Column diameter: 0.50 mm; Tstart: 60. C; Tend: 220. C |
Capillary | OV-101 | 927. | Zenkevich and Kulikova, 1993 | He, 3. K/min; Column length: 54. m; Column diameter: 0.26 mm; Tstart: 50. C; Tend: 230. C |
Capillary | DB-1 | 938. | Ciccioli, Cecinato, et al., 1992 | 60. m/0.32 mm/1.2 μm, He, 30. C @ 10. min, 3. K/min; Tend: 240. C |
Capillary | SPB-5 | 932. | King and Knight, 1992 | 8. K/min; Column length: 30. m; Phase thickness: 1.0 μm; Tstart: 50. C; Tend: 250. C |
Capillary | SE-54 | 934. | Kollmannsberger, Nitz, et al., 1992 | 30. m/0.25 mm/0.25 μm, Hydrogen, 60. C @ 5. min, 2. K/min, 250. C @ 2. min |
Capillary | OV-101 | 932. | Misharina, Golovnya, et al., 1991 | 50. m/0.32 mm/0.5 μm, He, 4. K/min; Tstart: 50. C; Tend: 250. C |
Capillary | DB-1 | 929. | Velasco-Negueruela, Pérez Alonso, et al., 1991 | N2, 4. K/min; Column length: 30. m; Tstart: 80. C; Tend: 220. C |
Capillary | CP Sil 8 CB | 941. | Jantan and Goh, 1990 | 60. C @ 10. min, 3. K/min; Column length: 25. m; Column diameter: 0.20 mm; Tend: 230. C |
Capillary | RSL-150 | 969. | Ronse and De Pooter, 1990 | 30. m/0.32 mm/0.20 μm, 3. K/min; Tstart: 30. C; Tend: 200. C |
Capillary | BP-1 | 933. | Wyllie, Brophy, et al., 1990 | 45. C @ 3. min, 3. K/min; Column length: 25. m; Column diameter: 0.33 mm; Tend: 180. C |
Capillary | OV-101 | 936. | Yang and Sugisawa, 1990 | N2, 2. K/min; Column length: 50. m; Column diameter: 0.25 mm; Tstart: 80. C; Tend: 200. C |
Capillary | OV-101 | 939. | Yang and Sugisawa, 1990 | N2, 2. K/min; Column length: 50. m; Column diameter: 0.25 mm; Tstart: 80. C; Tend: 200. C |
Capillary | BP-1 | 933. | Brophy, Davies, et al., 1989 | H2, 40. C @ 1. min, 10. K/min; Column length: 50. m; Column diameter: 0.30 mm; Tend: 250. C |
Capillary | SE-30 | 928. | de Pooter, de Buyck, et al., 1989 | 40. m/0.50 mm/0.75 μm, He, 3. K/min; Tstart: 30. C; Tend: 220. C |
Capillary | OV-101 | 936. | Sugisawa, Yamamoto, et al., 1989 | N2, 2. K/min; Column length: 50. m; Column diameter: 0.25 mm; Tstart: 80. C; Tend: 200. C |
Capillary | OV-101 | 933. | Sugisawa, Yang, et al., 1989 | N2, 2. K/min; Column length: 50. m; Column diameter: 0.25 mm; Tstart: 80. C; Tend: 200. C |
Capillary | OV-101 | 936. | Sugisawa, Yang, et al., 1989 | N2, 2. K/min; Column length: 50. m; Column diameter: 0.25 mm; Tstart: 80. C; Tend: 200. C |
Capillary | OV-1 | 928. | de Pooter, Nicolai, et al., 1988 | 50. m/0.20 mm/0.20 μm, He, 2. K/min; Tstart: 30. C; Tend: 220. C |
Capillary | OV-1 | 928. | Wahab, Aboutabl, et al., 1987 | 60. m/0.50 mm/1.2 μm, Helium, 2. K/min; Tstart: 40. C; Tend: 220. C |
Capillary | OV-3 | 940. | Buttery, Flath, et al., 1986 | He, 1. K/min; Column length: 150. m; Column diameter: 0.66 mm; Tstart: 30. C; Tend: 170. C |
Capillary | OV-101 | 931. | Nykanen, 1986 | 40. C @ 5. min, 3.5 K/min; Column length: 50. m; Column diameter: 0.30 mm; Tend: 230. C |
Capillary | OV-101 | 937. | Nykanen, 1986 | 40. C @ 5. min, 3.5 K/min; Column length: 50. m; Column diameter: 0.30 mm; Tend: 230. C |
Capillary | DB-1 | 933. | Perry, Baxter, et al., 1986 | 10. m/0.25 mm/0.25 μm, H2, 5. K/min; Tstart: 50. C; Tend: 250. C |
Capillary | OV-1 | 928. | de Pooter, de Buyck, et al., 1986 | 40. m/0.5 mm/0.75 μm, He, 3. K/min; Tstart: 30. C; Tend: 220. C |
Capillary | OV-1 | 927. | De Pooter, De Buyck, et al., 1986 | He, 2. K/min; Tstart: 40. C; Tend: 220. C |
Capillary | OV-101 | 927. | De Pooter and Schamp, 1986 | 30. m/0.5 mm/0.8 μm, He, 2. K/min; Tstart: 40. C; Tend: 220. C |
Capillary | OV-101 | 927. | De Pooter and Schamp, 1986 | 30. m/0.5 mm/0.8 μm, He, 2. K/min; Tstart: 40. C; Tend: 220. C |
Capillary | OV-101 | 927. | De Pooter and Schamp, 1986 | 30. m/0.5 mm/0.8 μm, He, 2. K/min; Tstart: 40. C; Tend: 220. C |
Capillary | DB-1 | 926. | Habu, Flath, et al., 1985 | 3. K/min; Column length: 50. m; Column diameter: 0.32 mm; Tstart: 0. C; Tend: 250. C |
Capillary | OV-101 | 923. | del Rosario, de Lumen, et al., 1984 | He, 0. C @ 1. min, 3. K/min; Column length: 50. m; Column diameter: 0.31 mm; Tend: 225. C |
Capillary | DB-1 | 928. | Flath, Mon, et al., 1983 | 50. C @ 0.1 min, 4. K/min, 250. C @ 5. min; Column length: 60. m; Column diameter: 0.32 mm |
Capillary | SE-30 | 930. | Heydanek and McGorrin, 1981 | He, 40. C @ 3. min, 3. K/min; Column length: 50. m; Column diameter: 0.5 mm; Tend: 170. C |
Capillary | SE-30+Igepal | 937. | Shibamoto and Jennings, 1977 | 1. K/min; Column length: 100. m; Column diameter: 0.25 mm; Tstart: 70. C; Tend: 170. C |
Capillary | SE-30+Igepal | 937. | Shibamoto and Jennings, 1977 | 1. K/min; Column length: 100. m; Column diameter: 0.25 mm; Tstart: 70. C; Tend: 170. C |
Capillary | SF-96 | 930. | Donetzhuber, Johansson, et al., 1976 | Nitrogen, 3. K/min, 130. C @ 40. min; Column length: 111. m; Column diameter: 0.76 mm; Initial hold: 8. min |

Normal alkane RI, non-polar column, custom temperature program

Column type | Active phase | I | Reference | Comment |
---|---|---|---|---|
Capillary | DB-1 | 930. | Albano, Lima, et al., 2012 | 30. m/0.25 mm/0.25 μm, Hydrogen; Program: 45 0C 3 0C/min -> 175 0C 15 0C/min -> 300 0C (10 min) |
Capillary | RTX-1 | 931. | Bendiabdellah, El Amine Dib, et al., 2012 | 60. m/0.22 mm/0.25 μm, Helium; Program: not specified |
Capillary | RTX-1 | 931. | Bendiabdellah, El Amine Dib, et al., 2012 | 60. m/0.22 mm/0.25 μm, Helium; Program: not specified |
Capillary | Mega-5 | 936. | Dell'Agli, Sanna, et al., 2012 | 25. m/0.25 mm/0.25 μm, Helium; Program: not specified |
Capillary | SLB-5 MS | 932. | Mondello, 2012 | 30. m/0.25 mm/0.25 μm, Helium; Program: not specified |
Capillary | SLB-5 MS | 938. | Mondello, 2012 | 30. m/0.25 mm/0.25 μm, Helium; Program: not specified |
Capillary | Polydimethyl siloxane with 5 % Ph groups | 933. | Robinson, Adams, et al., 2012 | Program: not specified |
Capillary | Polydimethyl siloxane with 5 % Ph groups | 937. | Robinson, Adams, et al., 2012 | Program: not specified |
Capillary | HP-5 MS | 941. | Sharopov, Sulaimonova, et al., 2012 | 30. m/0.25 mm/0.25 μm, Helium; Program: 40 0C (10 min) 3 0C/min -> 200 0C 2 0C/min -> 220 0C |
Capillary | Polydimethyl siloxane with 5 % Ph groups | 931. | da Silva, de Souza, et al., 2012 | 30. m/0.25 mm/0.25 μm, Helium; Program: 50 0C 4 0C/min -> 200 0C (5 min) 20 0C/min -> 280 0C |
Capillary | HP-5 | 939. | Velickovic, Ristic, et al., 2012 | 25. m/0.32 mm/0.52 μm, Hydrogen; Program: not specified |
Capillary | HP-5 | 936. | Veres, Csupor-Loffler, et al., 2012 | 30. m/0.35 mm/0.25 μm, Nitrogen; Program: 60 0C 3 0C/min -> 210 0C 5 0C/min -> 250 0C (2 min) |
Capillary | Siloxane, 5 % Ph | 931. | VOC BinBase, 2012 | Program: not specified |
Capillary | HP-5 MS | 931. | Bai, Liu, et al., 2011 | 30. m/0.25 mm/0.25 μm, Helium; Program: 60 0C (1 min) 10 0C/min -> 180 0C (1 min) 20 0C/min -> 280 0C (15 min) |
Capillary | DB-5 | 931. | Cao, Li, et al., 2011 | 30. m/0.25 mm/0.25 μm, Helium; Program: not specified |
Capillary | 5 % Phenyl polydimethyl siloxane | 937. | Chaverri, Diaz, et al., 2011 | Program: not specified |
Capillary | OV-1 | 920. | Chen and Li, 2011 | Helium; Column length: 30. m; Column diameter: 0.25 mm; Program: 40 0C 2 0C/min -> 120 0C 10 0C/min -> 230 0C (15 min) |
Capillary | HP-5 MS | 931. | Chu, Liu, et al., 2011 | 30. m/0.25 mm/0.25 μm, Helium; Program: 60 0C (1 min) 10 0C -> 180 0C (1 min) 20 0C/min -> 280 0C (15 min) |
Capillary | DB-1 | 944. | Fathi, Sahari, et al., 2011 | 30. m/0.25 mm/0.25 μm, Helium; Program: 50 0C (5 min) 3 0C/min -> 240 0C 15 0C/min -> 300 0C (3 min) |
Capillary | HP-5 MS | 936. | Feizbakhsh and Naeemy, 2011 | 30. m/0.25 mm/0.25 μm, Helium; Program: not specified |
Capillary | HP-5 MS | 937. | Feizbakhsh and Naeemy, 2011 | 30. m/0.25 mm/0.25 μm, Helium; Program: not specified |
Capillary | CBP-5 | 933. | Fortes, Naves, et al., 2011 | 30. m/0.25 mm/0.25 μm, Helium; Program: 60 0C 3 0C/min -> 246 0C 10 0C/min -> 270 0C (5 min) |
Capillary | 939. | Karimi, Farmany, et al., 2011 | Program: not specified | |
Capillary | HP-5 | 934. | Laribi, Kouki, et al., 2011 | 30. m/0.25 mm/0.25 μm, Nitrogen; Program: 35 0C (10 min) 3 0C/min -> 205 0C 10 0C/min -> 225 0C |
Capillary | DB-5 | 956. | Miyazaki, Plotto, et al., 2011 | 60. m/0.25 mm/1.00 μm, Helium; Program: 40 0C 4 0C/min -> 230 0C 100 0C/min -> 260 0C (11.7 min) |
Capillary | HP-5 MS | 941. | Nance and Setzer, 2011 | 30. m/0.25 mm/0.25 μm, Helium; Program: 40 0C (10 min) 3 0C/min -> 200 0C 2 0C/min -> 220 0C |
Capillary | Polydimethyl siloxane, 5 % phenyl | 931. | Skogerson, Wohlgemuth, et al., 2011 | Program: not specified |
Capillary | HP-5 | 939. | Wang, Liu, et al., 2011 | 30. m/0.25 mm/0.25 μm, Helium; Program: 60 0C (1 min) 10 0C/min -> 180 0C (1 min) 20 0C/min -> 280 0C (15 min) |
Capillary | HP-5 MS | 927. | Wang, Xu, et al., 2011 | 30. m/0.25 mm/0.25 μm, Helium; Program: 50 0C (1.5 min) 10 0C/min -> 180 0C (2 min) 6 0C/min -> 280 0C (10 min) |
Capillary | RTx-1 | 931. | Dib, Bendahou, et al., 2010 | 60. m/0.22 mm/0.25 μm, Helium; Program: not specified |
Capillary | RTX-1 | 931. | Dib, Djabou, et al., 2010 | 60. m/0.22 mm/0.25 μm, Helium; Program: not specified |
Capillary | CP-Sil 8 CB | 956. | Di Giusto, Bessiere, et al., 2010 | 30. m/0.25 mm/0.25 μm, Helium; Program: Multi-rise program |
Capillary | HP-5 MS | 931. | Liu, Chu, et al., 2010 | 30. m/0.25 mm/0.25 μm, Helium; Program: 60 0C (1 min) 10 0C/min -> 180 0C (1 min) 20 0C/min -> 280 0C (15 min) |
Capillary | HP-5 MS | 939. | Pino, Marquez, et al., 2010 | 30. m/0.32 mm/0.25 μm, Helium; Program: not specified |
Capillary | DB-5 | 932. | Pontes, Silva, et al., 2010 | 30. m/0.25 mm/0.25 μm, Hydrogen; Program: 35 0C (2 min) 4 0C/min -> 180 0C 20 0C/min -> 280 0C |
Capillary | SLB-5 MS | 933. | Scandinaro, Tranchida, et al., 2010 | 10. m/0.10 mm/0.10 μm, Helium; Program: not specified |
Capillary | HP-5 MS | 936. | Sharifiar, Yassa, et al., 2010 | 30. m/0.25 mm/0.25 μm, Helium; Program: 50 0C (3 min) 3 0C/min -> 160 0C (10 min) 3 0C/min -> 240 0C |
Capillary | DB-1-MS | 929. | Takeoka, Hobbs, et al., 2010 | 60. m/0.25 mm/0.25 μm, Helium; Program: not specified |
Capillary | DB-1 | 931. | Xu, Tang, et al., 2010 | 30. m/0.25 mm/0.25 μm, Helium; Program: not specified |
Capillary | ZB-1 MS | 948. | Bajpai, Al-Reza, et al., 2009 | 30. m/0.25 mm/0.25 μm, Helium; Program: 50 0C 3 0C/min -> 150 0C (10 min) 10 0C/min -> 250 0C |
Capillary | DB-5 | 940. | Courtois, Paine, et al., 2009 | 30. m/0.25 mm/0.25 μm, Helium; Program: 50 0C m6 0C/min -> 140 0C 5 0C/min -> 160 0C (1 min) 10 0C/min -> 200 0C |
Capillary | DB-1 | 937. | Delort and Jaquier, 2009 | 60. m/0.25 mm/0.25 μm, Helium; Program: 50 0C (5 min) 3 0C/min -> 120 0C 5 0C/min -> 250 0C (3 min) 15 0C/min -> 300 0C (20 min) |
Capillary | HP-5 MS | 932. | Fan, Lu, et al., 2009 | 30. m/0.25 mm/0.25 μm, Helium; Program: 40 0C (3 min) 3 0C/min -> 160 0C (2 min) 8 0C/min -> 220 0C (3 min) |
Capillary | Optima-5MS | 922. | HEuskin, Godin, et al., 2009 | 30. m/0.32 mm/0.25 μm, Helium; Program: 40 0C (5 min) 5 0C/min -> 230 0C 30 0C/min -> 280 0C (5 min) |
Capillary | Optima-5MS | 922. | HEuskin, Godin, et al., 2009 | 30. m/0.32 mm/0.25 μm, Helium; Program: 40 0C (5 min) 5 0C/min -> 230 0C 30 0C/min -> 280 0C (5 min) |
Capillary | 5 % Phenyl methyl siloxane | 937. | Huang, Qin, et al., 2009 | 30. m/0.25 mm/0.25 μm, Helium; Program: 50 0C (2 min) 10 0C/min -> 150 0C 15 0C/min -> 300 0C (10 min) |
Capillary | Elite-5 MS | 928. | Kapoor, Singh, et al., 2009 | 30. m/0.25 mm/0.25 μm, Helium; Program: 60 0C (1 min) 1.5 0C/min -> 185 0C (1 min) 9 0C/min -> 275 0C (2 min) |
Capillary | Elite-5 MS | 932. | Kapoor, Singh, et al., 2009 | 30. m/0.25 mm/0.25 μm, Helium; Program: 60 0C (1 min) 1.5 0C/min -> 185 0C (1 min) 9 0C/min -> 275 0C (2 min) |
Capillary | RTX-5 | 935. | Leela, Vipin, et al., 2009 | 30. m/0.25 mm/0.25 μm, Nitrogen; Program: 60 0C 95 min) 110 0C 3 0C/min -> 200 0C 5 0C/min -> 220 0C 95 min) |
Capillary | RTX-5 | 939. | Leela, Vipin, et al., 2009 | 30. m/0.25 mm/0.25 μm, Nitrogen; Program: not specified |
Capillary | HP-5 | 933. | Maggi, Bilek, et al., 2009 | 25. m/0.32 mm/0.17 μm, Helium; Program: 60 0C (5 min) 4 0C/min -> 220 0C 11 0C/min -> 280 0C |
Capillary | HP-5 MS | 938. | Mancini, Arnold, et al., 2009 | 30. m/0.25 mm/0.25 μm, Helium; Program: 40 0C (5 min) 2 0C/min -> 270 0C -> 260 0C (20 min) |
Capillary | DB-1 | 930. | Mendes, Trindade, et al., 2009 | 30. m/0.25 mm/0.25 μm, Hydrogen; Program: 45 0C 3 0C/min -> 175 0C 15 0C/min -> 300 0C (10 min) |
Capillary | DB-1 | 930. | Mendes, Trindade, et al., 2009, 2 | 30. m/0.25 mm/0.25 μm, Hydrogen; Program: 45 0C 3 0C/min -> 175 0C 15 0C/min -> 300 0C (10 min) |
Capillary | DB-5 | 935. | Porto, Decorti, et al., 2009 | 30. m/0.25 mm/0.25 μm, Helium; Program: not specified |
Capillary | DB-5 | 939. | Porto, Decorti, et al., 2009 | 30. m/0.25 mm/0.25 μm, Helium; Program: not specified |
Capillary | HP-5 | 934. | Riahi, Pourbasheer, et al., 2009 | Column length: 30. m; Column diameter: 0.32 mm; Program: not specified |
Capillary | DB-5 MS | 936. | Su, Wang, et al., 2009 | 30. m/0.25 mm/0.25 μm, Helium; Program: not specified |
Capillary | DB-1 HT | 918. | Yang, Kim, et al., 2009 | 30. m/0.32 mm/0.10 μm, Helium; Program: 40 0C 2 0C/min -> 100 0C 5 0C/min -> 230 0C (5 min) |
Capillary | DB-5 | 938. | Yang, Yang, et al., 2009 | 30. m/0.25 mm/0.25 μm, Helium; Program: 50 0C 95 min) 3 0C/min -> 100 0C 4 0C/min -> 160 0C 5 0C/min -> 220 0C (15 min) |
Capillary | OV-1 | 925. | Yu, Li, et al., 2009 | Helium; Column length: 30. m; Column diameter: 0.25 mm; Program: 40 0C 2 0C/min -> 130 0C (5 min) 10 0C/min -> 230 0C (15 min) |
Capillary | HP-5 MS | 939. | Zellner, Amorim, et al., 2009 | 30. m/0.25 mm/0.25 μm, Helium; Program: 32 0C (1 min) 50 0C/min -> 115 0C 1.5 0C/min -> 145 0C 12 0C/min -> 240 0C (10 min) |
Capillary | DB-5 | 939. | Bastos, Ishimoto, et al., 2008 | 30. m/0.25 mm/0.25 μm, Helium; Program: not specified |
Capillary | SLB-5 MS | 933. | Costa, De Fina, et al., 2008 | 30. m/0.25 mm/0.25 μm, Helium; Program: 50 0C 3 0C/min -> 250 0C (1 min) 10 0C/min -> 300 0C (5 min) |
Capillary | SLB-5 MS | 932. | Costa, De Fina, et al., 2008 | 30. m/0.25 mm/0.25 μm, Helium; Program: not specified |
Capillary | HP-5 | 936. | Isidorov, Lech, et al., 2008 | 30. m/0.25 mm/0.25 μm, Helium; Program: not specified |
Capillary | CB-1 | 930. | Kannaste, Vongvanich, et al., 2008 | 30. m/0.25 mm/0.25 μm, Helium; Program: 40 0C (2 min) 4 0C/min -> 180 0C 20 0C/min -> 220 0C (1 min) |
Capillary | CB-1 | 936. | Kannaste, Vongvanich, et al., 2008 | 30. m/0.25 mm/0.25 μm, Helium; Program: not specified |
Capillary | SPB-5 | 933. | Kilani, Ledauphin, et al., 2008 | Program: not specified |
Capillary | SPB-5 | 936. | Kilani, Ledauphin, et al., 2008 | Program: not specified |
Capillary | CP Sil 8 CB | 939. | Kupcinskiene, Stikliene, et al., 2008 | 50. m/0.32 mm/0.25 μm, Helium; Program: not specified |
Capillary | SLB-5 MS | 933. | Lo Presti, Sciarrone, et al., 2008 | 30. m/0.25 mm/0.25 μm, Helium; Program: not specified |
Capillary | HP-5MS | 937. | Ning, Zheng, et al., 2008 | 30. m/0.25 mm/0.25 μm, He; Program: 40 0C (2 min) 3 0C/min -> 180 0C (2 min) 15 0C -> 280 0C |
Capillary | DB-1 | 930. | Nogueira, Marcelo-Curto, et al., 2008 | 30. m/0.25 mm/0.25 μm, He; Program: 45C => 3C/min => 175C => 15C/min => 300C (10min) |
Capillary | CP-Sil 8CB-MS | 933. | Profitt, Schatz, et al., 2008 | 30. m/0.25 mm/0.25 μm, Helium; Program: 50 0C(3 min) 3 0C/min -> 100 0C 2.7 0C/min -> 140 0C 2.4 0C/min -> 180 0C 6 0C/min -> 260 0C |
Capillary | HP-5 | 930. | Qiao, Xie, et al., 2008 | 30. m/0.25 mm/0.25 μm, Helium; Program: 40 0C (3 min) 3 0C/min -> 160 0C (2 min) 8 0C/min -> 220 0C (3 min) |
Capillary | HP-5 | 934. | Qiao, Xie, et al., 2008 | 30. m/0.25 mm/0.25 μm, Helium; Program: not specified |
Capillary | Elite-1 | 939. | Raj, Baby, et al., 2008 | 30. m/0.32 mm/0.25 μm, Helium; Program: not specified |
Capillary | DB-5 | 937. | Santos, Costa, et al., 2008 | Helium; Column length: 30. m; Column diameter: 0.25 mm; Program: 80 0C (2 min) 3 0C/min -> 180 0C 10 0C/min -> 300 0C (10 min) |
Capillary | DB-5 | 939. | Santos, Costa, et al., 2008 | Helium; Column length: 30. m; Column diameter: 0.25 mm; Program: not specified |
Capillary | BPX-5 | 933. | Shellie, 2008 | 7.5 m/0.10 mm/10. μm, Helium; Program: not specified |
Capillary | DB-5 MS | 935. | Silva, Doria, et al., 2008 | 30. m/0.25 mm/0.25 μm; Program: 80 0C (1.5 min) 4 pC/min -> 180 0C 10 0C/min -> 300 0C (10 min) |
Capillary | DB-5 MS | 980. | Silva, Doria, et al., 2008 | 30. m/0.25 mm/0.25 μm; Program: 80 0C (1.5 min) 4 pC/min -> 180 0C 10 0C/min -> 300 0C (10 min) |
Capillary | HP-5 MS | 931. | Xie, Sun, et al., 2008 | 30. m/0.25 mm/0.25 μm, Helium; Program: 40 0C (2 min) 4 0C/min -> 220 0C 20 0C/min -> 280 0C |
Capillary | RTX-5 | 936. | Zachariah, Leela, et al., 2008 | 30. m/0.25 mm/0.25 μm, Helium; Program: 60 0C (5 min) 5 0C/min -> 110 0C 3 0C/min -> 220 0C (5 min) |
Capillary | RTX-5 | 935. | Zachariah, Leela, et al., 2008 | 30. m/0.25 mm/0.25 μm, Helium; Program: not specified |
Capillary | 5 % Phenyl methyl siloxane | 943. | Agabriel, Cornu, et al., 2007 | Program: not specified |
Capillary | DB-5 | 940. | Albuquerque M.R.J.R., Costa S.M.O., et al., 2007 | 30. m/0.25 mm/0.1 μm, He; Program: 35C => 4C/min => 180C => 10C/min => 250C |
Capillary | DB-1 | 939. | Albuquerque, Vasconcelos Silva, et al., 2007 | 30. m/0.25 mm/0.1 μm, He; Program: 35C => 4C/min => 180C => 10C/min => 250C |
Capillary | HP-1 | 921. | Barra, Baldovini, et al., 2007 | 50. m/0.2 mm/0.33 μm, He; Program: 40C(2min) => 2C/min => 200C => 15C/min => 250C (30min) |
Capillary | DB-5MS | 931. | Barra A., Coroneo V., et al., 2007 | 30. m/0.25 mm/0.25 μm, He; Program: 60C => 1C/min => 65C => 3C/min => 120C => 5C/min => 180C(5min) => 5C/min => 250C (20min) |
Capillary | CBP-5 | 936. | Cheriti, Saad, et al., 2007 | 30. m/0.25 mm/0.25 μm, He; Program: 60C(2min) => 3C/min => 240C => 10C/min => 300C |
Capillary | HP-5MS | 939. | Chokeprasert P., Charles A.L., et al., 2007 | 30. m/0.25 mm/0.25 μm, He; Program: 40C => 3C/min => 100C => 5C/min => 230C(2min) |
Capillary | HP-5MS | 940. | Cole, Haber, et al., 2007 | 30. m/0.25 mm/0.25 μm, He; Program: 40C(10min) => 3C/min => 200C => 2C/min => 220C |
Capillary | SPB-1 | 932. | Díaz-Maroto, Castillo, et al., 2007 | 50. m/0.25 mm/0.25 μm; Program: 70C(3min) => 4C/min => 120C => 8C/min => 250C(5min) |
Capillary | SPB-1 | 932. | Díaz-Maroto, Castillo, et al., 2007 | 50. m/0.25 mm/0.25 μm; Program: 70C(3min) => 4C/min => 120C => 8C/min => 250C(5min) |
Capillary | HP-5 | 938. | Duschatzky, Almeida, et al., 2007 | 30. m/0.25 mm/0.25 μm; Program: 75C(4min) => 5C/min => 135C => 1C/min => 220C => 10C/min => 280C |
Capillary | HP-5 MS | 945. | Eason and Setzer, 2007 | 30. m/0.25 mm/0.25 μm, Helium; Program: 40 0C (10 min) 3 0C/min -> 200 0C 2 0C/min -> 220 0C |
Capillary | DB-1 | 930. | Ferreira, Meireles de Sousa, et al., 2007 | 30. m/0.25 mm/0.25 μm, He; Program: 45C => 3C/min => 175C => 15C/min => 300C (10min) |
Capillary | HP-5MS | 938. | Formisano, Mignola, et al., 2007 | 30. m/0.25 mm/0.25 μm, He; Program: 40C(5min) => 2C/min => 250C(15min) => 10C/min => 270C |
Capillary | BP-5 | 933. | Hashemi, Abolghasemi, et al., 2007 | 30. m/0.32 mm/0.25 μm, He; Program: 60C => 4C/min => 150C => 10C/min => 220C |
Capillary | DB-1 | 930. | Kamatou, Viljoen, et al., 2007 | 30. m/0.25 mm/0.25 μm, H2; Program: 45 0C 3 0C/min -> 175 0C 15 0C/min -> 300 0C (10 min) |
Capillary | HP-5MS | 939. | Liu, Song, et al., 2007 | 30. m/0.25 mm/0.25 μm, He; Program: 40C(3min) => 8C/min => 160C => 15C/min => 300C (10min) |
Capillary | CP Sil 8 CB | 937. | Meekijjaroenroj, Bessière, et al., 2007 | 30. m/0.25 mm/0.25 μm, He; Program: 50C(3min) => 3C/min => 100C => 2.7C/min => 140C => 2.4C/min => 180C => 6C/min => 250C |
Capillary | HP-1 | 938. | Merle, Verdeguer, et al., 2007 | 30. m/0.2 mm/0.33 μm, He; Program: 60C(5min) => 3C/min => 180C => 20C/min => 280C(10min) |
Capillary | CP Sil 8 CB | 939. | Mockute, Bernotiene, et al., 2007 | 50. m/0.32 mm/0.25 μm, He; Program: 60 0C (2 min) 5 0C/min -> 160 0C 5 0C/min -> 250 0C (10 min) |
Capillary | HP-5 MS | 944. | Moriarity, Bansal, et al., 2007 | 30. m/0.25 mm/0.25 μm, Helium; Program: 40 0C (10 min) 3 0C/min -> 200 0C 2 0C/min -> 220 0C |
Capillary | HP-5MS | 942. | Moronkola, Ogunwande, et al., 2007 | 30. m/0.25 mm/0.25 μm, He; Program: 40C(10min) => 3C/min => 200C => 2C/min => 220C |
Capillary | HP-5MS | 932. | Mu, Wang, et al., 2007 | 30. m/0.25 mm/0.25 μm, He; Program: 40C(3min) => 8C/min => 160C => 15C/min => 300C |
Capillary | DB-5 | 939. | Nivinsliene, Butkiene, et al., 2007 | 50. m/0.32 mm/0.25 μm, Helium; Program: 60 0C (1 min) 5 0C/min -> 160 0C 10 0C/min -> 250 0C |
Capillary | BPX-5 | 921. | Ozer H., Sokmen M., et al., 2007 | 30. m/0.25 mm/0.25 μm, He; Program: 50C => 3C/min => 150C(10min) => 10C/min => 250C |
Capillary | DB-5 | 939. | Pontes, de Olivera, et al., 2007 | 30. m/0.25 mm/0.25 μm, Hydrogen; Program: not specified |
Capillary | CP-Sil | 928. | Proffit, 2007 | 30. m/0.25 mm/0.25 μm, Helium; Program: 50 0C (3 min) 3 0C/min -> 100 0C 2.7 0C/min -> 140 0C 2.4 0C/min -> 180 0C 6 0C/min -> 250 0C |
Capillary | CP-Sil | 933. | Proffit, 2007 | 30. m/0.25 mm/0.25 μm, Helium; Program: 50 0C (3 min) 3 0C/min -> 100 0C 2.7 0C/min -> 140 0C 2.4 0C/min -> 180 0C 6 0C/min -> 250 0C |
Capillary | CP-Sil | 933. | Proffit, 2007 | 30. m/0.25 mm/0.25 μm, Helium; Program: 50 0C (3 min) 3 0C/min -> 100 0C 2.7 0C/min -> 140 0C 2.4 0C/min -> 180 0C 6 0C/min -> 250 0C |
Capillary | CP-Sil | 934. | Proffit, 2007 | 30. m/0.25 mm/0.25 μm, Helium; Program: 50 0C (3 min) 3 0C/min -> 100 0C 2.7 0C/min -> 140 0C 2.4 0C/min -> 180 0C 6 0C/min -> 250 0C |
Capillary | CP Sil 8 CB | 939. | Radusiene, Judzentiene, et al., 2007 | 50. m/0.32 mm/0.25 μm, Helium; Program: 60 0C (2 min) 5 0C/min -> 160 0C (1 min) 10 0C/min -> 280 0C (3 min) |
Capillary | DB-1 | 937. | Rao, Maia, et al., 2007 | 30. m/0.25 mm/0.25 μm, Helium; Program: 35 0C 4 0C/min -> 180 0C 10 0C/min -> 250 0C |
Capillary | HP-5 | 939. | Ristic, Krivokuca-Dokic, et al., 2007 | 30. m/0.25 mm/0.25 μm, Helium; Program: not specified |
Capillary | DB-1 | 930. | Rodrigues, Antunes, et al., 2007 | 30. m/0.25 mm/0.25 μm, He; Program: 45C => 3C/min => 175C => 15C/min => 300C(10min) |
Capillary | BPX-5 | 917. | Salamci, Kordali, et al., 2007 | 30. m/0.25 mm/0.25 μm, He; Program: 50C => 3C/min => 150C(10min) => 10C/min => 250C |
Capillary | 5 % Phenyl methylsiloxane | 944. | Serrano, Cornu, et al., 2007 | Program: not specified |
Capillary | HP-5 MS | 940. | Setzer, Stokes, et al., 2007 | Helium; Column length: 30. m; Column diameter: 0.25 mm; Program: 40 0C (10 min) 3 oC/min -> 200 0C 2 0C/min -> 220 0C |
Capillary | HP-5 MS | 938. | Sharififar, Mozaffarian, et al., 2007 | 30. m/0.25 mm/0.25 μm, Helium; Program: not specified |
Capillary | HP-5 MS | 938. | Sharififar, Mozaffarian, et al., 2007 | 30. m/0.25 mm/0.25 μm, Helium; Program: not specified |
Capillary | OV-1 | 930. | Suschke, Sporer, et al., 2007 | 30. m/0.25 mm/0.25 μm, Helium; Program: 40 0C (2 min) 6 0C/min -> 130 0C 10 0C/min -> 300 0C |
Capillary | HP-5MS | 940. | Takaku, Haber, et al., 2007 | He; Column length: 30. m; Column diameter: 0.25 mm; Program: 40C(10min) => 3C/min => 200C => 2C/min => 220C |
Capillary | HP-5MS | 941. | Yu, Huang, et al., 2007 | 30. m/0.25 mm/0.25 μm, He; Program: 40C(3min) => 6C/min => 160C => 10C/min => 300C (10min) |
Capillary | DB-5 | 939. | Albuquerque, Canuto, et al., 2006 | 30. m/0.25 mm/0.25 μm, He; Program: 35C => 4C/min => 180C => 10C/min => 250C |
Capillary | BPX-5 | 921. | Baris, Güllüce, et al., 2006 | 30. m/0.25 mm/0.25 μm, He; Program: 50C => 3C/min => 150C(10min) => 10C/min => 250C |
Capillary | SPB-5 | 914. | Chemat, Lucchesi, et al., 2006 | 60. m/0.32 mm/1. μm, He; Program: 60C => 1C/min => 130C => 2C/min => 200C => 4C/min => 250C (40min) |
Capillary | HP-5MS | 940. | Deng, Xu, et al., 2006 | 30. m/0.25 mm/0.25 μm, He; Program: 50C(2min) => 6C/min => 200C => 10C/min => 270C(10min) |
Capillary | DB-1 | 930. | Figueiredo A.C., Barroso J.G., et al., 2006 | 30. m/0.25 mm/0.25 μm, He; Program: 45C => 3C/min => 175C => 15C/min => 300C (10min) |
Capillary | HP-5MS | 938. | Formisano C., Senatore F., et al., 2006 | 30. m/0.25 mm/0.25 μm, He; Program: 40C(5min) => 2C/min => 250C(15min) => 10C/min => 270C |
Capillary | SPB-5 | 914. | Iriti, Colnaghi, et al., 2006 | 60. m/0.32 mm/1. μm, He; Program: 60C => 1C/min => 130C => 2C/min => 200C => 4C/min => 250C(40min) |
Capillary | HP-5 | 949. | Jordan, Martinez, et al., 2006 | 30. m/0.25 mm/0.25 μm, He; Program: 60C(4min) => 1C/min => 64C => 2.5C/min => 155C => 5C/min => 250C |
Capillary | CP Sil 8 CB | 939. | Judzentiene and Buzelyte, 2006 | 50. m/0.32 mm/0.25 μm, He; Program: 60C(2min) => 5C/min => 160C(1min) => 10C/min => 250C (5min) |
Capillary | HP-5 | 939. | Kucuk, Gulec, et al., 2006 | 30. m/0.32 mm/0.25 μm, Helium; Program: not specified |
Capillary | HP-5MS | 941. | Li, Deng, et al., 2006 | 30. m/0.25 mm/0.25 μm, He; Program: 40C(1min) => 8C/min => 160C => 12C/min => 300C(5min) |
Capillary | DB-1 | 939. | de Lima, Maia, et al., 2006 | He; Column length: 30. m; Column diameter: 0.25 mm; Program: 35C => 4C/min => 180C => 10C/min => 250C |
Capillary | SE-52 | 930. | Lorenzo, Loayza, et al., 2006 | 25. m/0.32 mm/0.42 μm, H2; Program: 60C(8min) => 3C/min => 180C => 20C/min => 250C (10min) |
Capillary | HP-5 | 949. | Martinez, Madrid, et al., 2006 | 30. m/0.25 mm/0.25 μm; Program: not specified |
Capillary | CP Sil 8 CB | 939. | Mockute, Bernotiene, et al., 2006 | 50. m/0.32 mm/0.25 μm, He; Program: 60 0C (2 min) 5 0C/min -> 160 0C 10 0C/min -> 250 0C (5 min) |
Capillary | SPB-5 | 939. | Navickiene, Morandim, et al., 2006 | 30. m/0.25 mm/0.10 μm, Helium; Program: 40 0C (1 min) 10 0C/min -> 120 0C 0.5 0C/min -> 150 0C 20 0C/min -> 280 0C (5 min) |
Capillary | DB-5 | 942. | Santos, Nunes, et al., 2006 | 30. m/0.25 mm/0.25 μm, He; Program: 35C => 4C/min => 180C => 10C/min => 250C |
Capillary | HP-5 MS | 933. | Schmidt, Noletto, et al., 2006 | 30. m/0.25 mm/0.25 μm, Helium; Program: 40 0C (10 min) 3 0C/min -> 200 0C 2 0C/min -> 220 0C |
Capillary | HP-5 MS | 938. | Schmidt, Noletto, et al., 2006 | 30. m/0.25 mm/0.25 μm, Helium; Program: 40 0C (10 min) 3 0C/min -> 200 0C 2 0C/min -> 220 0C |
Capillary | HP-5MS | 938. | Senatore, Apostolides Arnold, et al., 2006 | 30. m/0.25 mm/0.25 μm, He; Program: 40C(5min) => 2C/min => 250C (15min) => 10C/min => 270C |
Capillary | HP-5MS | 940. | Singh, Marimuthu, et al., 2006 | 30. m/0.25 mm/0.25 μm, He; Program: 60C => 1.5C/min => 185C(1min) => 9C/min => 275C(2min) |
Capillary | HP-5MS | 941. | Singh G., Maurya S., et al., 2006 | 30. m/0.32 mm/0.25 μm, He; Program: 60C(1min) => 1.5C => 185C => 9C/min => 275C (2min) |
Capillary | DB-5 | 944. | Srivastava, Mallavarapu, et al., 2006 | 30. m/0.32 mm/0.25 μm, He; Program: 60C => 2C/min => 100C => 3C/min => 160C => 5C/min => 280C |
Capillary | SE-52 | 939. | Tognolini, Barocelli, et al., 2006 | 30. m/0.32 mm/0.15 μm, He; Program: 45C => 1C/min => 100C => 5C/min => 250C (10min) |
Capillary | DB-5MS | 931. | Tuberoso, Barra, et al., 2006 | 30. m/0.25 mm/0.25 μm, He; Program: 60C => 3C/min => 180C => 250C (2min) |
Capillary | VF-5MS | 933. | Xie, Sun, et al., 2006 | 30. m/0.25 mm/0.25 μm, He; Program: 40C(1min) => 15C/min => 100C => 4C/min => 250C (1min) |
Capillary | DB-1 | 921. | Al-Burtamani, Fatope, et al., 2005 | 30. m/0.25 mm/0.25 μm, He; Program: 35C => 2C/min => 200C => 5C/min => 240C |
Capillary | DB-1 | 930. | Belhattab, Larous, et al., 2005 | 30. m/0.25 mm/0.25 μm, He; Program: 45C => 3C/min => 175C => 15C/min => 300C(10min) |
Capillary | Methyl Silicone | 944. | Blunden, Aneja, et al., 2005 | 60. m/0.32 mm/1.0 μm, Helium; Program: -50 0C (2 min) 8 0C/min -> 200 0C (7.75 min) 25 0C -> 225 0C (8 min) |
Capillary | CP Sil 8 CB | 939. | Butkienë, Nivinskienë, et al., 2005 | 50. m/0.32 mm/0.25 μm, He; Program: 50C(5min) => 2C/min => 90C => 15C/min => 240C(4min) |
Capillary | DB-5 | 949.5 | Cysne, Canuto, et al., 2005 | 30. m/0.25 mm/0.25 μm, He; Program: 35C => 4C/min => 180C => 10C/min => 250C |
Capillary | HP-5MS | 938. | Deng, Yao, et al., 2005 | 30. m/0.25 mm/0.25 μm, He; Program: 50C => 8C/min => 200C => 10C/min => 270C (5min) |
Capillary | BP-5 | 934. | Eyres, Dufour, et al., 2005 | 25. m/0.32 mm/0.50 μm, Helium; Program: 60 0C 6 0C/min -> 210 0C 10 0C/min -> 290 0C (10 min) |
Capillary | BP-5 | 934. | Eyres, Dufour, et al., 2005 | 25. m/0.32 mm/0.50 μm, Helium; Program: not specified |
Capillary | DB-1 | 930. | Faleio, Miguel, et al., 2005 | 30. m/0.25 mm/0.25 μm, He; Program: 45C => 3C/min => 175C => 15C/min => 300C (10min) |
Capillary | DB-1 | 930. | Figueiredo, Sim-Sim, et al., 2005 | 30. m/0.25 mm/0.25 μm, He; Program: 45C => 3C/min => 175C => 15C/min => 300C (10min) |
Capillary | DB-5 | 942. | Hamm, Bleton, et al., 2005 | 30. m/0.25 mm/0.25 μm, He; Program: 40C(1min) => 9C/min => 130C => 2C/min => 230C |
Capillary | HP-5 | 942. | Himanen, Vuorinen, et al., 2005 | 50. m/0.2 mm/0.5 μm, He; Program: 40C(1min) => 5C/min => 210C => 20C/min => 250C(8min) |
Capillary | CP-Sil5 CB MS | 941. | Iraqi, Vermeulen, et al., 2005 | 50. m/0.32 mm/1.2 μm; Program: 36C(2min) => 20C/min => 85C => 1C/min => 145C => 3C/min => 250C(30min) |
Capillary | BPX-5 | 939. | Judzentiene and Mockute, 2005 | 30. m/0.25 mm/0.25 μm; Program: 60C(0.2min) => 3K/min => 186C => 10C/min => 240C (5min) |
Capillary | BPX-5 | 916. | Kordali, Kotan, et al., 2005 | 30. m/0.25 mm/0.25 μm, He; Program: 50C => 3C/min => 150C (10min) => 10C/min => 250C |
Capillary | BPX-5 | 939. | Koutsoudaki, Krsek, et al., 2005 | 30. m/0.32 mm/0.5 μm, He; Program: 60C(1min) => 3.5C/min => 180C => 20C/min => 280C(2min) |
Capillary | CP Sil 8 CB | 939. | Nivinskienë, Butkienë, et al., 2005 | 50. m/0.32 mm/0.25 μm, He; Program: 60C(1min) => 5C/min => 160C => 5C/min => 250C(3min) |
Capillary | HP-5MS | 940. | Novak, Draxler, et al., 2005 | 30. m/0.25 mm/0.25 μm; Program: 40C(5min) => 3C/min => 90C => 10C/min => 280C |
Capillary | DB-5 | 927. | de Oliveira, Dias, et al., 2005 | He; Column length: 30. m; Column diameter: 0.25 mm; Program: not specified |
Capillary | DB-1 | 937. | Omidbaigi and Bastan, 2005 | Program: not specified |
Capillary | BPX-5 | 919. | Özer, Sahín, et al., 2005 | 30. m/0.25 mm/0.25 μm, He; Program: 50C => 3C/min => 150C(10min) => 10C/min => 250C |
Capillary | Polydimethyl siloxane with 5 % Ph groups | 940. | Pino, Marbot, et al., 2005, 2 | Program: not specified |
Capillary | CP Sil 8 CB | 939. | Radudienë, Judpintienë, et al., 2005 | 50. m/0.32 mm/0.25 μm, He; Program: 60C(2min) => 5C/min => 160C(1min) => 10C/min => 250C (3min) |
Capillary | HP-5 | 941. | Singh, Maurya, et al., 2005 | Column length: 30. m; Column diameter: 0.32 mm; Program: 65C(1min) => 1C/min => 75C (2min) => 0.5C/min => 81C(2min) => 3C/min => 180C(7min) |
Capillary | DB-5 | 932. | Steinhaus and Schieberle, 2005 | 30. m/0.32 mm/0.25 μm, He; Program: 40 0C (2 min) 6 K/min -> 190 0C 12 K/min -> 240 0C |
Capillary | DB-1 | 930. | Touafek, Nacer, et al., 2005 | 30. m/0.25 mm/0.25 μm, He; Program: 45C => 3C/min => 175C => 15C/min => 300C (15min) |
Capillary | DB-5 | 924. | Albuquerque, Souza, et al., 2004 | 30. m/0.25 mm/0.1 μm, He; Program: 35C => 4C/min => 180C => 10C/min => 250C |
Capillary | DB-5 | 939. | de Andrade, Bezerra, et al., 2004 | 30. m/0.25 mm/0.25 μm, He; Program: 35C => 4C/min => 180C => 10C/min => 280C |
Capillary | DB-5 | 939. | Barros-Filho, Nunes, et al., 2004 | 30. m/0.25 mm/0.1 μm, He; Program: 35C => 4C/min => 180C => 20C/min => 280C |
Capillary | CP Sil 8 CB | 939. | Butkienë, Nivinskienë, et al., 2004 | 50. m/0.32 mm/0.25 μm, He; Program: 50C(5min) => 2C/min => 90C => 15C/min => 240C(4min) |
Capillary | DB-1 | 939. | Cavalcanti, de Morais, et al., 2004 | He; Column length: 30. m; Column diameter: 0.25 mm; Program: 35C => 4C/min => 180C => 10C/min => 250C |
Capillary | Methyl Silicone | 936. | Couladis, Özcan, et al., 2004 | Program: not specified |
Capillary | HP-5MS | 939. | Deng, Li, et al., 2004 | 30. m/0.25 mm/0.25 μm, He; Program: 60C => 10C/min => 160C => 12C/min => 300C (5min) |
Capillary | 924. | El-Shazily, Hafez, et al., 2004 | Program: not specified | |
Capillary | OV-1 | 924. | El-Shazly and Hussein, 2004 | He; Column length: 15. m; Column diameter: 0.317 mm; Program: 50C(4min) => 4C/min => 90C => 10C/min => 300C(10min) |
Capillary | HP-5 | 943. | Garcia-Estaban, Ansorena, et al., 2004 | 50. m/0.32 mm/1.05 μm; Program: 40C(10min) => 5C/min => 200C => 20C/min => 250C(5min) |
Capillary | DB-5 | 943. | Garcia-Estaban, Ansorena, et al., 2004, 2 | 50. m/0.32 mm/1.05 μm; Program: 40C(10min) => 5C/min => 200C => 20C/min => 250C (5min) |
Capillary | OV-1 | 924. | Hafez and Abdel-Salam, 2004 | 30. m/0.25 mm/0.25 μm, He; Program: 45 0C (4 min) 3 0C/min -> 75 0C 4 0C/min -> 115 0C 6 0C/min -> 312 0C |
Capillary | DB-5 | 942. | Hamm, Bleton, et al., 2004 | 30. m/0.25 mm/0.25 μm, He; Program: 40C(1min) => 9C/min => 130C => 2C/min => 230C |
Capillary | CP Sil 8 CB | 939. | Judpentienë and Mockutë, 2004 | He; Column length: 50. m; Column diameter: 0.32 mm; Program: 60C(2min) => 5C/min => 160C (1min) => 10C/min => 250C (2min) |
Capillary | CP Sil 8 CB | 939. | Judpentienë and Mockutë, 2004, 2 | 50. m/0.32 mm/0.25 μm, He; Program: 60C(2min) => 5C/min => 160C(1min) => 10C/min => 250C (5min) |
Capillary | DB-5 | 939. | Letchamo, Ward, et al., 2004 | 30. m/0.25 mm/0.25 μm, He; Program: 60C(4min) => 6C/min => 240 => 10C/min => 280C |
Capillary | DB-5 | 936. | Lo Cantore, Iacobellis, et al., 2004 | Program: not specified |
Capillary | DB-1 | 930. | Miguel, Simões, et al., 2004 | 30. m/0.25 mm/0.25 μm, He; Program: 45C => 3C/min => 175C => 15C/min => 300C (10min) |
Capillary | CP Sil 8 CB | 939. | Mockutë, Bernotienë, et al., 2004 | He; Column length: 50. m; Column diameter: 0.32 mm; Program: 50 0C (2 min) 3 0C/min -> 180 0C (1 min) 20 0C/min -> 250 0C (2 min) |
Capillary | CP Sil 8 CB | 939. | Mockutë, Judbentienë, et al., 2004 | 50. m/0.32 mm/0.25 μm, He; Program: 50C(2min) => 3C/min => 180C(1min) => 20C/min => 250C (2min) |
Capillary | MDN-5 | 938. | Moretti, Madonia, et al., 2004 | 30. m/0.25 mm/0.25 μm, Helium; Program: 30 0C (1 min) ballistically -> 60 0C 2 0C/min -> 120 0C 5 0C/min -> 280 0C (5 min) |
Capillary | HP-5 | 938. | Senatore, Apostolides Arnold, et al., 2004 | 30. m/0.25 mm/0.25 μm; Program: 40C(5min) => 2C/min => 250C(15min) => 10C/min => 270C |
Capillary | DB-1 | 939. | Silva, Matos, et al., 2004 | 30. m/0.25 mm/0.25 μm, Helium; Program: 35 0C 4 0C/min -> 180 0C 10 0C/min -> 250 0C |
Capillary | HP-5MS | 941. | Singh, Marimuthu, et al., 2004 | 30. m/0.25 mm/0.25 μm; Program: 60C(1min) => 1.5C/min => 185C(1min) => 9C/min => 275C(2min) |
Capillary | HP-5MS | 941. | Singh, Maurya, et al., 2004 | 30. m/0.25 mm/0.25 μm, He; Program: 60C(1min) => 0.5C/min => 85C(1min) => 1C/min => 105C (2min) => 10C/min => 275C(2min) |
Capillary | HP-5 | 949. | Sotomayor, Martínez, et al., 2004 | 30. m/0.25 mm/0.25 μm, He; Program: 60C(4min) => 1C/min => 64C => 2.5C/min => 155C => 5C/min => 250C |
Capillary | HP-5 | 939. | Tepe, Donmez, et al., 2004 | 30. m/0.25 mm/0.25 μm, He; Program: 50C (3min) => 3C/min => 150C (10min) => 10C/min => 250C |
Capillary | DB-1 | 930. | Touafek, Nacer, et al., 2004 | 30. m/0.25 mm/0.25 μm, He; Program: 45C => 3C/min => 175C => 15C/min => 300C (15min) |
Capillary | DB-5 | 939. | Vilaseca, Guy, et al., 2004 | Program: not specified |
Capillary | SE-30 | 932. | Vinogradov, 2004 | Program: not specified |
Capillary | SE-30 | 942. | Vinogradov, 2004 | Program: not specified |
Capillary | SE-54 | 933. | Buettner, Mestres, et al., 2003 | 30. m/0.32 mm/0.25 μm; Program: 35C (2min) => 40C/min => 50C (2min) => 6C/min => 180C => 10C/min => 230C (10min) |
Capillary | DB-1 | 930. | Faleiro, Miguel, et al., 2003 | 30. m/0.25 mm/0.25 μm, He; Program: 45C => 3C/min => 175C => 15C/min => 300C (10min) |
Capillary | HP-5 | 939. | Güllüce, Sökmen, et al., 2003 | 30. m/0.25 mm/0.25 μm, He; Program: 50C(3min) => 3C/min => 150C(10min) => 10 C/min => 250C |
Capillary | DB-5 | 942. | Hamm, Lesellier, et al., 2003 | 30. m/0.25 mm/0.25 μm, He; Program: 40C (1min) => 9C/min => 130C => 2C/min => 230C |
Capillary | HP-5 | 919. | Jordán, Margaría, et al., 2003 | 30. m/0.25 mm/0.25 μm; Program: 40C(6min) => 2.5C/min => 150C => 90C/min => 250C |
Capillary | HP-5 | 949. | Jordán, Martínez, et al., 2003 | 30. m/0.25 mm/0.25 μm, He; Program: 60C (4min) => 1C/min => 64C => 2.5C/min => 155C => 5C/min => 250C |
Capillary | CP-Sil 8CB-MS | 939. | Mockute, Bernotiene, et al., 2003 | Column length: 50. m; Column diameter: 0.32 mm; Program: 60C(1min) => 3C/min => 70C => 15C/min => 170C(8min) => 5C/min => 250C |
Capillary | CP Sil 8 CB | 939. | Mockute and Judzentiene, 2003, 2 | 50. m/0.32 mm/0.25 μm, He; Program: 70C(5min) => 3C/min => 100C (1min) => 25C/min => 250C (10min) |
Capillary | CP Sil 8 CB | 939. | Mockute, Nivinskiene, et al., 2003 | 50. m/0.32 mm/0.25 μm, He; Program: 60C(1min) => 5C/min => 160C => 10C/min => 250C(5min) |
Capillary | DB-1 | 927. | Silva, Matos, et al., 2003 | 30. m/0.25 mm/0.1 μm, He; Program: 35C => 4C/min => 180C => 10C/min => 250C |
Capillary | HP-5 | 941. | Singh, Singh, et al., 2003 | 30. m/0.25 mm/0.25 μm, He; Program: 60C(5min) => 1C/min => 140C => 10C/min => 270C(5min) |
Capillary | AT-5 | 939. | Usai, Atzei, et al., 2003 | 60. m/0.25 mm/0.25 μm, He; Program: 50 0C 5 0C/min -> 135 0C (1 min) 5 0C/min -> 225 0C (5 min) 5 0C/min -> 260 0C |
Capillary | DB-5 | 936.5 | Veres, Varga, et al., 2003 | 30. m/0.25 mm/0.25 μm, He; Program: 60C => 3C/min => 210C => 5C/min => 250C(2min) |
Capillary | HP-5 | 982. | Jordán, Margaría, et al., 2002 | 30. m/0.25 mm/0.25 μm; Program: 40C (6min) => 2.5C/min => 150C => 90C/min => 250C |
Capillary | SE-54 | 933. | Kilic, 2002 | Program: not specified |
Capillary | SE-30 | 939. | Li, Wu, et al., 2002 | He; Column length: 60. m; Column diameter: 0.25 mm; Program: 50 0C (5 min) 5 0C/min -> 165 0C 4 0C/min -> 230 0C |
Capillary | SE-30 | 937. | Li, Wu, et al., 2002 | He; Column length: 60. m; Column diameter: 0.25 mm; Program: not specified |
Capillary | CP Sil 8 CB | 939. | Mockute and Judzentiene, 2002 | He; Column length: 50. m; Column diameter: 0.32 mm; Program: 60C(2min) => 5C/min => 160C(1min) => 10C/min => 250C (2min) |
Capillary | CP Sil 8 CB | 939. | Mockute and Judzentiene, 2002, 2 | He; Column length: 50. m; Column diameter: 0.32 mm; Program: 60C(2min) => 5C/min => 160C(1min) => 10C/min => 250C(2min) |
Capillary | DB-5 | 939. | Morteza-Semnani and Vahedi, 2002 | Program: not specified |
Capillary | HP-1 | 931. | Nogueira and Romano, 2002 | 30. m/0.32 mm/0.25 μm, He; Program: 40C(3min) => 5C/min => 180C => 15C/min => 240C(15min) |
Capillary | DB-5 | 936. | Pessoa, Morais, et al., 2002 | 30. m/0.25 mm/0.1 μm, He; Program: 35C => 4C/min => 180C => 10C/min => 250C |
Capillary | DB-5MS | 939. | Phutdhawong, Korth, et al., 2002 | 30. m/0.32 mm/0.25 μm, He; Program: not specified |
Capillary | DB-5 | 939. | Viana, Andrade-Neto, et al., 2002 | 30. m/0.25 mm/0.1 μm, He; Program: 35C => 4C/min => 180C => 20C/min => 280C |
Capillary | DB-5 | 923. | Viana, Andrade-Neto, et al., 2002, 2 | 30. m/0.25 mm/0.25 μm, He; Program: 35C => 4C/min => 180C => 20C/min => 280C |
Capillary | HP-5MS | 931. | Ansorena, Gimeno, et al., 2001 | 30. m/0.25 mm/0.25 μm, He; Program: 40C (10min) => 3C/min => 120C => 10C/min => 250C (5min) |
Capillary | HP-5 | 930. | Aparicio, Romero, et al., 2001 | 30. m/0.25 mm/0.25 μm; Program: not specified |
Capillary | CP Sil 8 CB | 937. | Duckham, Dodson, et al., 2001 | 60. m/0.25 mm/0.25 μm; Program: not specified |
Capillary | DB-5 | 924. | Ferreira, Costantin, et al., 2001 | Program: not specified |
Capillary | DB-1 | 930. | Figueiredo, Miguel, et al., 2001 | 30. m/0.25 mm/0.25 μm; Program: 45 0C 3 K/min -> 175 0C 15 K/min -> 300 0C (10 min) |
Capillary | DB-5 MS | 951. | Luo and Agnew, 2001 | 30. m/0.25 mm/1.0 μm, Helium; Program: not specified |
Capillary | CBP-1 | 928. | Ly, Yamauchi, et al., 2001 | 25. m/0.25 mm/0.25 μm, Nitrogen; Program: not specified |
Capillary | DB-5 | 936. | Petrakis, Tsitsimpikou, et al., 2001 | Program: not specified |
Capillary | BPX-5 | 977. | van Ruth, Grossmann, et al., 2001 | 60. m/0.32 mm/1. μm, He; Program: -30C(1min) => 100C/min => 40C(4min) => 2C/min => 90C => 4C/min => 130C => 8C/min => 250C |
Capillary | HP-5 MS | 942. | Shang, Hu, et al., 2001 | 30. m/0.25 mm/0.25 μm, Helium; Program: not specified |
Capillary | HP-5 | 926. | Usubillaga, Aparicio, et al., 2001 | 30. m/0.25 mm/0.25 μm, He; Program: 50 0C 3 K/min -> 200 0C 8 K/min -> 280 0C |
Capillary | OV-101 | 937. | Yang, 2001 | N2; Column length: 50. m; Column diameter: 0.25 mm; Program: not specified |
Capillary | DB-5 | 941. | Andrade, Maia, et al., 2000 | 30. m/0.25 mm/0.25 μm, He; Program: 40C => 2C/min => 60C => 4C/min => 260C |
Capillary | HP-5 | 930. | Ansorena, Astiasarán, et al., 2000 | 30. m/0.25 mm/0.25 μm, He; Program: 40C (10min) => 3C/min => 120C => 10C/min => 250C (5min) |
Capillary | HP-1 | 923. | Betts, 2000 | 12. m/0.20 mm/0.33 μm, He; Program: 40 0C 6.7 0C/min -> 87 0C (9 min) 10 0C/min -> 187 0C |
Capillary | DB-1 | 930. | Dorman, Figueiredo, et al., 2000 | 30. m/0.25 mm/0.25 μm, H2; Program: 40 0C 3 K/min -> 175 0C 15 K/min -> 240 0C (10 min) |
Capillary | CBP-1 | 939. | Juliani, Biurrun, et al., 2000 | Program: not specified |
Capillary | BP-1 | 930. | Muselli, Bighelli, et al., 2000 | 50. m/0.22 mm/0.25 μm; Program: not specified |
Capillary | DB-1 | 930. | da Silva, Pedro, et al., 2000 | 30. m/0.25 mm/0.25 μm, H2; Program: 40 0C 3 K/min -> 175 0C 15 K/min -> 240 0C (10 min) |
Capillary | AT-5 | 943.5 | Velásquez, Toro, et al., 2000 | 60. m/0.25 mm/0.25 μm; Program: 60C(1min) => 4C/min => 200C=10C/min => 280C(20min) |
Capillary | DB-1 | 930. | Pedro, da Silva, et al., 1999 | 30. m/0.25 mm/0.25 μm, He; Program: 45C => 3C/min => 170C => 15C/min => 300C(10min) |
Capillary | SE-30 | 942. | Prikhod'ko, Klyuev, et al., 1999 | 30. m/0.25 mm/0.20 μm, Helium; Program: not specified |
Capillary | DB-1 | 930. | Santos, Figueiredo, et al., 1999 | 30. m/0.25 mm/0.25 μm, He; Program: 45C => 3C/min => 175C => 15C/min => 300C(10min) |
Capillary | CP Sil 5 CB | 935. | Weyerstahl, Marschall, et al., 1999, 3 | Column length: 25. m; Column diameter: 0.39 mm; Program: not specified |
Capillary | DB-1 | 934. | Yen and Lin, 1999 | 60. m/0.32 mm/0.25 μm, N2; Program: 40 0C (10 min) 40 - 80 0C at 2 0C/min 80 - 200 0C at 5 0C/min 200 0C (10 min) |
Capillary | DB-1 | 930. | Baratta, Dorman, et al., 1998 | 30. m/0.25 mm/0.25 μm, He; Program: 45C => 3C/min => 175C => 15C/min => 240C (10min) |
Capillary | CP Sil 5 CB | 942. | Guyot, Bouseta, et al., 1998 | 50. m/0.32 mm/1.2 μm, He; Program: 30C => 55C/min => 85C => 1C/min => 145C => 3C/min => 250C |
Capillary | OV-1 | 932. | Kökdil, 1998 | 50. m/0.32 mm/0.25 μm, He; Program: 1)50C(1min) => 4C/min => 180C => 2C/min => 250C(10min) 2)50C(1min) => 6C/min => 200C => 12C/min => 250C(5min) |
Capillary | DB-5 | 937. | Pichette, Garneau, et al., 1998 | Column length: 30. m; Column diameter: 0.25 mm; Program: 60 0C (2 min) 2 0C/min -> 140 0C 1 0C/min -> 190 0C 2 0C/min -> 210 0C (28 min) |
Capillary | DB-5 | 941. | Sanda, Koba, et al., 1998 | 30. m/0.25 mm/0.25 μm, N2; Program: 45C(5min) => 2C/min => 200C => 5C/min => 250C |
Capillary | DB-1 | 930. | da Silva, Figueiredo, et al., 1998 | 30. m/0.25 mm/0.25 μm, H2; Program: 45C => 3C/min => 175C => 15C => 240C(10min) |
Capillary | CP Sil 5 CB | 943. | Weyerstahl, Marschall, et al., 1998 | N2; Column length: 25. m; Phase thickness: 0.39 μm; Program: not specified |
Capillary | DB-5 | 932. | Yusuf, Begum, et al., 1998 | 30. m/0.25 mm/0.25 μm, He; Program: 60C => 3C/min => 240C => 30C/min => 300C |
Capillary | DB-5 | 936. | Anitescu, Doneanu, et al., 1997 | 15. m/0.25 mm/0.25 μm, He; Program: 40C(5min) => 5C/min => 120C(10min) => 4C/min => 250C(4min) => 5C/min => 280C |
Capillary | DB-1 | 930. | Figueiredo, Barroso, et al., 1997 | 30. m/0.25 mm/0.25 μm, H2; Program: 45C => 3C/min => 175C => 15C/min => 240C(10min) |
Capillary | SPB-1 | 950. | Flanagan, Streete, et al., 1997 | 60. m/0.53 mm/5. μm, He; Program: 40C(6min) => 5C/min => 80C => 10C/min => 200C |
Capillary | DB-1 | 930. | Gaspar, Palma, et al., 1997 | 30. m/0.25 mm/0.25 μm, He; Program: 45C => 3C/min => 175C => 15C/min => 280C |
Capillary | DB-5 | 939. | Isidorov, Zenkevich, et al., 1997 | Program: not specified |
Capillary | SPB-Sulfur | 932. | Mariaca, Berger, et al., 1997 | 30. m/0.32 mm/4. μm, He; Program: not specified |
Capillary | CP Sil 5 CB | 936. | Weyerstahl, Marschall, et al., 1997 | N2; Column length: 25. m; Program: not specified |
Capillary | CP Sil 5 CB | 939. | Weyerstahl, Marschall, et al., 1997, 2 | N2; Column length: 30. m; Column diameter: 0.25 mm; Program: not specified |
Capillary | DB-1 | 930. | Barroso, Figueiredo, et al., 1996 | 30. m/0.25 mm/0.25 μm, H2; Program: 45 0C 3 0C/min -> 175 0C 15 0C/min -> 240 0C (10 min) |
Capillary | HP-1 | 932. | Dung, Thanh, et al., 1996 | 24. m/0.32 mm/0.25 μm; Program: 60C(2min) => 4C/min => 120C => 2C/min => 220C (20min) |
Capillary | DB-5 | 948. | Mateo and Zumalacárregui, 1996 | 50. m/0.32 mm/0.25 μm, He; Program: 40C (10min) => 3C/min => 95C => 10C/min => 270C (10min) |
Capillary | DB-5 | 946. | Mateo and Zumalacárregui, 1996 | 50. m/0.32 mm/0.25 μm, He; Program: 40C (10min) => 3C/min => 95C => 10C/min => 270C (10min) |
Capillary | Methyl Silicone | 930. | Zenkevich, 1996 | Program: not specified |
Capillary | 5 % Phenyl methyl siloxane | 945. | Sagrero-Nieves and Bartley, 1995 | Program: not specified |
Capillary | DB-1 | 928. | Ciccioli, Cecinato, et al., 1994 | 60. m/0.32 mm/0.25 μm; Program: not specified |
Capillary | DB-1 | 928. | Ciccioli, Brancaleoni, et al., 1993 | 60. m/0.32 mm/0.25 μm; Program: 3 min at 5 C; 5 - 50 C at 3 deg/min; 50 - 220 C at 5 deg/min |
Capillary | SPB-1 | 950. | Strete, Ruprah, et al., 1992 | 60. m/0.53 mm/5.0 μm, Helium; Program: 40 0C (6 min) 5 0C/min -> 80 0C 10 0C/min -> 200 0C |
Capillary | SPB-1 | 942. | Strete, Ruprah, et al., 1992 | 60. m/0.53 mm/5.0 μm, Helium; Program: not specified |
Capillary | OV-101 | 930. | De Pooter, Vermeesch, et al., 1989 | Program: not specified |
Capillary | OV-101 | 930. | De Pooter, Vermeesch, et al., 1989 | Program: not specified |
Capillary | DB-1 | 932. | MacLeod and Snyder, 1988 | Program: not specified |
Capillary | methyl silicone oil with 5% Igepal | 927. | Schultz, Flath, et al., 1988 | Column length: 150. m; Column diameter: 0.75 mm; Program: not specified |
Capillary | methyl silicone oil with 5% Igepal | 929. | Schultz, Flath, et al., 1988 | Column length: 150. m; Column diameter: 0.75 mm; Program: not specified |
Capillary | DB-1 | 929. | Takeoka, Flath, et al., 1988 | 30. m/0.25 mm/0.25 μm, H2; Program: 30C (2min) => 2C/min => 150C => 4C/min => 250C |
Capillary | DB-1 | 931. | Takeoka, Flath, et al., 1988 | 30. m/0.25 mm/0.25 μm, H2; Program: 30C (2min) => 2C/min => 150C => 4C/min => 250C |
Capillary | OV-1 | 928. | De Pooter and Schamp, 1987 | 35. m/0.50 mm/1.5 μm; Program: not specified |
Capillary | OV-1 | 967. | De Pooter and Schamp, 1987 | 35. m/0.50 mm/1.5 μm; Program: not specified |
Capillary | OV-101 | 940. | Shibamoto, 1987 | Column length: 60. m; Column diameter: 0.25 mm; Program: not specified |
Capillary | OV-101 | 942. | Shibamoto, 1987 | Program: not specified |
Capillary | OV-1 | 942. | Ramsey and Flanagan, 1982 | Program: not specified |
Packed | OV-101 | 932. | Swigar and Silverstein, 1981 | N2, Chromosorb G 60-80mesh DMCS; Column length: 2.5 m; Program: not specified |

Normal alkane RI, polar column, temperature ramp

Column type | Active phase | I | Reference | Comment |
---|---|---|---|---|
Capillary | RTX-Wax | 1016. | Bendiabdellah, El Amine Dib, et al., 2012 | 60. m/0.22 mm/0.25 μm, Helium, 2. K/min, 230. C @ 5. min; Tstart: 60. C |
Capillary | BP-20 | 1022. | Yapi, Boti, et al., 2012 | 50. m/0.22 mm/0.25 μm, Helium, 2. K/min, 220. C @ 20. min; Tstart: 60. C |
Capillary | HP-Innowax | 1037. | Feng, Cui, et al., 2011 | 60. m/0.25 mm/0.25 μm, Helium, 60. C @ 1. min, 5. K/min, 220. C @ 5. min |
Capillary | HP-Innowax | 1032. | Menichini, Tundis, et al., 2011 | 30. m/0.25 mm/0.25 μm, Helium, 50. C @ 5. min, 5. K/min, 250. C @ 10. min |
Capillary | CP-Wax 52 CB | 1018. | Tsai, Huang, et al., 2011 | 60. m/0.25 mm/0.25 μm, Helium, 3. K/min; Tstart: 40. C; Tend: 220. C |
Capillary | DB-Wax | 1043. | Zeng, Xie, et al., 2011 | 30. m/0.25 mm/0.25 μm, Helium, 40. C @ 2. min, 4. K/min, 230. C @ 4.5 min |
Capillary | RTX-Wax | 1015. | Dib, Djabou, et al., 2010 | 60. m/0.22 mm/0.25 μm, Helium, 2. K/min, 230. C @ 30. min; Tstart: 60. C |
Capillary | BP-20 | 1022. | Mishra, Chaudhary, et al., 2010 | Nitrogen, 5. K/min; Tstart: 60. C; Tend: 200. C |
Capillary | Supelcowax-10 | 1030. | Neves, Rosa, et al., 2010 | 30. m/0.20 mm/0.20 μm, Helium, 3. K/min, 220. C @ 15. min; Tstart: 70. C |
Capillary | DB-Wax | 1029. | Vahirua-Lechat, Mitermite, et al., 2010 | 30. m/0.25 mm/0.25 μm, Helium, 3. K/min, 240. C @ 2. min; Tstart: 80. C |
Capillary | Supelcowax | 1022. | Gauvin-Bialecki and Marodon, 2009 | 60. m/0.35 mm/0.25 μm, Nitrogen, 4. K/min, 230. C @ 40. min; Tstart: 60. C |
Capillary | DB-Wax | 1017. | Karlsson, Birgersson, et al., 2009 | 30. m/0.25 mm/0.25 μm, Hydrogen, 30. C @ 5. min, 8. K/min, 230. C @ 10. min |
Capillary | RTX-Wax | 1008. | Museli, Pau, et al., 2009 | 60. m/0.22 mm/0.25 μm, Helium, 2. K/min, 230. C @ 30. min; Tstart: 60. C |
Capillary | DB-Wax | 1030. | Rochat, Egger, et al., 2009 | 30. m/0.25 mm/0.25 μm, Helium, 60. C @ 3. min, 8. K/min, 200. C @ 9.5 min |
Capillary | DB-Wax | 1035. | Rochat, Egger, et al., 2009 | 30. m/0.25 mm/0.25 μm, Helium, 60. C @ 3. min, 8. K/min, 200. C @ 9.5 min |
Capillary | DB-Wax | 1050. | Rochat, Egger, et al., 2009 | 30. m/0.25 mm/0.25 μm, Helium, 60. C @ 3. min, 8. K/min, 200. C @ 9.5 min |
Capillary | DB-Wax | 1050. | Rochat, Egger, et al., 2009 | 30. m/0.25 mm/0.25 μm, Helium, 60. C @ 3. min, 8. K/min, 200. C @ 9.5 min |
Capillary | DB-Wax | 1052. | Rochat, Egger, et al., 2009 | 30. m/0.25 mm/0.25 μm, Helium, 60. C @ 3. min, 8. K/min, 200. C @ 9.5 min |
Capillary | Innowax | 1021. | Seo, Kim, et al., 2009 | 30. m/0.25 mm/0.25 μm, Helium, 40. C @ 1. min, 6. K/min, 250. C @ 4. min |
Capillary | DB-Wax | 1027. | Shimizu, Imayoshi, et al., 2009 | 60. m/0.25 mm/0.25 μm, Helium, 50. C @ 2. min, 3. K/min, 220. C @ 70. min |
Capillary | DB-Wax | 1035. | Shimizu, Imayoshi, et al., 2009 | 60. m/0.25 mm/0.25 μm, Helium, 50. C @ 2. min, 3. K/min, 220. C @ 70. min |
Capillary | HP-Innowax | 1032. | Wannes, Mhamdi, et al., 2009 | 30. m/0.25 mm/0.52 μm, Nitrogen, 35. C @ 10. min, 3. K/min, 205. C @ 10. min |
Capillary | DB-Wax | 1016. | Beck, Higbee, et al., 2008 | 60. m/0.32 mm/0.25 μm, Helium, 30. C @ 4. min, 2. K/min, 200. C @ 30. min |
Capillary | DB-Wax | 1020. | Beck, Higbee, et al., 2008 | 60. m/0.32 mm/0.25 μm, Helium, 30. C @ 4. min, 2. K/min, 200. C @ 30. min |
Capillary | HP-20M | 1034. | Blazevic and Mastelic, 2008 | 50. m/0.25 mm/0.25 μm, Helium, 70. C @ 4. min, 4. K/min; Tend: 180. C |
Capillary | HP-20M | 1038. | Blazevic and Mastelic, 2008 | 50. m/0.25 mm/0.25 μm, Helium, 70. C @ 4. min, 4. K/min; Tend: 180. C |
Capillary | HP-Innowax | 1026. | Cheraif, Ben Jannet, et al., 2007 | 30. m/0.25 mm/0.25 μm, N2, 50. C @ 1. min, 5. K/min, 240. C @ 4. min |
Capillary | CP-Wax 52CB | 1035. | Chyau, Tsai, et al., 2007 | 60. m/0.25 mm/0.25 μm, He, 3. K/min; Tstart: 40. C; Tend: 220. C |
Capillary | Carbowax | 1023. | Ferhat, Meklati, et al., 2007 | 60. m/0.2 mm/0.25 μm, He, 60. C @ 8. min, 2. K/min, 250. C @ 15. min |
Capillary | PEG-20M | 1042. | Gil A., Van Baren C.M., et al., 2007 | 60. m/0.25 mm/0.25 μm, He, 3. K/min, 225. C @ 15. min; Tstart: 90. C |
Capillary | HP-Innowax | 1025. | Hachicha, Skanji, et al., 2007 | 30. m/0.25 mm/0.25 μm, He, 2. K/min, 240. C @ 20. min; Tstart: 60. C |
Capillary | CP-Wax 52CB | 1027. | Hymete, Rohloff, et al., 2007 | 30. m/0.32 mm/0.25 μm, He, 40. C @ 1. min, 3. K/min, 220. C @ 2. min |
Capillary | TC-FFAP | 1033. | Kurose, Okamura, et al., 2007 | He, 3. K/min, 220. C @ 30. min; Column diameter: 0.25 mm; Phase thickness: 0.25 μm; Tstart: 60. C |
Capillary | TC-FFAP | 1032. | Kurose, Okamura, et al., 2007 | He, 3. K/min, 220. C @ 30. min; Column diameter: 0.25 mm; Phase thickness: 0.25 μm; Tstart: 60. C |
Capillary | Carbowax 20M | 1014. | Limberger, Scopel, et al., 2007 | 30. m/0.25 mm/0.25 μm, He, 3. K/min; Tstart: 60. C; Tend: 230. C |
Capillary | FFAP | 1017. | Nebesny, Budryn, et al., 2007 | 30. m/0.32 mm/0.5 μm, N2, 35. C @ 5. min, 4. K/min, 320. C @ 45. min |
Capillary | DB-Wax | 1012. | Pala-Paul, Brophy, et al., 2007 | 60. m/0.32 mm/0.25 μm, He, 4. K/min; Tstart: 70. C; Tend: 220. C |
Capillary | Supelcowax-10 | 1030. | Pinto, Salgueiro, et al., 2007 | 30. m/0.2 mm/0.2 μm, He, 3. K/min, 220. C @ 15. min; Tstart: 70. C |
Capillary | CP-Wax 52CB | 1027. | Povolo, Contarini, et al., 2007 | 60. m/0.32 mm/0.5 μm, He, 40. C @ 8. min, 4. K/min, 220. C @ 20. min |
Capillary | Supelcowax-10 | 1024. | Raal, Orav, et al., 2007 | 30. m/0.25 mm/0.25 μm, He, 2. K/min; Tstart: 50. C; Tend: 250. C |
Capillary | Carbowax | 1025. | Singh, Kumar, et al., 2007 | 60. m/0.25 mm/0.25 μm, He, 5. K/min; Tstart: 40. C; Tend: 180. C |
Capillary | Supelcowax-10 | 1024. | Sylvestre, Longtin, et al., 2007 | 30. m/0.25 mm/0.25 μm, 2. K/min, 210. C @ 33. min; Tstart: 40. C |
Capillary | Supelcowax-10 | 1024. | Sylvestre, Pichette, et al., 2007 | 30. m/0.25 mm/0.25 μm, 2. K/min, 250. C @ 33. min; Tstart: 40. C |
Capillary | Supelcowax-10 | 1017. | Vichi, Riu-Aumatell, et al., 2007 | 30. m/0.25 mm/0.25 μm, He, 40. C @ 5. min, 3. K/min, 250. C @ 10. min |
Capillary | DB-Wax | 1021. | Wei A. and Shibamoto T., 2007 | 60. m/0.25 mm/0.25 μm, He, 60. C @ 8. min, 3. K/min, 180. C @ 80. min |
Capillary | DB-FFAP | 1016. | Zeller and Rychlik, 2007 | 30. m/0.32 mm/0.25 μm, He, 40. C @ 1. min, 6. K/min; Tend: 230. C |
Capillary | Innowax | 1025. | Abdelwahed, Hayder, et al., 2006 | 30. m/0.25 mm/0.25 μm, N2, 50. C @ 3. min, 9. K/min, 280. C @ 3. min |
Capillary | Innowax | 1032. | Abdelwahed, Hayder, et al., 2006 | 30. m/0.25 mm/0.25 μm, N2, 50. C @ 3. min, 9. K/min, 280. C @ 3. min |
Capillary | AT-Wax | 1042. | Borges, Rojas, et al., 2006 | 60. m/0.25 mm/0.25 μm, He, 4. K/min, 200. C @ 20. min; Tstart: 60. C |
Capillary | BP-20 | 1026. | Boti, Yao, et al., 2006 | 50. m/0.22 mm/0.25 μm, 2. K/min, 220. C @ 20. min; Tstart: 60. C |
Capillary | Supelcowax 10 | 1030. | Cavaleiro, Pinto, et al., 2006 | 30. m/0.20 mm/0.20 μm, Helium, 3. K/min, 220. C @ 15. min; Tstart: 70. C |
Capillary | DB-Wax | 1035. | Choi H.S., 2006 | 60. m/0.25 mm/0.25 μm, He, 70. C @ 2. min, 2. K/min, 230. C @ 20. min |
Capillary | DB-Wax | 1034. | Choi, 2006 | 60. m/0.25 mm/0.25 μm, N2, 70. C @ 2. min, 2. K/min, 230. C @ 20. min |
Capillary | BP-20 | 1022. | Fanciullino, Tomi, et al., 2006 | 50. m/0.22 mm/0.25 μm, He, 2. K/min, 220. C @ 20. min; Tstart: 60. C |
Capillary | HP-20M | 1002. | Filippi, Lanfranchi, et al., 2006 | 50. m/0.2 mm/0.1 μm, He, 2. K/min, 220. C @ 30. min; Tstart: 60. C |
Capillary | Supelcowax-10 | 1024. | Garneau F.X., Collin G., et al., 2006 | 30. m/0.25 mm/0.25 μm, 40. C @ 2. min, 2. K/min, 210. C @ 33. min |
Capillary | CP-Wax 52CB | 1020. | Hymete, Rohloff, et al., 2006 | 30. m/0.32 mm/0.25 μm, He, 60. C @ 7. min, 3.3 K/min, 220. C @ 3. min |
Capillary | FFAP | 1045. | Kitchlu, Bakshi, et al., 2006 | 20. m/0.25 mm/0.25 μm, He, 6. K/min; Tstart: 90. C; Tend: 250. C |
Capillary | DB-Wax | 1031. | Lan Phi N.T., Nishiyama C., et al., 2006 | 60. m/0.25 mm/0.25 μm, 70. C @ 2. min, 2. K/min, 230. C @ 20. min |
Capillary | Supelcowax | 1038. | Martin, Joseph, et al., 2006 | 30. m/0.32 mm/0.25 μm, N2, 5. K/min; Tstart: 50. C; Tend: 200. C |
Capillary | HP-Wax | 1033. | Marzouk, Mansour, et al., 2006 | 30. m/0.25 mm/0.25 μm, Nitrogen, 5. K/min, 280. C @ 5. min; Tstart: 50. C |
Capillary | HP-20M | 1033. | Marzouk, Neffati, et al., 2006 | 30. m/0.25 mm/0.25 μm, N2, 5. K/min, 250. C @ 10. min; Tstart: 50. C |
Capillary | HP-20M | 1038. | Mastelic, Jerkovic, et al., 2006 | 50. m/0.2 mm/0.2 μm, He, 70. C @ 4. min, 4. K/min, 180. C @ 15. min |
Capillary | DB-Innowax | 1039. | Mendivil, Rodrigues, et al., 2006 | 60. m/0.25 mm/0.25 μm, Helium, 3. K/min, 240. C @ 20. min; Tstart: 60. C |
Capillary | NB-20M | 1015. | Orav, Raal, et al., 2006 | 30. m/0.2 mm/0.25 μm, He, 2. K/min; Tstart: 50. C; Tend: 250. C |
Capillary | DB-Wax | 1033. | Sawamura, Onishi, et al., 2006 | 60. m/0.25 mm/0.25 μm, 70. C @ 2. min, 2. K/min, 230. C @ 20. min |
Capillary | Carbowax-PEG | 1039. | Tigrine-Kordiani, Meklati, et al., 2006 | 60. m/0.20 mm/0.25 μm, Helium, 60. C @ 8. min, 2. K/min, 250. C @ 15. min |
Capillary | Supelcowax-10 | 1026. | Wong, Lim, et al., 2006 | 30. m/0.25 mm/0.25 μm, He, 50. C @ 1. min, 4. K/min, 220. C @ 10. min |
Capillary | Supelcowax-10 | 1013. | Wong, Sivasothy, et al., 2006 | 30. m/0.25 mm/0.25 μm, He, 50. C @ 1. min, 4. K/min, 250. C @ 10. min |
Capillary | Carbowax 20M | 1039. | Babu and Kaul, 2005 | 60. m/0.25 mm/0.25 μm, N2, 40. C @ 2. min, 10. K/min, 190. C @ 15. min |
Capillary | Innowax | 1010. | Bendimerad and Bendiab, 2005 | 50. m/0.2 mm/0.5 μm, He, 2. K/min, 250. C @ 60. min; Tstart: 60. C |
Capillary | HP-20M | 1038. | Bezic, Skocibusic, et al., 2005 | 50. m/0.20 mm/0.20 μm, Helium, 70. C @ 4. min, 4. K/min, 250. C @ 10. min |
Capillary | DB-Wax | 1013. | Fakhari A.R., Sonboli A., et al., 2005 | 30. m/0.25 mm/0.25 μm, N2, 5. K/min, 250. C @ 10. min; Tstart: 60. C |
Capillary | Carbowax 20M | 1019. | Fernandez, Lizzani-Cuvelier, et al., 2005 | 50. m/0.2 mm/0.25 μm, 60. C @ 60. min, 2. K/min; Tend: 250. C |
Capillary | HP-Innowax | 1039. | Ferretti, Maggi, et al., 2005 | 30. m/0.25 mm/0.17 μm, He, 60. C @ 3. min, 4. K/min, 210. C @ 15. min |
Capillary | Supelcowax | 1016. | Gauvin and Smadja, 2005 | 60. m/0.2 mm/0.2 μm, He, 60. C @ 30. min, 4. K/min; Tend: 230. C |
Capillary | Stabilwax | 1031. | Jirovetz, Buchbauer, et al., 2005, 2 | 30. m/0.32 mm/0.5 μm, H2, 40. C @ 5. min, 6. K/min, 280. C @ 5. min |
Capillary | Stabilwax | 1007. | Jirovetz, Buchbauer, et al., 2005, 3 | 30. m/0.32 mm/0.5 μm, 40. C @ 5. min, 6. K/min, 280. C @ 5. min |
Capillary | HP-20M | 1038. | Kulisic, Radonic, et al., 2005 | 50. m/0.20 mm/0.20 μm, Helium, 70. C @ 4. min, 4. K/min, 180. C @ 10. min |
Capillary | HP-20M | 1038. | Kulisic, Radonic, et al., 2005 | 50. m/0.20 mm/0.20 μm, Helium, 70. C @ 4. min, 4. K/min, 180. C @ 10. min |
Capillary | DB-Wax | 1021. | Njoroge, Koaze, et al., 2005, 2 | 60. m/0.25 mm/0.25 μm, N2, 70. C @ 2. min, 2. K/min, 230. C @ 20. min |
Capillary | DB-Wax | 1021. | Njoroge, Koaze, et al., 2005, 3 | 60. m/0.25 mm/0.25 μm, N2, 70. C @ 2. min, 2. K/min, 230. C @ 20. min |
Capillary | DB-Wax | 1012. | Palá-Paúl, Pérez-Alonso, et al., 2005 | 60. m/0.32 mm/0.25 μm, He, 3. K/min; Tstart: 35. C; Tend: 220. C |
Capillary | DB-Wax | 1029. | Qian and Wang, 2005 | 60. m/0.32 mm/0.50 μm, Nitrogen, 35. C @ 4. min, 2. K/min, 235. C @ 30. min |
Capillary | CP-Wax 52CB | 1021. | Rohloff and Bones, 2005 | 30. m/0.32 mm/0.25 μm, He, 40. C @ 1. min, 4. K/min; Tend: 220. C |
Capillary | DB-Wax | 1014. | Salehi, Sonboli, et al., 2005 | 30. m/0.25 mm/0.25 μm, He, 4. K/min, 250. C @ 10. min; Tstart: 40. C |
Capillary | Supelcowax-10 | 1011. | Stevanovic, Garneau, et al., 2005 | 30. m/0.25 mm/0.25 μm, 40. C @ 2. min, 2. K/min, 210. C @ 33. min |
Capillary | Supelcowax-10 | 1017. | Vichi, Riu-Aumatell, et al., 2005 | 30. m/0.25 mm/0.25 μm, 40. C @ 5. min, 3. K/min, 220. C @ 10. min |
Capillary | Supelcowax-10 | 1019. | Wong, Lee, et al., 2005 | 30. m/0.25 mm/0.25 μm, He, 50. C @ 3. min, 4. K/min, 220. C @ 30. min |
Capillary | ZB-Wax | 1012. | N/A | 30. m/0.32 mm/0.25 μm, Helium, 40. C @ 2. min, 5. K/min, 250. C @ 5. min |
Capillary | DB-Wax | 1046. | Agnihotri, Thappa, et al., 2004 | 30. m/0.25 mm/0.25 μm, He, 90. C @ 2. min, 7. K/min, 220. C @ 5. min |
Capillary | BP-20 | 1021. | Blanc, Muselli, et al., 2004 | 50. m/0.22 mm/0.25 μm, 2. K/min, 220. C @ 20. min; Tstart: 60. C |
Capillary | DB-Wax | 1042. | Chida, Sone, et al., 2004 | 60. m/0.25 mm/0.5 μm, 35. C @ 5. min, 4. K/min, 240. C @ 10. min |
Capillary | DB-Wax | 1036. | Choi, 2004 | 60. m/0.25 mm/0.25 μm, N2, 70. C @ 2. min, 2. K/min, 230. C @ 20. min |
Capillary | DB-Wax | 1048. | Choi, 2004, 2 | 60. m/0.25 mm/0.25 μm, N2, 70. C @ 2. min, 2. K/min, 230. C @ 20. min |
Capillary | Supelcowax-10 | 1015. | Gauvin, Ravaomanarivo, et al., 2004 | 60. m/0.2 mm/0.2 μm, He, 4. K/min, 200. C @ 40. min; Tstart: 60. C |
Capillary | DB-Wax | 1025. | Jiang and Kubota, 2004 | He, 60. C @ 4. min, 2. K/min; Column length: 60. m; Column diameter: 0.25 mm; Tend: 220. C |
Capillary | DB-Wax | 1025. | Jiang and Kubota, 2004 | He, 60. C @ 4. min, 2. K/min; Column length: 60. m; Column diameter: 0.25 mm; Tend: 220. C |
Capillary | Supelcowax-10 | 1025. | Lopez Arze, Collin, et al., 2004 | 30. m/0.25 mm/0.25 μm, 40. C @ 2. min, 2. K/min, 210. C @ 33. min |
Capillary | Innowax FSC | 1032. | Lourens, Reddy, et al., 2004 | Helium, 60. C @ 10. min, 4. K/min; Column length: 60. m; Column diameter: 0.25 mm; Tend: 220. C |
Capillary | Supelcowax-10 | 1028. | Orav, Stulova, et al., 2004 | 50. m/0.2 mm/0.25 μm, He, 2. K/min; Tstart: 70. C; Tend: 230. C |
Capillary | Supelcowax-10 | 1029. | Orav, Stulova, et al., 2004 | 50. m/0.2 mm/0.25 μm, He, 2. K/min; Tstart: 70. C; Tend: 230. C |
Capillary | DB-Wax | 1014. | Palá-Paúl, Brophy, et al., 2004 | 60. m/0.32 mm/0.25 μm, He, 3. K/min; Tstart: 35. C; Tend: 220. C |
Capillary | Innowax | 1071. | Palá-Paúl, García-Jiménez, et al., 2004 | 50. m/0.2 mm/0.2 μm, He, 4. K/min; Tstart: 70. C; Tend: 220. C |
Capillary | NB-20M | 1019. | Raal, Arak, et al., 2004 | 50. m/0.2 mm/0.25 μm, He, 2. K/min; Tstart: 50. C; Tend: 250. C |
Capillary | SW-10 | 1027. | Raal, Paaver, et al., 2004 | 50. m/0.20 mm/0.25 μm, He, 2. K/min; Tstart: 50. C; Tend: 230. C |
Capillary | DB-Wax | 1027. | Sawamura, Son, et al., 2004 | 60. m/0.25 mm/0.25 μm, 70. C @ 2. min, 2. K/min, 230. C @ 20. min |
Capillary | DB-Wax | 1027. | Sawamura, Sou, et al., 2004 | 60. m/0.25 mm/0.25 μm, Nitrogen, 70. C @ 2. min, 2. K/min; Tend: 230. C |
Capillary | HP-Wax | 1029. | Bertoli, Menichini, et al., 2003 | 30. m/0.25 mm/0.25 μm, N2, 60. C @ 10. min, 5. K/min; Tend: 220. C |
Capillary | Supelcowax-10 | 1028. | Cabanillas, Lopez, et al., 2003 | 30. m/0.25 mm/0.25 μm, He, 4. K/min; Tstart: 60. C; Tend: 240. C |
Capillary | BP-20 | 1038. | Dunlop, Bignell, et al., 2003 | 25. m/0.33 mm/0.5 μm, H2, 5. K/min; Tstart: 80. C; Tend: 220. C |
Capillary | HP-20M | 1033. | Juteau, Jerkovic, et al., 2003 | 50. m/0.2 mm/0.2 μm, He, 70. C @ 4. min, 4. K/min, 180. C @ 10. min |
Capillary | HP-20M | 1038. | Mastelic and Jerkovic, 2003 | 50. m/0.2 mm/0.2 μm, He, 70. C @ 4. min, 4. K/min, 180. C @ 10. min |
Capillary | CP-Wax 52CB | 1018. | Mau, Lai, et al., 2003 | 60. m/0.25 mm/0.25 μm, He, 3. K/min; Tstart: 40. C; Tend: 220. C |
Capillary | DB-Wax | 1030. | Mookdasanit, Tamura, et al., 2003 | Helium, 2. K/min, 210. C @ 60. min; Column length: 60. m; Column diameter: 0.25 mm; Tstart: 70. C |
Capillary | Supelcowax-10 | 1029. | Orav, Kailas, et al., 2003 | 50. m/0.2 mm/0.25 μm, He, 2. K/min; Tstart: 70. C; Tend: 230. C |
Capillary | Carbowax 20M | 1037. | Priestap, van Baren, et al., 2003 | 50. m/0.25 mm/0.25 μm, N2, 3. K/min; Tstart: 90. C; Tend: 220. C |
Capillary | SW-10 | 1029. | Raal, Arak, et al., 2003 | 50. m/0.20 mm/0.25 μm, He, 2. K/min; Tstart: 50. C; Tend: 250. C |
Capillary | Supelcowax-10 | 1028. | Rotman, Ahumada, et al., 2003 | 30. m/0.25 mm/0.25 μm, N2, 2. K/min; Tstart: 40. C; Tend: 230. C |
Capillary | HP-Innowax | 1039. | Stashenko, Jaramillo, et al., 2003 | 50. m/0.2 mm/0.2 μm, 50. C @ 5. min, 4. K/min; Tend: 220. C |
Capillary | HP-Innowax | 1039. | Stashenko, Jaramillo, et al., 2003 | 50. m/0.2 mm/0.2 μm, 50. C @ 5. min, 4. K/min; Tend: 220. C |
Capillary | Innowax | 1032. | Suleimenov, Atazharova, et al., 2003 | He, 60. C @ 10. min, 4. K/min, 220. C @ 10. min; Column length: 60. m; Column diameter: 0.25 mm |
Capillary | DB-Wax | 1015. | Tu, Onishi, et al., 2003 | 60. m/0.25 mm/0.25 μm, N2, 70. C @ 2. min, 2. K/min, 230. C @ 20. min |
Capillary | DB-Wax | 1023. | Tu, Onishi, et al., 2003, 2 | 60. m/0.25 mm/0.25 μm, N2, 70. C @ 2. min, 2. K/min, 230. C @ 20. min |
Capillary | HP-Innowax | 1038. | Velasco-Negueruela, Pérez-Alonso, et al., 2003 | 50. m/0.2 mm/0.2 μm, He, 5. K/min; Tstart: 70. C; Tend: 190. C |
Capillary | Carbowax 20M | 1033. | Zrira, Elamrani, et al., 2003 | 25. m/0.25 mm/0.25 μm, N2, 4. K/min, 250. C @ 10. min; Tstart: 50. C |
Capillary | RTX-Wax | 1039. | Galindo-Cuspinera, Lubran, et al., 2002 | 60. m/0.25 mm/0.5 μm, He, 40. C @ 5. min, 5. K/min, 180. C @ 20. min |
Capillary | DB-Wax | 1017. | Gancel, Ollé, et al., 2002 | 60. m/0.32 mm/0.25 μm, H2, 1.5 K/min, 245. C @ 20. min; Tstart: 40. C |
Capillary | CP-Wax 52CB | 1009. | Góra, Lis, et al., 2002 | 30. m/0.32 mm/0.25 μm, N2, 4. K/min; Tstart: 60. C; Tend: 300. C |
Capillary | Carbowax 20M | 1056. | Kasali, Winterhalter, et al., 2002 | 30. m/0.25 mm/0.325 μm, He, 4. K/min, 215. C @ 20. min; Tstart: 50. C |
Capillary | Supelcowax-10 | 1029. | Orav, Kailas, et al., 2002 | 60. m/0.2 mm/0.5 μm, He, 2. K/min; Tstart: 70. C; Tend: 220. C |
Capillary | HP-Wax | 1037. | Priestap, van Baren, et al., 2002 | 50. m/0.25 mm/0.25 μm, N2, 75. C @ 4. min, 3. K/min; Tend: 220. C |
Capillary | DB-Wax | 1025. | Tu, Onishi, et al., 2002 | 60. m/0.25 mm/0.25 μm, N2, 70. C @ 2. min, 2. K/min, 230. C @ 20. min |
Capillary | DB-Wax | 1037. | Tu, Thanh, et al., 2002 | 60. m/0.25 mm/0.25 μm, N2, 2. K/min; Tstart: 70. C; Tend: 230. C |
Capillary | DB-Wax | 1011. | Umano, Hagi, et al., 2002 | 60. m/0.25 mm/0.25 μm, He, 40. C @ 2. min, 2. K/min; Tend: 200. C |
Capillary | EC-1000 | 1035. | Bendall, 2001 | 30. m/0.25 mm/0.25 μm, He, 35. C @ 5. min, 5. K/min, 230. C @ 15. min |
Capillary | DB-Wax | 1021. | Christoph, 2001 | 60. m/0.25 mm/0.25 μm, He, 3. K/min; Tstart: 45. C; Tend: 240. C |
Capillary | DB-Wax | 1046. | Jiang and Kubota, 2001 | He, 2. K/min; Column length: 60. m; Column diameter: 0.25 mm; Tstart: 40. C; Tend: 220. C |
Capillary | Stabilwax | 1007. | Jirovetz L., Buchbauer G., et al., 2001 | 30. m/0.32 mm/0.25 μm, H2, 60. C @ 5. min, 10. K/min, 280. C @ 5. min |
Capillary | BP-20 | 1021. | Lota, de Rocca Serra, et al., 2001 | 50. m/0.22 mm/0.25 μm, He, 2. K/min, 230. C @ 35. min; Tstart: 60. C |
Capillary | TC-Wax | 1020. | Miyazawa, Kurose, et al., 2001 | He, 4. K/min, 250. C @ 47. min; Column length: 60. m; Column diameter: 0.25 mm; Tstart: 80. C |
Capillary | PEG-20M | 1029. | Orav, Kailas, et al., 2001 | He, 2. K/min; Column length: 50. m; Column diameter: 0.2 mm; Tstart: 70. C; Tend: 250. C |
Capillary | PEG-20M | 1029. | Orav and Kann, 2001 | He, 2. K/min; Column length: 50. m; Column diameter: 0.2 mm; Tstart: 70. C; Tend: 220. C |
Capillary | PEG-20M | 1029. | Orav and Kann, 2001 | He, 2. K/min; Column length: 50. m; Column diameter: 0.2 mm; Tstart: 70. C; Tend: 220. C |
Capillary | Carbowax 20M | 1060. | Vernin, Lageot, et al., 2001 | 50. m/0.22 mm/0.25 μm, He, 2. K/min; Tstart: 60. C; Tend: 220. C |
Capillary | Innowax | 1032. | Baser, Özek, et al., 2000 | 60. m/0.25 mm/0.25 μm, He, 60. C @ 10. min, 4. K/min, 220. C @ 10. min |
Capillary | DB-Wax | 1020. | Buttery, Light, et al., 2000 | 60. m/0.25 mm/0.25 μm, 30. C @ 4. min, 2. K/min, 170. C @ 30. min |
Capillary | CP-Wax 52CB | 1032. | Chagonda, Makanda, et al., 2000, 2 | 50. m/0.30 mm/0.25 μm, He, 40. C @ 5. min, 3. K/min; Tend: 220. C |
Capillary | DB-Wax | 1009. | Franco and Shibamoto, 2000 | He, 50. C @ 8. min, 3. K/min; Column length: 30. m; Column diameter: 0.2 mm; Tend: 180. C |
Capillary | DB-Wax | 1010. | Franco and Shibamoto, 2000 | He, 50. C @ 8. min, 3. K/min; Column length: 30. m; Column diameter: 0.2 mm; Tend: 180. C |
Capillary | Supelcowax-10 | 1005. | Kim, Kim, et al., 2000 | 30. m/0.32 mm/0.25 μm, He, 70. C @ 8. min, 5. K/min, 240. C @ 20. min |
Capillary | Supelcowax-10 | 1020. | Korány, Mednyánszky, et al., 2000 | 60. m/0.25 mm/0.25 μm, He, 4. K/min; Tstart: 60. C; Tend: 280. C |
Capillary | BP-20 | 1021. | Mallavarapu, Rao, et al., 2000 | 25. m/0.50 mm/0.25 μm, Nitrogen, 5. K/min; Tstart: 60. C; Tend: 200. C |
Capillary | DB-Wax | 1038. | Tamura, Boonbumrung, et al., 2000 | Nitrogen, 40. C @ 10. min, 2. K/min; Column length: 60. m; Column diameter: 0.25 mm; Tend: 200. C |
Capillary | DB-Wax | 1021. | Umano, Hagi, et al., 2000 | 60. m/0.25 mm/0.25 μm, He, 40. C @ 2. min, 2. K/min; Tend: 200. C |
Capillary | CW 20M | 1017. | Bicchi, Binello, et al., 1999 | 25. m/0.32 mm/0.25 μm, Hydrogen, 50. C @ 1. min, 3. K/min, 220. C @ 10. min |
Capillary | Supelcowax-10 | 1026. | Choo, Wong, et al., 1999 | 30. m/0.25 mm/0.25 μm, 4. K/min; Tstart: 60. C; Tend: 220. C |
Capillary | BP-20 | 1038. | Dunlop, Bignell, et al., 1999 | 25. m/0.33 mm/0.5 μm, 5. K/min; Tstart: 80. C; Tend: 220. C |
Capillary | HP Innowax FSP | 1032. | Kaya, Baser, et al., 1999 | 60. m/0.25 mm/0.25 μm, He, 60. C @ 10. min, 220. C @ 10. min |
Capillary | Innowax | 1032. | Kaya, Baser, et al., 1999, 2 | 60. m/0.25 mm/0.25 μm, He, 60. C @ 10. min; Tend: 220. C |
Capillary | HP-Innowax | 1032. | Kaya, Baser, et al., 1999, 3 | 60. m/0.25 mm/0.25 μm, He, 60. C @ 10. min; Tend: 220. C |
Capillary | HP-Innowax | 1032. | Kaya, Baser, et al., 1999, 3 | 60. m/0.25 mm/0.25 μm, He, 60. C @ 10. min; Tend: 220. C |
Capillary | Supelcowax-10 | 1028. | Labuckas, Zygadlo, et al., 1999 | He, 4. K/min; Column length: 30. m; Column diameter: 0.25 mm; Tstart: 60. C; Tend: 240. C |
Capillary | DB-Wax | 1024. | Ngassoum, Yonkeu, et al., 1999 | 60. m/0.25 mm/0.25 μm, He, 4. K/min; Tstart: 60. C; Tend: 240. C |
Capillary | NB-351 | 1019. | Onocha, Ekundayo, et al., 1999 | 25. m/0.3 mm/0.5 μm, H2, 70. C @ 2. min, 5. K/min; Tend: 250. C |
Capillary | HP-20M | 1036. | Prikhod'ko, Klyuev, et al., 1999 | 25. m/0.20 mm/0.25 μm, Helium, 60. C @ 4. min, 3. K/min; Tend: 200. C |
Capillary | BP-20 | 1019. | Rao, Bhattacharya, et al., 1999 | N2, 5. K/min; Column length: 25. m; Column diameter: 0.5 mm; Tstart: 60. C; Tend: 200. C |
Capillary | DB-Wax | 1033. | Weyerstahl, Marschall, et al., 1999, 2 | N2, 5. K/min; Column length: 60. m; Phase thickness: 0.25 μm; Tstart: 60. C; Tend: 220. C |
Capillary | BP-20 | 1038. | Bignell, Dunlop, et al., 1998 | 25. m/0.33 mm/0.5 μm, H2, 5. K/min; Tstart: 80. C; Tend: 220. C |
Capillary | CP-Wax 52CB | 1030. | Chisowa, Hall, et al., 1998 | 25. m/0.32 mm/0.2 μm, He, 60. C @ 2. min, 6. K/min, 240. C @ 10. min |
Capillary | HP-20M | 1023. | Milso, Mastelic, et al., 1998 | 50. m/0.2 mm/0.2 μm, He, 70. C @ 4. min, 4. K/min, 180. C @ 10. min |
Capillary | DB-Wax | 1037. | Molleken U., Sinnwell V., et al., 1998 | 30. m/0.25 mm/0.25 μm, N2, 3. K/min; Tstart: 45. C; Tend: 220. C |
Capillary | DB-Wax | 1018. | Mölleken, Sinnwell, et al., 1998 | 30. m/0.25 mm/0.25 μm, N2, 3. K/min; Tstart: 45. C; Tend: 220. C |
Capillary | HP-Innowax FSC | 1032. | Tümen, Baser, et al., 1998 | 60. m/0.25 mm/0.25 μm, He, 60. C @ 10. min, 4. K/min, 220. C @ 10. min |
Capillary | PEG-20M | 1033. | Awano, Ichikawa, et al., 1997 | 3. K/min; Column length: 60. m; Column diameter: 0.25 mm; Tstart: 70. C; Tend: 220. C |
Capillary | HP-Innowax FSC | 1032. | Baser, Kirimer, et al., 1997 | He, 60. C @ 10. min, 4. K/min, 240. C @ 10. min; Column length: 60. m; Column diameter: 0.25 mm |
Capillary | BP-20 | 1038. | Bignell, Dunlop, et al., 1997 | 25. m/0.33 mm/0.5 μm, H2, 5. K/min; Tstart: 80. C; Tend: 220. C |
Capillary | BP-20 | 1038. | Bignell, Dunlop, et al., 1997, 2 | 25. m/0.33 mm/0.5 μm, H2, 5. K/min; Tstart: 80. C; Tend: 220. C |
Capillary | BP-20 | 1038. | Bignell, Dunlop, et al., 1997, 3 | 25. m/0.33 mm/0.5 μm, H2, 5. K/min; Tstart: 80. C; Tend: 220. C |
Capillary | BP-20 | 1038. | Bignell, Dunlop, et al., 1997, 4 | 25. m/0.33 mm/0.5 μm, H2, 5. K/min; Tstart: 80. C; Tend: 220. C |
Capillary | BP-20 | 1038. | Bignell, Dunlop, et al., 1997, 5 | 25. m/0.33 mm/0.5 μm, 5. K/min; Tstart: 80. C; Tend: 220. C |
Capillary | BP-20 | 1038. | Bignell, Dunlop, et al., 1997, 6 | 25. m/0.33 mm/0.5 μm, H2, 5. K/min; Tstart: 80. C; Tend: 220. C |
Capillary | DB-Wax | 1023. | Lebossé, Ducruet, et al., 1997 | 30. m/0.32 mm/0.5 μm, H2, 4. K/min; Tstart: 40. C; Tend: 220. C |
Capillary | Supelcowax-10 | 1028. | Zunino, Novillo-Newton, et al., 1997 | 4. K/min; Column length: 30. m; Column diameter: 0.25 mm; Tstart: 60. C; Tend: 240. C |
Capillary | Supelcowax-10 | 1028. | Zygadlo, Ariza-Espinar, et al., 1997 | He, 3. K/min; Column length: 0. m; Column diameter: 0.25 mm; Tstart: 40. C; Tend: 240. C |
Capillary | SP-1000 | 1020. | Brophy, Goldsack, et al., 1996 | He, 3. K/min; Column length: 85. m; Column diameter: 0.50 mm; Tstart: 65. C; Tend: 225. C |
Capillary | DB-Wax | 1029. | Malizia, Molli, et al., 1996 | 30. m/0.319 mm/0.25 μm, N2, 8. K/min, 300. C @ 15. min; Tstart: 60. C |
Capillary | PEG-20M | 1029. | Orav, Kailas, et al., 1996 | He, 2. K/min; Column length: 50. m; Column diameter: 0.25 mm; Tstart: 70. C; Tend: 250. C |
Capillary | DB-Wax | 1031. | Sagrero-Nieves and Bartley, 1996 | 60. m/0.32 mm/0.50 μm, He, 50. C @ 1. min, 8. K/min, 250. C @ 6. min |
Capillary | DB-Wax | 1018. | Stashenko, Puertas, et al., 1996 | 60. m/0.25 mm/0.25 μm, He, 50. C @ 5. min, 2.5 K/min; Tend: 180. C |
Capillary | Supelcowax-10 | 1028. | Wong and Lai, 1996 | 60. m/0.25 mm/0.25 μm, He, 40. C @ 3. min, 3. K/min, 200. C @ 30. min |
Capillary | DB-Wax | 989. | Christensen and Reineccius, 1995 | 30. m/0.25 mm/0.25 μm, 20. C @ 1. min, 5. K/min; Tend: 230. C |
Capillary | PEG-20M | 1033. | Orav, Kuningas, et al., 1995 | 60. m/0.32 mm/0.25 μm, He, 70. C @ 7. min, 2. K/min; Tend: 180. C |
Capillary | Carbowax 20M | 1021. | Tirado, Stashenko, et al., 1995 | 60. m/0.25 mm/0.25 μm, He, 50. C @ 10. min, 2. K/min, 150. C @ 20. min |
Capillary | PEG-20M | 1013. | Togari, Kobayashi, et al., 1995 | 50. m/0.25 mm/0.15 μm, He, 60. C @ 4. min, 2. K/min; Tend: 180. C |
Capillary | DB-Wax | 1036. | Sagrero-Nieves, Bartley, et al., 1994 | 60. m/0.32 mm/0.5 μm, 2. K/min; Tstart: 50. C; Tend: 225. C |
Capillary | Supelcowax-10 | 1020. | Collin, Deslauriers, et al., 1993 | 40. C @ 2. min, 2. K/min, 210. C @ 120. min |
Capillary | Supelcowax-10 | 1021. | Collin, Deslauriers, et al., 1993 | 40. C @ 2. min, 2. K/min, 210. C @ 120. min |
Capillary | Carbowax 20M | 1039. | Egolf and Jurs, 1993 | 2. K/min; Column length: 80. m; Column diameter: 0.2 mm; Tstart: 70. C; Tend: 170. C |
Capillary | DB-Wax | 1019. | Shimoda, Shiratsuchi, et al., 1993 | 60. m/0.25 mm/0.25 μm, He, 50. C @ 4. min, 2. K/min; Tend: 230. C |
Capillary | CP-Wax 52CB | 1016.1 | Chyau, Chen, et al., 1992 | 50. m/0.32 mm/0.22 μm, H2, 50. C @ 5. min, 2. K/min; Tend: 200. C |
Capillary | Carbowax 20M | 1037. | Kollmannsberger, Nitz, et al., 1992 | 45. m/0.32 mm/1.0 μm, Hydrogen, 60. C @ 5. min, 2. K/min; Tend: 200. C |
Capillary | Carbowax 20M | 1012. | Kawakami and Kobayashi, 1991 | He, 60. C @ 4. min, 2. K/min; Column length: 50. m; Column diameter: 0.25 mm; Tend: 180. C |
Capillary | DB-Wax | 1033. | Wyllie, Brophy, et al., 1990 | 70. C @ 2. min, 4. K/min; Column length: 30. m; Column diameter: 0.32 mm; Tend: 200. C |
Capillary | FFAP | 1034. | Brophy, Davies, et al., 1989 | 50. C @ 1. min, 10. K/min; Column length: 50. m; Tend: 180. C |
Capillary | DB-Wax | 1012. | Takeoka and Butter, 1989 | 60. m/0.32 mm/0.25 μm, He, 30. C @ 4. min, 2. K/min; Tend: 180. C |
Capillary | DB-Wax | 1015. | Takeoka and Butter, 1989 | 60. m/0.32 mm/0.25 μm, He, 30. C @ 4. min, 2. K/min; Tend: 180. C |
Capillary | Carbowax 20M | 1020. | Shibamoto, 1987 | 2. K/min; Column length: 50. m; Column diameter: 0.25 mm; Tstart: 80. C; Tend: 200. C |
Capillary | DB-Wax | 1003. | Perry, Baxter, et al., 1986 | 30. m/0.25 mm/0.25 μm, H2, 5. K/min; Tstart: 50. C; Tend: 250. C |
Capillary | BP-20 | 1039. | MacLeod and Snyder, 1985 | 70. C @ 5. min, 3. K/min; Column length: 25. m; Column diameter: 0.2 mm; Tend: 180. C |
Capillary | Carbowax 20M | 1020. | Buttery and Kamm, 1980 | 50. C @ 30. min, 1. K/min; Column length: 150. m; Column diameter: 0.64 mm; Tend: 170. C |
Capillary | Carbowax 20M | 1043. | Shibamoto and Jennings, 1977 | 1. K/min; Column length: 100. m; Column diameter: 0.25 mm; Tstart: 70. C; Tend: 170. C |
Capillary | Carbowax 20M | 1043. | Shibamoto and Jennings, 1977 | 1. K/min; Column length: 100. m; Column diameter: 0.25 mm; Tstart: 70. C; Tend: 170. C |
Packed | Carbowax 20M | 1039. | Stancher and Pertoldi, 1967 | Hydrogen, Gas-Chrom Z (80-100 mesh), 4. K/min; Column length: 2. m; Tstart: 65. C; Tend: 220. C |
Packed | Carbowax 20M | 1040. | Stancher and Pertoldi, 1967 | Hydrogen, Gas-Chrom Z (80-100 mesh), 4. K/min; Column length: 2. m; Tstart: 65. C; Tend: 220. C |
Packed | Carbowax 20M | 1040. | Stancher and Pertoldi, 1967 | Hydrogen, Gas-Chrom Z (80-100 mesh), 4. K/min; Column length: 2. m; Tstart: 65. C; Tend: 220. C |
Packed | Carbowax 20M | 1042. | Stancher and Pertoldi, 1967 | Hydrogen, Gas-Chrom Z (80-100 mesh), 4. K/min; Column length: 2. m; Tstart: 65. C; Tend: 220. C |
Packed | Carbowax 20M | 1042. | Stancher and Pertoldi, 1967 | Hydrogen, Gas-Chrom Z (80-100 mesh), 4. K/min; Column length: 2. m; Tstart: 65. C; Tend: 220. C |

Normal alkane RI, polar column, custom temperature program

Column type | Active phase | I | Reference | Comment |
---|---|---|---|---|
Capillary | PEG-20M Innowax | 1052. | Wang, Tian, et al., 2013 | 30. m/0.25 mm/0.25 μm, Nitrogen; Program: 50 0C (7 min) 20 0C/min -> 130 0C (1 min) 1 0C/min -> 150 0C 8 0C/min -> 190 0C (5 min) |
Capillary | Innowax FSC | 1032. | Akin, Saracoglu, et al., 2012 | 60. m/0.25 mm/0.25 μm, Helium; Program: 60 0C (10 min) 4 0C/min -> 220 0C (10 min) 1 oC/min -> 240 0C |
Capillary | Supelco CO Wax-10 | 1015. | Prompona, Kandylis, et al., 2012 | 60. m/0.32 mm/0.25 μm, Helium; Program: 35 0C (6 min) 2 0C/min -> 60 0C (5 min) 5 0C/min -> 200 0C 25 0C/min -> 250 0C (6 min) |
Capillary | Supelco CO Wax-10 | 1020. | Prompona, Kandylis, et al., 2012 | 60. m/0.32 mm/0.25 μm, Helium; Program: not specified |
Capillary | Innowax FSC | 1032. | Demirci, Temel, et al., 2011 | 60. m/0.25 mm/0.25 μm, Helium; Program: 60 0C (10 min) 4 0C/min -> 220 0C (10 min) 1 0C/min -> 240 0C |
Capillary | HP-Innowax | 1026. | Feng, Cui, et al., 2011 | 60. m/0.25 mm/0.25 μm, Helium; Program: not specified |
Capillary | HP Innowax | 1032. | Laribi, Kouki, et al., 2011 | 30. m/0.25 mm/0.25 μm, Nitrogen; Program: 35 0C (10 min) 3 0C/min -> 205 0C 10 0C/min -> 225 0C |
Capillary | DB-Wax | 1061. | Miyazaki, Plotto, et al., 2011 | 60. m/0.25 mm/0.50 μm, Helium; Program: 40 0C 4 0C/min -> 230 0C 100 0C/min -> 260 0C (11.7 min) |
Capillary | Innowax | 1075. | Noorizadeh, Farmany, et al., 2011 | 60. m/0.25 mm/0.33 μm; Program: not specified |
Capillary | CP-Wax 52 CB | 1029. | Povolo, Cabassi, et al., 2011 | Program: not specified |
Capillary | DB-Wax | 1037. | Zeng, Xie, et al., 2011 | 30. m/0.25 mm/0.25 μm, Helium; Program: not specified |
Capillary | HP Innowax | 1076. | Noorizadeh and Farmany, 2010 | 60. m/0.25 mm/0.33 μm; Program: not specified |
Capillary | Innowax FSC | 1032. | Polatoglu, Demirci, et al., 2010 | 60. m/0.25 mm/0.25 μm, Helium; Program: 60 0C (10 min) 4 0C/min -> 220 0C (10 min) 1 0C/min -> 240 0C |
Capillary | Innowax FSC | 1032. | Baser, Demirci, et al., 2009 | 60. m/0.25 mm/0.25 μm, Helium; Program: 60 0C (10 min) 4 0C/min -> 220 0C (10 min) 1 0C/min -> 240 0C |
Capillary | DB-Wax | 1019. | Gyawali and Kim, 2009 | 60. m/0.25 mm/0.25 μm, Helium; Program: 40 0C (3 min) 2 0C/min -> 150 0C 4 0C/min -> 220 0C (20 min) |
Capillary | Polyethylene glycol (Free Fatty Acid Phase) | 1007. | Harraca, Syed, et al., 2009 | Column length: 30. m; Column diameter: 0.25 mm; Program: not specified |
Capillary | Polyethylene glycol (Free Fatty Acid Phase) | 1027. | Harraca, Syed, et al., 2009 | Column length: 30. m; Column diameter: 0.25 mm; Program: not specified |
Capillary | HP Innowax | 1032. | Mancini, Arnold, et al., 2009 | 50. m/0.20 mm/0.25 μm, Helium; Program: 40 0C (5 min) 2 0C/min -> 270 0C -> 260 0C (20 min) |
Capillary | DB-Wax | 1021. | Rochat, Egger, et al., 2009 | 30. m/0.25 mm/0.25 μm, Helium; Program: not specified |
Capillary | HP Innowax FSP | 1032. | Wedge, Klun, et al., 2009 | 60. m/0.25 mm/0.25 μm, Helium; Program: 60 0C (10 min) 4 0C/min -> 220 0C (10 min) 1 0C/min -> 240 0C (20 min) |
Capillary | HP-20M | 1032. | Zellner, Amorim, et al., 2009 | 25. m/0.20 mm/0.20 μm, Helium; Program: 30 0C (1 min) 50 0C/min -> 110 0C 1.5 0C/min -> 145 0C 4 0C/min -> 220 0C (10 min) |
Capillary | Innowax | 1020. | Aicha, Ines, et al., 2008 | 30. m/0.25 mm/0.25 μm, Helium; Program: not specified |
Capillary | DB-Wax | 1014. | Beck, Higbee, et al., 2008 | 60. m/0.32 mm/0.25 μm, Helium; Program: not specified |
Capillary | Supelcowax-10 | 1010. | Berard, Bianchi, et al., 2007 | 30. m/0.25 mm/0.25 μm, He; Program: 35C(8min) => 6C/min => 60C => 4C/min => 160C => 20C/min => 200C(1min) |
Capillary | Supelcowax-10 | 1017. | Berard, Bianchi, et al., 2007 | 30. m/0.25 mm/0.25 μm, He; Program: 35C(8min) => 6C/min => 60C => 4C/min => 160C => 20C/min => 200C(1min) |
Capillary | HP-Innowax | 1075. | Formisano, Mignola, et al., 2007 | 50. m/0.2 mm/0.2 μm, He; Program: 40C(5min) => 2C/min => 250C(15min) => 10C/min => 270C |
Capillary | Carbowax 20M | 1031. | Hudaib and Aburjai, 2007 | 30. m/0.25 mm/0.25 μm, He; Program: not specified |
Capillary | Innowax FSC | 1032. | Kaya, Benirci, et al., 2007 | 60. m/0.25 mm/0.25 μm, Nitrogen; Program: 60 0C (10 min) 1 0C/min -> 220 0C (10 min) 1 0C/min -> 240 0C |
Capillary | Carbowax 20M | 1030. | Merle, Verdeguer, et al., 2007 | He; Column length: 30. m; Program: 60C(5min) => 3C/min => 180C => 20C/min => 280C(10min) |
Capillary | HP-Innowax | 1007. | Narain, Galvao, et al., 2007 | 30. m/0.25 mm/0.25 μm, He; Program: 30C(5min) => 7C/min => 100C(5min) => 1C/min => 130C => 10C/min => 195C(45min) |
Capillary | HP-Innowax | 1007. | Narain, Galvao, et al., 2007 | 30. m/0.25 mm/0.25 μm, He; Program: 30C(5min) => 7C/min => 100C(5min) => 1C/min => 130C => 10C/min => 195C(45min) |
Capillary | HP-Innowax | 1007. | Narain, Galvao, et al., 2007 | 30. m/0.25 mm/0.25 μm, He; Program: 30C(5min) => 7C/min => 100C(5min) => 1C/min => 130C => 10C/min => 195C(45min) |
Capillary | DB-Wax | 1029. | Seo, Kim, et al., 2007 | 60. m/0.25 mm/0.25 μm, He; Program: 40C(3min) => 2C/min => 150C => 4C/min => 200C (20min) |
Capillary | Innowax FSC | 1032. | Tabanca, Demirci, et al., 2007 | 60. m/0.25 mm/0.25 μm, He; Program: 60C(10min) => 4C/min => 220C (10min) => 1C/min => 240C |
Capillary | HP Innowax FSP | 1032. | Tabanca N., Demirci B., et al., 2007 | 60. m/0.25 mm/0.25 μm, N2; Program: 60C(10min) => 4C/min => 220C(10min) => 1C/min => 240C |
Capillary | Supelcowax-10 | 1020. | Vichi, Guadayol, et al., 2007 | 30. m/0.25 mm/0.25 μm, He; Program: 40C(3min) => 4C/min => 75C => 8C/min => 250C(5min) |
Capillary | Innowax FSC | 1032. | Baser K.H.C., Ozek G., et al., 2006 | 60. m/0.25 mm/0.25 μm, He; Program: 60C(10min) => 4C/min => 220C (10min) => 1C/min => 240C |
Capillary | Innowax FSC | 1032. | Baser, Özek, et al., 2006 | 60. m/0.25 mm/0.25 μm, He; Program: 60C(10min) => 4C/min >220C (10min) => 1C/min => 240C |
Capillary | Innowax FSC | 1032. | Baser, Özek, et al., 2006 | 60. m/0.25 mm/0.25 μm, He; Program: 60C(10min) => 4C/min >220C (10min) => 1C/min => 240C |
Capillary | HP-Innowax FSC | 1032. | Demirci B., Baser K.H.C., et al., 2006 | 60. m/0.25 mm/0.25 μm, N2; Program: 60C(10min) => 4C/min => 220C(10min) => 1C/min => 240C |
Capillary | HP-Innowax FSC | 1032. | Erdurak, Coskun, et al., 2006 | 60. m/0.25 mm/0.25 μm, He; Program: 60C(10min) => 4C/min => 220C (10min) => 1C/min => 240C |
Capillary | Innowax FSC | 1032. | Iscan, Kirimer, et al., 2006 | 60. m/0.25 mm/0.25 μm, N2; Program: 60C(10min) => 4C/min => 220C(10min) => 1C/min => 240C |
Capillary | HP-Innowax FSC | 1032. | Kürkçüoglu, Hüsnü Can Baser, et al., 2006 | 60. m/0.25 mm/0.25 μm, He; Program: 60C(10min) => 4C/min => 220C (10min) => 1C/min => 240C |
Capillary | Carbowax 20M | 1038. | Lorenzo, Loayza, et al., 2006 | 25. m/0.32 mm/0.25 μm, H2; Program: 40C(8min) => 3C/min => 180C => 20C/min => 230C (10min) |
Capillary | HP-Innowax | 1076. | Senatore, Apostolides Arnold, et al., 2006 | 50. m/0.2 mm/0.2 μm, He; Program: 40C(5min) => 2C/min => 250C (15min) => 10C/min => 270C |
Capillary | HP-Innowax FSC | 1032. | Suleimenov Y.M., Atazhanova G.A., et al., 2006 | 60. m/0.25 mm/0.25 μm, He; Program: 60(10min) => 4C/min => 220C(10min) => 1C/min => 240C |
Capillary | HP-Innowax FSC | 1032. | Tabanca, Demirci, et al., 2006 | 60. m/0.25 mm/0.25 μm; Program: 60C(10min) => 4C/min => 220C (10min) => 1C/min => 240C |
Capillary | HP-Innowax FSC | 1032. | Tabanca, Demirci, et al., 2006, 2 | 60. m/0.25 mm/0.25 μm, N2; Program: 60C(10min) => 4C/min => 220C => (10min) => 1C/min => 240C |
Capillary | Innowax FSC | 1032. | Tosun, Kürkcüoglu, et al., 2006 | 60. m/0.25 mm/0.25 μm, He; Program: 60C(10min) => 4C/min => 220C (10min) => 1C/min => 240C |
Capillary | Supelcowax-10 | 1016. | Vichi, Guadayol, et al., 2006 | 30. m/0.25 mm/0.25 μm, He; Program: 40C(3min) => 4C/min => 75C => 8C/min => 260C(5min) |
Capillary | DB-Wax | 1039. | Berlinet, Ducruet, et al., 2005 | 30. m/0.25 mm/0.25 μm, He; Program: not specified |
Capillary | HP-Innowax | 1032. | Demirci, Demirci, et al., 2005 | 60. m/0.25 mm/0.25 μm, N2; Program: 60C(10min) => 4C/min => 220C (10min) => 1C/min => 240C |
Capillary | HP-Innowax FSC | 1032. | Demirci, Demirci, et al., 2005, 2 | 60. m/0.25 mm/0.25 μm, N2; Program: 60C(10min) => 4C/min => 220C (10min) => 1C/min => 240C |
Capillary | DB-Wax | 1001. | Giuseppe, Manuela, et al., 2005 | 30. m/0.25 mm/0.25 μm, He; Program: 35C(5min) => 2C/min => 173C(1min) => 15C/min => 210C(5min) |
Capillary | Innowax FSC | 1032. | Kosar, Özek, et al., 2005 | 60. m/0.25 mm/0.25 μm, He; Program: 60C(10min) => 4C/min => 220C(10min) => 1C/min => 240C |
Capillary | DB-Wax | 1012. | Pala-Paul, Perez-Alonso, et al., 2005 | N2; Program: not specified |
Capillary | HP-Innowax FSC | 1032. | Sezik E., Kocakulak E., et al., 2005 | 60. m/0.25 mm/0.25 μm, He; Program: 60C(10min) => 4C/min => 220C(10min) => 1C/min => 240C |
Capillary | DB-Wax | 1008. | Steinhaus and Schieberle, 2005 | 30. m/0.32 mm/0.25 μm, He; Program: 40 0C (2 min) 6 K/min -> 190 0C 12 K/min -> 240 0C |
Capillary | HP-Innowax FSC | 1032. | Tabanca, Demirci, et al., 2005 | 60. m/0.25 mm/0.25 μm, He; Program: 60C(10min) => 4C/min => 220C(10min) => 1C/min => 240C |
Capillary | HP-Innowax FSC | 1032. | Viljoen, Subramoney, et al., 2005 | 60. m/0.25 mm/0.25 μm, He; Program: 60C(10min) => 4C/min => 220C(10min) => 1C/min => 240C |
Capillary | Innowax FSC | 1032. | Baser, Özek, et al., 2004 | 60. m/0.25 mm/0.25 μm, He; Program: 60C(10min) => 4C/min => 220C(10min) => 1C/min => 240C |
Capillary | HP-Innowax FSC | 1032. | Demirci, Paper, et al., 2004 | 60. m/0.25 mm/0.25 μm, He; Program: 60C(10min) => 4C/min => 220C(10min) => 1C/min => 240C |
Capillary | HP-Innowax FSC | 1032. | Kivcak, Akay, et al., 2004 | 60. m/0.25 mm/0.25 μm, He; Program: 60C(10min) => 4C/min => 220C(10min) => 1C/min => 240C |
Capillary | HP-Innowax FSC | 1032. | Kivcak, Akay, et al., 2004 | 60. m/0.25 mm/0.25 μm, He; Program: 60C(10min) => 4C/min => 220C(10min) => 1C/min => 240C |
Capillary | HP-Innowax | 1032. | Senatore, Apostolides Arnold, et al., 2004 | 50. m/0.2 mm/0.2 μm; Program: not specified |
Capillary | Carbowax 20M | 1020. | Vinogradov, 2004 | Program: not specified |
Capillary | Carbowax 20M | 1039. | Vinogradov, 2004 | Program: not specified |
Capillary | FFAP | 1010. | Buettner, Mestres, et al., 2003 | 30. m/0.32 mm/0.25 μm; Program: 35C (2min) => 40C/min => 60C (2min) => 6C/min => 180C => 10C/min => 230C (10min |
Capillary | HP-Innowax FSC | 1032. | Demirci, Baser, et al., 2003 | 60. m/0.25 mm/0.25 μm, He; Program: 60C (10min) => 4C/min => 220C (10min) => 1C/min => 240C |
Capillary | HP-Innowax FSC | 1032. | Demirci, Demirci, et al., 2003 | 60. m/0.25 mm/0.25 μm, He; Program: 60C(10min) => 4C/min => 220C(10min) => 1C/min => 240C |
Capillary | Carbowax | 1035. | Edris, Shalaby, et al., 2003 | Program: not specified |
Capillary | HP-Innowax FSC | 1032. | Kaya, Demirci, et al., 2003 | 60. m/0.25 mm/0.25 μm, N2; Program: 60C(10min) => 4C/min => 220C(10min) => 1C/min => 240C |
Capillary | HP-Innowax FSC | 1032. | Kürkcüoglu, Demirci, et al., 2003 | 60. m/0.25 mm/0.25 μm, He; Program: 60C(10min) => 4C/min => 220C(10min) => 1C/min => 240C(40min) |
Capillary | HP-FFAP | 1045. | Mockute and Judzentiene, 2003 | He; Column length: 30. m; Column diameter: 0.25 mm; Program: 60C (2min) => 5C/min => 160C (1min) => 10C/min => 230C (12min) |
Capillary | HP Innowax FSP | 1032. | Tasdemir, Demirci, et al., 2003 | 60. m/0.25 mm/0.25 μm, He; Program: 60C(10min) => 4C/min => 220C (10min) => 1C/min => 240C |
Capillary | Innowax | 1032. | Tunaher, Kirimer, et al., 2003 | 60. m/0.25 mm/0.25 μm, He; Program: 60C(10min) => 4C/min => 220C(10min) => 1C/min => 240C (20min) |
Capillary | HP-Innowax | 1032. | Viljoen, van Vuuren, et al., 2003 | 60. m/0.25 mm/0.25 μm; Program: 60C(10min) => 4C/min => 220C(10min) => 1C/min => 240C |
Capillary | HP-Innowax | 1032. | Baser, Demirci, et al., 2002 | 60. m/0.25 mm/0.25 μm, He; Program: 60 0C (10 min) 4 K/min -> 220 0C (10 min) 1 K/min -> 240 0C |
Capillary | Innowax FSC | 1032. | Baser, Demirei, et al., 2002 | 60. m/0.25 mm/0.25 μm, He; Program: 60C(10min) => 4C/min => 220C(10min) => 1C/min => 240C |
Capillary | Innowax | 1032. | Baser, Nuriddinov, et al., 2002 | 60. m/0.25 mm/0.25 μm, He; Program: 60C(10min) => 4C/min => 220C(10min) => 1C/min => 240C |
Capillary | HP-Innowax | 1032. | Demirci, Baser, et al., 2002 | 60. m/0.25 mm/0.25 μm, He; Program: 60 0C (10 min) 4 K/min -> 220 0C (10 min) 1 K/min -> 240 0C |
Capillary | HP-Innowax FSC | 1032. | Hüsnü Can Baser, Demirci, et al., 2002 | 60. m/0.25 mm/0.25 μm, N2; Program: 60C(10min) => 4C/min => 220C(10min) => 1C/min => 240C |
Capillary | Supelcowax-10 | 1016. | Kim and Lee, 2002 | 60. m/0.25 mm/0.25 μm, He; Program: 40C (7min) => 4C/min => 150C => 8C/min => 240C (10min) |
Capillary | HP-FFAP | 1045. | Mockute and Judzentiene, 2002, 2 | He; Column length: 25. m; Column diameter: 0.22 mm; Program: 60C(2min) => 5C/min => 160C(1min) => 10C/min => 230C(12min) |
Capillary | HP-Innowax | 1025. | Paroul, Rota, et al., 2002 | 30. m/0.32 mm/0.5 μm, H2; Program: 40C (8min) => 3C/min => 180C => 20C/min => 240C |
Capillary | Innowax FSC | 1032. | Tunalier, Kirimer, et al., 2002 | 60. m/0.25 mm/0.25 μm; Program: 60C(10min) => 4C/min => 220C(10min) => 1C/min => 240C |
Capillary | HP-Innowax | 1032. | Baser, Demirci, et al., 2001 | 60. m/0.25 mm/0.25 μm, He; Program: 60 0C (10 min) 10 K/min -> 220 0C (10 min) 1K/min -> 240 0C |
Capillary | FFAP | 1010. | Buettner and Schieberle, 2001 | 30. m/0.32 mm/0.25 μm, He; Program: 35C (2min) => 40C/min => 60C (2min) => 6C/min => 180C => 10C/min => 230C (10min) |
Capillary | Carbowax 20M | 1031. | Gallori, Bilia, et al., 2001 | H2; Program: not specified |
Capillary | HP-Innowax | 1032. | Gören, Demirci, et al., 2001 | 60. m/0.25 mm/0.25 μm, He; Program: 60 0C (10 min) 4 K/min -> 220 0C (10 min) 1 K/min -> 240 0C |
Capillary | HP-Innowax FSC | 1032. | Kaya, Demirci, et al., 2001 | 60. m/0.25 mm/0.25 μm; Program: 60C(10min) => 4C/min => 220C(10min) => 1C/min => 240C |
Capillary | HP-Innowax FSC | 1032. | Kirimer N., Tabanea N., et al., 2001 | 60. m/0.25 mm/0.25 μm, He; Program: 60C(10min) => 4C/min => 220C(10min) => 1C/min => 240C |
Capillary | Innowax | 1032. | Özcan, Akgül, et al., 2001 | 60. m/0.25 mm/0.25 μm, He; Program: 60C(10min) => 4C/min => 200C(10min) => 1C/min => 240C |
Capillary | Innowax FSC | 1032. | Saglam, Gozler, et al., 2001 | 60. m/0.25 mm/0.25 μm, He; Program: 60C(10min) => 4C/min => 220C(10min) => 1C/min => 240C |
Capillary | Innowax FSC | 1032. | Tabanca N., Demirci F., et al., 2001 | 60. m/0.25 mm/0.25 μm, He; Program: 60C(10min) => 4C/min => 220C(10min) => 1C/min => 240C |
Capillary | HP-Innowax FSC | 1032. | Tabanca, Kirimer, et al., 2001 | 60. m/0.25 mm/0.25 μm; Program: 60C(10min) => 4C/min => 220C(10min) => 1C/min => 240C |
Capillary | HP-Innowax | 1032. | Tabanca, Kirimer, et al., 2001, 2 | 60. m/0.25 mm/0.25 μm, He; Program: 60C(10min) => 4C/min => 220C(10min) => 1C/min => 240C |
Capillary | FFAP | 1013. | Tucker, Maciarello, et al., 2001 | 50. m/0.2 mm/0.33 μm; Program: 60C(1min) => 2.5C/min => 115C => 1C/min => 210C(30min) |
Capillary | HP-Wax | 1029. | Usubillaga, Aparicio, et al., 2001 | 60. m/0.25 mm/0.25 μm, He; Program: 50 0C 3 K/min -> 200 0C 8 K/min -> 280 0C |
Capillary | Innowax | 1032. | Ahmed, Choudhary, et al., 2000 | He; Column length: 60. m; Column diameter: 0.25 mm; Program: 60 0C (10 min) 4 K/min -> 220 0C (10 min) 1 K/min -> 240 0C |
Capillary | Innowax | 1032. | Baser, Özek, et al., 2000, 2 | 60. m/0.25 mm/0.25 μm, He; Program: 60 0C (10 min) 4 K/min -> 220 0C (10 min) 1 K/min -> 240 0C |
Capillary | Innowax | 1032. | Baser, Özek, et al., 2000, 3 | 60. m/0.25 mm/0.25 μm, He; Program: 60 0C (10 min) 4 K/min -> 220 0C (10 min) 1 K/min -> 240 0C |
Capillary | Supelcowax-10 | 1028. | Juliani, Biurrun, et al., 2000 | Program: not specified |
Capillary | Innowax FSC | 1032. | Kirimer, Tabanca, et al., 2000 | 60. m/0.25 mm/0.25 μm, He; Program: 60C(10 min) => 4C/min => 220C(10min) => 1C/min => 240C |
Capillary | BP-20 | 1025. | Muselli, Bighelli, et al., 2000 | Program: not specified |
Capillary | Supelcowax-10 | 1028. | Zunino, Lopez, et al., 2000 | Program: not specified |
Capillary | HP-Innowax FSC | 1032. | Bagci, Baser, et al., 1999 | 60. m/0.25 mm/0.25 μm, He; Program: 60C(10min) => 4C/min => 220C(10min) => 1C/min => 240C |
Capillary | Innowax FSC | 1032. | Kirimer, Tabanca, et al., 1999 | 60. m/0.25 mm/0.25 μm, Helium; Program: 60 0C (10 min) 4 0C/min -> 220 0C (10 min) 1 0C/min -> 240 0C |
Capillary | CP-Wax 52CB | 1017. | Jakobsen, Hansen, et al., 1998 | 50. m/0.25 mm/0.2 μm, He; Program: 30C (1.5min) => 3C/min => 120C => 10C/min => 220C (3.5min) |
Capillary | FFAP | 1015. | Reddy, Angers, et al., 1998 | 25. m/0.2 mm/0.33 μm, H2; Program: 40C(5min) => 4C/min => 170C => 8C/min => 240C (12min) |
Capillary | Carbowax 20M | 1030. | Vernin, Lageot, et al., 1998 | Program: not specified |
Capillary | DB-Wax | 1038. | Weyerstahl, Marschall, et al., 1998 | N2; Column length: 60. m; Phase thickness: 0.25 μm; Program: not specified |
Capillary | Carbowax 20M | 1021. | Tirado, Stashenko, et al., 1995 | 60. m/0.25 mm/0.25 μm, He; Program: not specified |
Capillary | NB-351 | 1018. | Kerrola, Galambosi, et al., 1994 | 25. m/0.32 mm/0.2 μm; Program: 40C(5min) => 4C/min => 170C => 8C/min => 240C (12min) |
Capillary | NB-351 | 1010. | Kerrola and Kallio, 1994 | 25. m/0.32 mm/0.2 μm, He; Program: 35C(5min) => 2.5C/min => 150C => 5C/min => 240C (20min) |
Capillary | CP-Wax 52CB | 1021. | Luning, de Rijk, et al., 1994 | 50. m/0.32 mm/1.5 μm; Program: 40C => 2C/min => 150C => 10C/min => 250C |
Capillary | NB-351 | 1011. | Kerrola and Kallio, 1993 | 25. m/0.32 mm/0.2 μm; Program: 40C(5min) => 4C/min => 150C => 8C/min => 240C(12min) |
Capillary | CP-Wax 52CB | 1038. | Vernin, 1991 | Column length: 50. m; Column diameter: 0.32 mm; Program: not specified |
Capillary | Carbowax 20M | 1039. | Shibamoto, 1987 | Program: not specified |
Capillary | Carbowax 20M | 1035. | Ramsey and Flanagan, 1982 | Program: not specified |

References

Hawkins and Eriksen, 1954
Hawkins, J.E.; Eriksen, W.T.,
Physical and thermodynamic properties of terpenes. II. The heats of combustion of some terpene hydrocarbons,
J. Am. Chem. Soc., 1954, 76, 2669-26. [all data]
Cox and Pilcher, 1970
Cox, J.D.; Pilcher, G.,
Thermochemistry of Organic and Organometallic Compounds, Academic Press, New York, 1970, 1-636. [all data]
Hawkins and Eriksen. W.T., 1954
Hawkins, J.E.; Eriksen. W.T.,
J. Am. Chem. Soc., 1954, 76, 2669. [all data]
Timmermans, 1952
Timmermans, J.,
Freezing points of organic compounds. VVI New determinations.,
Bull. Soc. Chim. Belg., 1952, 61, 393. [all data]
Anonymous, 1942
Anonymous, R.,
, Am. Pet. Inst. Res. Proj. 6, Natl. Bur. Stand., 1942. [all data]
Clara, Marigliano, et al., 2009
Clara, Rene A.; Marigliano, Ana C. Gomez; Solimo, Horacio N.,
Density, Viscosity, and Refractive Index in the Range (283.15 to 353.15) K and Vapor Pressure of α-Pinene, d -Limonene, (±)-Linalool, and Citral Over the Pressure Range 1.0 kPa Atmospheric Pressure,
J. Chem. Eng. Data, 2009, 54, 3, 1087-1090, https://doi.org/10.1021/je8007414
. [all data]
An, Hu, et al., 1987
An, Xuwu; Hu, Riheng; Wang, Hu; Wu, Mali; Zou, Yongkuang,
Enthalpies of Vaporization of α- and β-Pinene,
Acta Phys. Chim. Sin., 1987, 3, 6, 668-671, https://doi.org/10.3866/PKU.WHXB19870621
. [all data]
Rodrigues and Bernardo-Gil, 1996
Rodrigues, M. Fátima; Bernardo-Gil, M. Gabriela,
Vapor-Liquid Equilibrium Data of α-Pinene + β-Pinene + Limonene at 80 kPa and 101 kPa,
J. Chem. Eng. Data, 1996, 41, 3, 581-585, https://doi.org/10.1021/je950324g
. [all data]
Reich and Sanhueza, 1993
Reich, Ricardo; Sanhueza, Vilma,
Vapor-liquid equilibria for .alpha.-pinene or .beta.-pinene with anisole,
J. Chem. Eng. Data, 1993, 38, 3, 341-343, https://doi.org/10.1021/je00011a001
. [all data]
Stephenson and Malanowski, 1987
Stephenson, Richard M.; Malanowski, Stanislaw,
Handbook of the Thermodynamics of Organic Compounds, 1987, https://doi.org/10.1007/978-94-009-3173-2
. [all data]
Bukala, Majewski, et al., 1954
Bukala, M.; Majewski, J.; Rodzinski, W.,
Przem. Chem., 1954, 10, 6. [all data]
Hawkins and Armstrong, 1954
Hawkins, J.E.; Armstrong, G.T.,
Physical and thermodynamic properties of terpenes. III. The vapor pressures of α-pinene and β-pinene,
J. Am. Chem. Soc., 1954, 76, 3756-37. [all data]
Hawkinds and Armstrong, 1954
Hawkinds, J.E.; Armstrong, G.T.,
Physical and Thermodynamic Properties of Terpenes. III. The Vapor Pressures of α-Pinene and β-Pinene,
J. Am. Chem. Soc., 1954, 76, 14, 3756-3759, https://doi.org/10.1021/ja01643a051
. [all data]
Al-Joboury and Turner, 1964
Al-Joboury, M.I.; Turner, D.W.,
Molecular photoelectron spectroscopy. Part II. A summary of ionization potentials,
J. Chem. Soc., 1964, 4434. [all data]
Harangi, 2003
Harangi, J.,
Short communication. Retention index calculation without n-alkanes -- the virtual carbon number,
J. Chromatogr. A, 2003, 993, 1-2, 187-195, https://doi.org/10.1016/S0021-9673(03)00320-0
. [all data]
Tarján, Bitter, et al., 2002
Tarján, G.; Bitter, I.; Strasser, B.; Szatmáry, M.,
Data for the gas-liquid chromatographic analysis of essential oils. Determination of the composition of the essential oil of marjoram,
Chromatographia Sup., 2002, 56, 1, s155-s163, https://doi.org/10.1007/BF02494130
. [all data]
Viswanathan, Maridass, et al., 2002
Viswanathan, M.B.; Maridass, M.; Thangadurai, D.; Ramesh, N.,
Chemical constituents of the fruit essential oil of Diospyros malabarica (Desr.) Kostel (Ebenaceae),
Acta Pharmaceutica, 2002, 52, 207-211. [all data]
Tudor, 1997
Tudor, E.,
Temperature dependence of the retention index for perfumery compounds on a SE-30 glass capillary column. I. Linear equations,
J. Chromatogr. A, 1997, 779, 1-2, 287-297, https://doi.org/10.1016/S0021-9673(97)00453-6
. [all data]
Baaliouamer, Boudarene, et al., 1993
Baaliouamer, A.; Boudarene, L.; Meklati, B.Y.,
Use of local lagrange interpolation of calculation of retention indices in linear temperature-programmed gas chromatrography,
Chromatographia, 1993, 35, 1/2, 67-72, https://doi.org/10.1007/BF02278559
. [all data]
Engewald, Knobloch, et al., 1991
Engewald, W.; Knobloch, T.; Haufe, G.; Muller, M.; Pohris, V.,
A Novel Method for Terpene Pattern Determination of Essential Oils by Selectivity Tuning in GC,
Fresenius' J. Anal. Chem., 1991, 341, 10, 641-643, https://doi.org/10.1007/BF00322279
. [all data]
Szabolcs, Benecke, et al., 1985
Szabolcs, N.; Benecke, R.; Thieme, H.,
Természetes eredetu növényi anyagok gázkromatográfiás retenciós tulajdonságai. I. A lavandula- és lavandinolaj fo kimponenseinek retenciós indexei,
Acta Pharm. Hung., 1985, 55, 49-58. [all data]
Benecke, Thieme, et al., 1982
Benecke, R.; Thieme, H.; Nyiredy, Sz.,
Retentionsverhalten der Hauptkomponenten der Lavendel und Lavandinöle an Verschiedenen stationären Phasen in Abhängigkeit von der Säulentemperatur,
J. Chromatogr., 1982, 238, 1, 75-87, https://doi.org/10.1016/S0021-9673(00)82713-2
. [all data]
Morishita, Okano, et al., 1980
Morishita, F.; Okano, T.; Kojima, T.,
Retention indices of monocyclic monoterpene hydrocarbons,
Bunseki Kagaku, 1980, 29, 1, 48-53, https://doi.org/10.2116/bunsekikagaku.29.48
. [all data]
Saeed, Redant, et al., 1979
Saeed, T.; Redant, G.; Sandra, P.,
Kovats Indices of Monoterpene Hydrocarbons on Glass Capillary Columns,
J. Hi. Res. Chromatogr. Chromatogr. Comm., 1979, 2, 2, 75-76, https://doi.org/10.1002/jhrc.1240020208
. [all data]
Kepner, Ellison, et al., 1974
Kepner, R.E.; Ellison, B.O.; Breckenridge, M.; Connolly, G.; Madden, S.C.; Muller, C.J.,
Volatile terpenes in California Bay foliage. Changes in composition during maturation,
J. Agric. Food Chem., 1974, 22, 5, 781-784, https://doi.org/10.1021/jf60195a027
. [all data]
Hedin, Thompson, et al., 1972
Hedin, P.A.; Thompson, A.C.; Gueldner, R.C.,
Application of a Sequential Reduction Regimen to Fractionation of Essential Oils,
Anal. Chem., 1972, 44, 7, 1254-1257, https://doi.org/10.1021/ac60315a030
. [all data]
Andersen and Syrdal, 1970
Andersen, N.H.; Syrdal, D.D.,
Terpenes and sesquiterpenes of chamaecyparis nootkatensis leaf oil,
Phytochemistry, 1970, 9, 6, 1325-1340, https://doi.org/10.1016/S0031-9422(00)85326-1
. [all data]
Hively and Hinton, 1968
Hively, R.A.; Hinton, R.E.,
Variation of the retention index with temperature on squalane substrates,
J. Gas Chromatogr., 1968, 6, 4, 203-217, https://doi.org/10.1093/chromsci/6.4.203
. [all data]
Sakai, Maarse, et al., 1967
Sakai, T.; Maarse, H.; Kepner, R.E.; Jennings, W.G.; Longhurst, W.M.,
Volatile components of Douglas fir needles,
J. Agric. Food Chem., 1967, 15, 6, 1070-1072, https://doi.org/10.1021/jf60154a027
. [all data]
Minyard, Tumlinson, et al., 1965
Minyard, J.P.; Tumlinson, J.H.; Hedin, P.A.; Thompson, A.C.,
Constituents of the cotton bud. Terpene hydrocarbons,
J. Agric. Food Chem., 1965, 13, 6, 599-602, https://doi.org/10.1021/jf60142a034
. [all data]
Kartal N., Sokmen M., et al., 2007
Kartal N.; Sokmen M.; Tepe B.; Daferera D.; Polissiou M.; Sokmen A.,
Investigation of the antioxidant properties of Ferula orientalis L. using a suitable extraction procedure,
Food Chem., 2007, 100, 2, 584-589, https://doi.org/10.1016/j.foodchem.2005.09.084
. [all data]
Adams, González Elizondo, et al., 2006
Adams, R.P.; González Elizondo, M.S.; González Elizondo, M.; Slinkman, E.,
DNA fingerprinting and terpenoid analysis of Juniperus blancoi var. huehuentensis (Cupressaceae), a new subalpine variety from Durango, Mexico,
Biochem. Syst. Ecol., 2006, 34, 3, 205-211, https://doi.org/10.1016/j.bse.2005.11.004
. [all data]
Allegrone, Belliardo, et al., 2006
Allegrone, G.; Belliardo, F.; Cabella, P.,
Comparison of volatile concentrations in hand-squeezed juices of four different lemon varieties,
J. Agric. Food Chem., 2006, 54, 5, 1844-1848, https://doi.org/10.1021/jf051206s
. [all data]
Angioni, Barra, et al., 2006
Angioni, A.; Barra, A.; Coroneo, V.; Dessi, S.; Cabras, P.,
Chemical composition, seasonal variability, and antifungal activity of Lavandula stoechas L. ssp. stoechas essential oils from stem/leaves and flowers,
J. Agric. Food Chem., 2006, 54, 12, 4364-4370, https://doi.org/10.1021/jf0603329
. [all data]
Hazzit, Baaliouamer, et al., 2006
Hazzit, M.; Baaliouamer, A.; Faleiro, M.L.; Miguel, M.G.,
Composition of the Essential Oils of Thymus and Origanum Species from Algeria and Their Antioxidant and Antimicrobial Activities,
J. Agric. Food Chem., 2006, 54, 17, 6314-6321, https://doi.org/10.1021/jf0606104
. [all data]
Jalali-Heravi, Zekavat, et al., 2006
Jalali-Heravi, M.; Zekavat, B.; Sereshti, H.,
Characterization of essential oil components of Iranian geranium oil using gas chromatography-mass spectrometry combined with chemometric resolution techniques,
J. Chromatogr. A, 2006, 1114, 1, 154-163, https://doi.org/10.1016/j.chroma.2006.02.034
. [all data]
Lucero, Fredrickson, et al., 2006
Lucero, M.E.; Fredrickson, E.L.; Estell, R.E.; Morrison, A.A.; Richman, D.B.,
Volatile Composition of Gutierrezia sarothrae (Broom Snakeweed) as Determined by Steam Distillation and Solid Phase Microextraction,
J. Essent. Oil Res., 2006, 18, 2, 121-125, https://doi.org/10.1080/10412905.2006.9699039
. [all data]
Marongiu, Porcedda, et al., 2006
Marongiu, B.; Porcedda, S.; Piras, A.; Sanna, G.; Murreddu, M.; Loddo, R.,
Extraction of Juniperus communis L. ssp. nana Willd. essential oil by supercritical carbon dioxide,
Flavour Fragr. J., 2006, 21, 1, 148-154, https://doi.org/10.1002/ffj.1549
. [all data]
Oliveira, Leitao, et al., 2006
Oliveira, D.R.; Leitao, G.G.; Santos, S.S.; Bizzo, H.R.; Lopes, D.; Alviano, C.S.; Alviano, D.S.; Leitao, S.G.,
Ethnopharmacological study of two Lippia species from Oriximina, Brazil,
J. Ethnopharmacol., 2006, 108, 1, 103-108, https://doi.org/10.1016/j.jep.2006.04.018
. [all data]
Raina, Verma, et al., 2006
Raina, V.K.; Verma, S.C.; Dhawan, S.; Khan, M.; Ramesh, S.; Singh, S.C.; Yadav, A.; Srivastava, S.K.,
Essential oil composition of Murraya exotica from the plains of northern India,
Flavour Fragr. J., 2006, 21, 1, 140-142, https://doi.org/10.1002/ffj.1547
. [all data]
Srivastava, Srivastava, et al., 2006
Srivastava, A.K.; Srivastava, S.K.; Syamsundar, K.V.,
Volatile composition of Curcuma angustifolia Roxb. rhizome from central and southern India,
Flavour Fragr. J., 2006, 21, 3, 423-426, https://doi.org/10.1002/ffj.1680
. [all data]
Tayoub, Schwob, et al., 2006
Tayoub, G.; Schwob, I.; Bessiere, J.-M.; Masotti, V.; Rabier, J.; Ruzzier, M.; Viano, J.,
Composition of volatile oils of Styrax (Styrax officinalis L.) leaves at different phenological stages,
Biochem. Syst. Ecol., 2006, 34, 9, 705-709, https://doi.org/10.1016/j.bse.2006.05.008
. [all data]
Tayoub, Schwob, et al., 2006, 2
Tayoub, G.; Schwob, I.; Bessière, J.-M.; Rabier, J.; Masotti, V.; J.; M.; Girard, G.; Viano, J.,
Essential oil composition of leaf, flower and stem of Styrax (Styrax officinalis L.) from south-eastern France,
Flavour Fragr. J., 2006, 21, 5, 809-812, https://doi.org/10.1002/ffj.1731
. [all data]
Walde, Jyothirmayi, et al., 2006
Walde, S.G.; Jyothirmayi, T.; Prabhakara Rao, P.G.; Srinivas, P.,
Flavour volatiles of flowers and stalks of Murraya koenigii L.,
Flavour Fragr. J., 2006, 21, 4, 581-584, https://doi.org/10.1002/ffj.1737
. [all data]
Adams, Morris, et al., 2005
Adams, R.P.; Morris, J.A.; Pandey, R.N.; Schwarzbach, A.E.,
Cryptic speciation between Juniperus deltoides and Juniperus oxycedrus (Cupressaceae) in the Mediterranean,
Biochem. Syst. Ecol., 2005, 33, 8, 771-787, https://doi.org/10.1016/j.bse.2005.01.001
. [all data]
Adams and Nguyen, 2005
Adams, R.P.; Nguyen, S.,
Infra-specific variation in Juniperus deppeana and F. Sperryi in the Davis Mountains of Texas: variation in leaf essential oils and random amplified polymorphic DNAS (RAPDS),
Phytologia, 2005, 87, 2, 96-108. [all data]
Asfaw, Licence, et al., 2005
Asfaw, N.; Licence, P.; Novitskii, A.; Poliakoff, M.,
Green Chemistry in Ethiopia: the cleaner extraction of essential oils from Artemisia afra: a comparison of clean technology with conventional methodology,
Green Chem., 2005, 7, 5, 352-356, https://doi.org/10.1039/b417961g
. [all data]
Asuming, Beauchamp, et al., 2005
Asuming, W.A.; Beauchamp, P.S.; Descalzo, J.T.; Dev, B.C.; Dev, V.; Frost, S.; Ma, C.W.,
Essential oil composition of four Lomatium Raf. species and their chemotaxonomy,
Biochem. Syst. Ecol., 2005, 33, 1, 17-26, https://doi.org/10.1016/j.bse.2004.06.005
. [all data]
Baranauskiene, Venskutonis, et al., 2005
Baranauskiene, R.; Venskutonis, R.P.; Demyttenaere, J.C.R.,
Sensory and instrumental evaluation of sweet marjoram (Origanum majorana L.) aroma,
Flavour Fragr. J., 2005, 20, 5, 492-500, https://doi.org/10.1002/ffj.1478
. [all data]
Maia, Andrade, et al., 2005
Maia, J.G.S.; Andrade, E.H.A.; da Silva, A.C.M.; Oliveira, J.; Carreira, L.M.M.; Araújo, J.S.,
Leaf volatile oils from four Brazilian Xylopia species,
Flavour Fragr. J., 2005, 20, 5, 474-477, https://doi.org/10.1002/ffj.1499
. [all data]
Medina, Lucero, et al., 2005
Medina, A.L.; Lucero, M.E.; Holguin, F.O.; Estell, R.E.; Posakony, J.J.; Simon, J.; O'Connell, M.A.,
Composition and antimicrobial activity of Anemopsis californica leaf oil,
J. Agric. Food Chem., 2005, 53, 22, 8694-8698, https://doi.org/10.1021/jf0511244
. [all data]
Shatar S., 2005
Shatar S.,
Essential oil of Ferula ferulaoides from Western Mongolia,
Chem. Nat. Compd. (Engl. Transl.), 2005, 41, 5, 607-608, https://doi.org/10.1007/s10600-005-0222-8
. [all data]
Angioni, Barra, et al., 2004
Angioni, A.; Barra, A.; Cereti, E.; Barile, D.; Coïsson, J.D.; Arlorio, M.; Dessi, S.; Coroneo, V.; Cabras, P.,
Chemical composition, plant genetic differences, antimicrobial and antifungal activity investigation of the essential oil of Rosmarinus officinalis L.,
J. Agric. Food Chem., 2004, 52, 11, 3530-3535, https://doi.org/10.1021/jf049913t
. [all data]
Behera, Nagarajan, et al., 2004
Behera, S.; Nagarajan, S.; Rao, L.J.M.,
Microwave heating and conventional roasting of cumin seeds (Cuminum cyminum L.) and effect on chemical composition of volatiles,
Food Chem., 2004, 87, 1, 25-29, https://doi.org/10.1016/j.foodchem.2003.10.012
. [all data]
El-Ghorab, Mansour, et al., 2004
El-Ghorab, A.H.; Mansour, A.F.; El-massry, K.F.,
Effect of extraction methods on the chemical composition and antioxidant activity of Egyptian marjoram (Majorana hortensis Moench),
Flavour Fragr. J., 2004, 19, 1, 54-61, https://doi.org/10.1002/ffj.1276
. [all data]
Gauvin, Lecomte, et al., 2004
Gauvin, A.; Lecomte, H.; Smadja, J.,
Comparative investigations of the essential oils of two scented geranium (Pelargonium spp.) cultivars grown on Reunion Island,
Flavour Fragr. J., 2004, 19, 5, 455-460, https://doi.org/10.1002/ffj.1354
. [all data]
Juliani, Zygadlo, et al., 2004
Juliani, H.R.; Zygadlo, J.A.; Scrivanti, R.; de la Sota, E.; Simon, J.E.,
The essential oil of Anemia tomentosa (Savigny) Sw. var. anthriscifolia (Schrad.) Mickel,
Flavour Fragr. J., 2004, 19, 6, 541-543, https://doi.org/10.1002/ffj.1341
. [all data]
Lopes, Strobl, et al., 2004
Lopes, D.; Strobl, H.; Kolodziejczyk, P.,
14-Methylpentadecano-15-lactone (Muscolide): a new macrocyclic lactone from the oil of Angelica archangelica L.,
Chemistry and Biodiversity, 2004, 1, 12, 1880-1887, https://doi.org/10.1002/cbdv.200490144
. [all data]
Mahmood, Kaul, et al., 2004
Mahmood, U.; Kaul, V.K.; Acharya, R.,
Volatile constituents of Capillipedium parviflorum,
Phytochemistry, 2004, 65, 14, 2163-2166, https://doi.org/10.1016/j.phytochem.2004.04.003
. [all data]
Merle, Morón, et al., 2004
Merle, H.; Morón, M.; Blázquez, A.; Boira, H.,
Taxonomical contribution of essential oils in mandarins cultivars,
Biochem. Syst. Ecol., 2004, 32, 5, 491-497, https://doi.org/10.1016/j.bse.2003.09.010
. [all data]
Morteza-Semnani, Azadbakht, et al., 2004
Morteza-Semnani, K.; Azadbakht, M.; Goodarzi, A.,
The essential oils composition of Phlomis herba-venti L. leaves and flowers of Iranian origin,
Flavour Fragr. J., 2004, 19, 1, 29-31, https://doi.org/10.1002/ffj.1268
. [all data]
Ogunwande, Olawore, et al., 2004
Ogunwande, I.A.; Olawore, N.O.; Adeleke, K.A.; Ekundayo, O.; König, W.A.,
Rare terpenoid esters from Hyparrhenia rufa (Nees) Stapf. growing wild in Nigeria,
Flavour Fragr. J., 2004, 19, 3, 239-243, https://doi.org/10.1002/ffj.1295
. [all data]
Schwob, Bessiere, et al., 2004
Schwob, I.; Bessiere, J.-M.; Masotti, V.; Viano, J.,
Changes in essential oil composition in Saint John's wort (Hypericum perforatum L.) aerial parts during its phenological cycle,
Biochem. Syst. Ecol., 2004, 32, 8, 735-745, https://doi.org/10.1016/j.bse.2003.12.005
. [all data]
Siani, Garrido, et al., 2004
Siani, A.C.; Garrido, I.S.; Monteiro, S.S.; Carvalho, E.S.; Ramos, M.F.S.,
Protium icicariba as a source of volatile essences,
Biochem. Syst. Ecol., 2004, 32, 5, 477-489, https://doi.org/10.1016/j.bse.2003.11.003
. [all data]
Velasco-Negueruela, Sanz, et al., 2004
Velasco-Negueruela, A.; Sanz, J.; Pérez-Alonso, M.J.; Palá-Paúl, J.,
The volatile components of the aerial parts of Melittis melissophyllum L. subsp. melissophyllum gathered in Spain,
Botanica Complutensis, 2004, 28, 133-136. [all data]
Yadav, Chauhan, et al., 2004
Yadav, A.R.; Chauhan, A.S.; Rekha, M.N.; Rao, L.J.M.; Ramteke, R.S.,
Flavour quality of dehydrated lime [Citrus aurantifolia (Christm.) Swingle],
Food Chem., 2004, 85, 1, 59-62, https://doi.org/10.1016/j.foodchem.2003.06.002
. [all data]
Amparo Blázquez, Pérez, et al., 2003
Amparo Blázquez, M.; Pérez, I.; Boira, H.,
Essential oil analysis of Teucrium libanitis and T. turredanum by GC and GC-MS,
Flavour Fragr. J., 2003, 18, 6, 497-501, https://doi.org/10.1002/ffj.1256
. [all data]
Baranauskiene, Venskutonis, et al., 2003
Baranauskiene, R.; Venskutonis, R.P.; Demyttenaere, J.C.R.,
Sensory and instrumental evaluation of catnip (Nepeta cataria L.) aroma,
J. Agric. Food Chem., 2003, 51, 13, 3840-3848, https://doi.org/10.1021/jf021187b
. [all data]
Baranauskiene, Venskutonis, et al., 2003, 2
Baranauskiene, R.; Venskutonis, P.R.; Viskelis, P.; Dambrauskiene, E.,
Influence of nitrogen fertilizers on the yield and composition of thyme (Thymus vulgaris),
J. Agric. Food Chem., 2003, 51, 26, 7751-7758, https://doi.org/10.1021/jf0303316
. [all data]
Bouzouita, Kachouri, et al., 2003
Bouzouita, N.; Kachouri, F.; Hamdi, M.; Chaabouni, M.M.,
Antimicrobial activity of essential oils from Tunisian aromatic plants,
Flavour Fragr. J., 2003, 18, 5, 380-383, https://doi.org/10.1002/ffj.1200
. [all data]
Couladis, Chinou, et al., 2003
Couladis, M.; Chinou, I.B.; Tzakou, O.; Petrakis, P.V.,
Composition and antimicrobial activity of the essential oil of Hypericum rumeliacum subsp. apollinis (Boiss. Heldr.),
Phytother. Res., 2003, 17, 2, 152-154, https://doi.org/10.1002/ptr.1093
. [all data]
Gkinis, Tzakou, et al., 2003
Gkinis, G.; Tzakou, O.; Iliopoulou, D.; Roussis, V.,
Chemical Composition and Biological Activity of Nepeta parnassica Oils and Isolated Nepetalactones,
Z. Naturforsch. C:, 2003, 58, 681-686. [all data]
Lucero, Estell, et al., 2003
Lucero, M.E.; Estell, R.E.; Frederickson, E.L.,
The essential oil composition of Psorothamnus scoparius (A. Gray) Rydb.,
J. Essent. Oil Res., 2003, 15, 2, 108-111, https://doi.org/10.1080/10412905.2003.9712083
. [all data]
Ogunwande, Olawore, et al., 2003
Ogunwande, I.A.; Olawore, N.O.; Adeleke, K.A.; Ekundayo, O.; Koenig, W.A.,
Chemical composition of the leaf volatile oil of Psidium guajava L. growing in Nigeria,
Flavour Fragr. J., 2003, 18, 2, 136-138, https://doi.org/10.1002/ffj.1175
. [all data]
Ogunwande, Olawore, et al., 2003, 2
Ogunwande, I.A.; Olawore, N.O.; Kasali, A.A.; König, W.A.,
Chemical composition of the leaf volatile oils of Callitris intratropica R.T. Baker H.G. Smith from Nigeria,
Flavour Fragr. J., 2003, 18, 5, 387-389, https://doi.org/10.1002/ffj.1214
. [all data]
Özcan, Tzakou, et al., 2003
Özcan, M.; Tzakou, O.; Couladis, M.,
Essential oil composition of Turkish herbal tea (Salvia aucheri Bentham var. canescens Boiss. Heldr.),
Flavour Fragr. J., 2003, 18, 4, 325-327, https://doi.org/10.1002/ffj.1229
. [all data]
Raina, Srivastava, et al., 2003
Raina, V.K.; Srivastava, S.K.; Syamasunder, K.V.,
Essential oil composition of Acorus calamus L. from the lower region of the Himalayas,
Flavour Fragr. J., 2003, 18, 1, 18-20, https://doi.org/10.1002/ffj.1136
. [all data]
Srivastava, Ahmad, et al., 2003
Srivastava, S.K.; Ahmad, A.; Syamsunder, K.V.; Aggarwal, K.K.; Shanuja, S.P.S.,
Essential oil composition of Callistemon viminalis leaves from India,
Flavour Fragr. J., 2003, 18, 5, 361-363, https://doi.org/10.1002/ffj.1143
. [all data]
Viña and Murillo, 2003
Viña, A.; Murillo, E.,
Essential oil composition from twelve varieties of basil (Ocimum spp) grown in Columbia,
J. Braz. Chem. Soc., 2003, 14, 5, 744-749, https://doi.org/10.1590/S0103-50532003000500008
. [all data]
Buchin, Salmon, et al., 2002
Buchin, S.; Salmon, J.-C.; Carnat, A.-P.; Berger, T.; Bugaud, C.; Bosset, J.O.,
Identification de composés monoterpéniques, sesquiterpéniques et benzéniques dans un lait d'alpage très riche en ces substances,
Mitt. Lebensmittelunters. Hyg., 2002, 93, 199-216. [all data]
El-Ghorab, Fadel, et al., 2002
El-Ghorab, A.H.; Fadel, H.M.; El-Massry, K.F.,
The Egyptian Eucalyptus camaldulensis var. brevirostris: chemical compositions of the fruit volatile oil and antioxidant activity,
Flavour Fragr. J., 2002, 17, 4, 306-312, https://doi.org/10.1002/ffj.1085
. [all data]
El-Massry, El-Ghorab, et al., 2002
El-Massry, K.F.; El-Ghorab, A.H.; Farouk, A.,
Antioxidant activity and volatile components of Egyptian Artemisia judaica L.,
Food Chem., 2002, 79, 3, 331-336, https://doi.org/10.1016/S0308-8146(02)00164-4
. [all data]
Jayaprakasha, Rao, et al., 2002
Jayaprakasha, G.K.; Rao, L.J.; Sakariah, K.K.,
Chemical composition of volatile oil from Cinnamomum zeylanicum buds,
Z. Naturforsch. C:, 2002, 57c, 990-993, retrieved from http://www.znaturforsch.com/57c/s57c0990.pdf. [all data]
Juliani, Koroch, et al., 2002
Juliani, H.R., Jr.; Koroch, A.R.; Juliani, H.R.; Trippi, V.S.; Zygadlo, J.A.,
Intraespecific variation in leafoils of Lippia junelliana (mold.) tronc,
Biochem. Syst. Ecol., 2002, 30, 2, 163-170, https://doi.org/10.1016/S0305-1978(01)00067-9
. [all data]
Juliani and Simon, 2002
Juliani, H.R.; Simon, J.E.,
Antioxidant acitivity of basil
in Trends in new crops and new uses, Janick,J.; Whipkey,A., ed(s)., ASHA Press, Alexandria, Va, 2002, 575-579. [all data]
Kasali, Adio, et al., 2002
Kasali, A.A.; Adio, A.M.; Oyedeji, A.O.; Eshilokun, A.O.; Adefenwa, M.,
Volatile constituents of Boswellia serrata Roxb. (Burseraceae) bark,
Flavour Fragr. J., 2002, 17, 6, 462-464, https://doi.org/10.1002/ffj.1124
. [all data]
Mita, Tsitsimpikou, et al., 2002
Mita, E.; Tsitsimpikou, C.; Tsiveleka, L.; Petrakis, P.V.; Ortiz, A.; Vagias, C.; Roussis, V.,
Seasonal Variation of Oleoresin Terpenoids from Pinus halepensis and Pinus pinea and Host Selection of the Scale Insect Marchalina hellenica (Homoptera, Coccoidea, Margarodidae, Coelostonidiinae),
Holzforschung, 2002, 56, 6, 572-578, https://doi.org/10.1515/HF.2002.087
. [all data]
Palá-Paúl, Pérez-Alonso, et al., 2002
Palá-Paúl, J.; Pérez-Alonso, M.J.; Velasco-Negueruela, A.; Sanz, J.,
Essential oil composition of Schizogyne glaberrima DC, a species endemic to the Canary Islands,
Flavour Fragr. J., 2002, 17, 1, 13-14, https://doi.org/10.1002/ffj.1043
. [all data]
Palá-Paúl, Velasco-Negueruela, et al., 2002
Palá-Paúl, J.; Velasco-Negueruela, A.; Pérez-Alonso, M.J.; Sanz, J.,
Essential oil composition of the aerial parts of Cachrys sicula L.,
Flavour Fragr. J., 2002, 17, 1, 64-68, https://doi.org/10.1002/ffj.1042
. [all data]
Raina, Lal, et al., 2002
Raina, V.K.; Lal, R.K.; Tripathi, S.; Khan, M.; Syamasundar, K.V.; Srivastava, S.K.,
Erratum. Essential oil composition of genetically diverse stocks of Murraya koenigii from India,
Flavour Fragr. J., 2002, 17, 5, 404, https://doi.org/10.1002/ffj.1139
. [all data]
Raina, Srivastava, et al., 2002
Raina, V.K.; Srivastava, S.K.; Syamasunder, K.V.,
The essential oil of 'greater galangal' [Alpinia galanga (L.) Willd.] from the lower Himalayan region of India,
Flavour Fragr. J., 2002, 17, 5, 358-360, https://doi.org/10.1002/ffj.1105
. [all data]
Raina, Srivastava, et al., 2002, 2
Raina, V.K.; Srivastava, S.K.; Jain, N.; Ahmad, A.; Syamasundar, K.V.; Aggarwal, K.K.,
Essential oil composition of Curcuma longa L. cv. Roma from the plains of northern India,
Flavour Fragr. J., 2002, 17, 2, 99-102, https://doi.org/10.1002/ffj.1053
. [all data]
Rajeswara Rao, Kaul, et al., 2002
Rajeswara Rao, B.R.; Kaul, P.N.; Syamasundar, K.V.; Ramesh, S.,
Water soluble fractions of rose scented geranium (Pelargonium species) essential oil,
Bioresour. Technol., 2002, 84, 3, 243-246, https://doi.org/10.1016/S0960-8524(02)00057-3
. [all data]
Rajeswara Rao, 2002
Rajeswara Rao, B.R.,
Biomass yield, essential oil yield and essential oil composition of rose-scented geranium (Pelargonium species) as influenced by row spacings and intercropping with cornmint (Mentha arvensis L.f. piperascens Malinv. ex Holmes),
Ind. Crops Prod., 2002, 16, 2, 133-144, https://doi.org/10.1016/S0926-6690(02)00038-9
. [all data]
Rao B.R.R., 2002
Rao B.R.R.,
Biomass yield, essential oil yield and essential oil composition of rose-scented geranium (Pelargonium species) as influenced by row spacings and intercropping with cornmint (Mentha arvensis L.f. piperascens Malinv. ex Holmes),
Industrial Crops and Products, 2002, 16, 2, 133-144, https://doi.org/10.1016/S0926-6690(02)00038-9
. [all data]
Salido, Altarejos, et al., 2002
Salido, S.; Altarejos, J.; Nogueras, M.; Sánchez, A.; Pannecouque, C.; Witvrouw, M.; De Clercq, E.,
Chemical studies of essential oils of Juniperus oxycedrus ssp. badia,
J. Ethnopharmacol., 2002, 81, 1, 129-134, https://doi.org/10.1016/S0378-8741(02)00045-4
. [all data]
Shawl, Srivastava, et al., 2002
Shawl, A.S.; Srivastava, S.K.; Syamasundar, K.V.; Tripathi, S.; Raina, V.K.,
Essential oil composition of Achillea millefolium L. growing wild in Kashmir, India,
Flavour Fragr. J., 2002, 17, 3, 165-168, https://doi.org/10.1002/ffj.1074
. [all data]
Yáñez, Pinzón, et al., 2002
Yáñez, X.; Pinzón, M.L.; Solano, F.; Sánchez, L.R.,
Chemical composition of the essential oil of Psidium caudatum McVaugh,
Molecules, 2002, 7, 9, 712-716, https://doi.org/10.3390/70900712
. [all data]
Akrout, Chemli, et al., 2001
Akrout, A.; Chemli, R.; Chreïf, I.; Hammami, M.,
Analysis of the essential oil of Artemisia campestris L.,
Flavour Fragr. J., 2001, 16, 5, 337-339, https://doi.org/10.1002/ffj.1006
. [all data]
Jain, Aggarwal, et al., 2001
Jain, N.; Aggarwal, K.K.; Syamasundar, K.V.; Srivastava, S.K.; Kumar, S.,
Essential oil composition of geranium (Pelargonium sp.) from the plains of Northern India,
Flavour Fragr. J., 2001, 16, 1, 44-46, https://doi.org/10.1002/1099-1026(200101/02)16:1<44::AID-FFJ943>3.0.CO;2-X
. [all data]
Jain, Srivastava, et al., 2001
Jain, N.; Srivastava, S.K.; Aggarwal, K.K.; Ramesh, S.; Kumar, S.,
Essential oil composition of Zanthoxylum alatum seeds from northern India,
Flavour Fragr. J., 2001, 16, 6, 408-410, https://doi.org/10.1002/ffj.1024
. [all data]
Kitic, Palic, et al., 2001
Kitic, D.; Palic, R.; Ristic, M.; Sojanovic, G.; Jovanovic, T.,
The volatile constituents of Calamintha sylvatica Bromf. subsp. sylvatica,
Flavour Fragr. J., 2001, 16, 4, 257-258, https://doi.org/10.1002/ffj.995
. [all data]
Moreira, Sousa, et al., 2001
Moreira, D.L.; Sousa, P.O.; Pereira, N.A.; Cardoso, G.L.,
Effect of leaf essential oil from Piper solmsianum C.DC. in mice behaviour,
An. Acad. Bras. Cienc., 2001, 73, 1, 1-7, https://doi.org/10.1590/S0001-37652001000100004
. [all data]
Nagalakshmi, Thangadurai, et al., 2001
Nagalakshmi, M.A.H.; Thangadurai, D.; Anuradha, T.; Pullaiah, T.,
Essential oil constituents of Melia dubia, a wild relative of Azadirachta indica growing in the Eastern Ghats of Peninsular India,
Flavour Fragr. J., 2001, 16, 4, 241-244, https://doi.org/10.1002/ffj.986
. [all data]
Palá-Paúl, Velasco-Negueruela, et al., 2001
Palá-Paúl, J.; Velasco-Negueruela, A.; Pérez-Alonso, M.J.; Sanz, J.,
Analysis of the volatile components of Argyranthemum adauctum (Link.) Humphries by gas chromatography-mass spectrometry,
J. Chromatogr. A, 2001, 923, 1-2, 295-298, https://doi.org/10.1016/S0021-9673(01)01003-2
. [all data]
Raina, Srivastava, et al., 2001
Raina, V.K.; Srivastava, S.K.; Aggarwal, K.K.; Ramesh, S.; Kumar, S.,
Essential oil composition of Cinnamomum zeylanicum Blume leaves from Little Andaman, India,
Flavour Fragr. J., 2001, 16, 5, 374-376, https://doi.org/10.1002/ffj.1016
. [all data]
Senatore and Rigano, 2001
Senatore, F.; Rigano, D.,
Essential oil of two Lippia spp. (Verbenaceae) growing wild in Guatemala,
Flavour Fragr. J., 2001, 16, 3, 169-171, https://doi.org/10.1002/ffj.972
. [all data]
Tzakou and Couladis, 2001
Tzakou, O.; Couladis, M.,
The essential oil of Micromeria graeca (L.) Bentham et Reichenb. growing in Greece,
Flavour Fragr. J., 2001, 16, 2, 107-109, https://doi.org/10.1002/ffj.955
. [all data]
Abella, Cortella, et al., 2000
Abella, L.; Cortella, A.R.; Velasco-Negueruela, A.; Pérez-Alonso, M.J.,
Ethnobotany, volatile oils and secretion tissues of Werneria poposa from Argentina,
Pharm. Biol., 2000, 38, 3, 197-203, https://doi.org/10.1076/1388-0209(200007)3831-SFT197
. [all data]
Adams, 2000
Adams, R.P.,
Systematics of smooth leaf margin Juniperus of the western hemisphere based on leaf essential oils and RAPD DNA fingerprinting,
Biochem. Syst. Ecol., 2000, 28, 2, 149-162, https://doi.org/10.1016/S0305-1978(99)00047-2
. [all data]
Adams, 2000, 2
Adams, R.P.,
Systematics of Juniperus section Juniperus based on leaf essential oils and random amplified polymorphic DNAs (RAPDs),
Biochem. Syst. Ecol., 2000, 28, 6, 515-528, https://doi.org/10.1016/S0305-1978(99)00089-7
. [all data]
Adams, 2000, 3
Adams, R.P.,
Systematics of the one seeded Juniperus of the eastern hemisphere based on leaf essential oils and random amplified polymorphic DNAs (RAPDs),
Biochem. Syst. Ecol., 2000, 28, 6, 529-543, https://doi.org/10.1016/S0305-1978(99)00096-4
. [all data]
Adams, 2000, 4
Adams, R.P.,
The serrate leaf margined Juniperus (Section Sabina) of the western hemisphere: systematics and evolution based on leaf essential oils and Random Amplified Polymorphic DNAs (RAPDs),
Biochem. Syst. Ecol., 2000, 28, 10, 975-989, https://doi.org/10.1016/S0305-1978(00)00022-3
. [all data]
Kardali, Velasco-Negueruela, et al., 2000
Kardali, M.; Velasco-Negueruela, A.; Pérez-Alonso, M.,
Essential Oil Constituents of Sideritis ibanyezii Pau,
Botanica Complutensis, 2000, 24, 101-106. [all data]
Ramos, Siani, et al., 2000
Ramos, M.F.S.; Siani, A.C.; Tappin, M.R.R.; Guimaraes, A.C.; Lahoz, J.E.; Ribeiro, J.E.L.S.,
Essential oils from oleoresins of Protium spp. of the Amazon region,
Flavour Fragr. J., 2000, 15, 6, 383-387, https://doi.org/10.1002/1099-1026(200011/12)15:6<383::AID-FFJ927>3.0.CO;2-X
. [all data]
Rao, Kaul, et al., 2000
Rao, B.R.R.; Kaul, P.N.; Mallavarapu, G.R.; Ramesh, S.,
First observation of little leaf disease and its impact on the yield and composition of the essential oil of rose-scented geranium (Pelargonium sp.),
Flavour Fragr. J., 2000, 15, 3, 137-140, https://doi.org/10.1002/1099-1026(200005/06)15:3<137::AID-FFJ880>3.0.CO;2-A
. [all data]
Rao, Sastry, et al., 2000
Rao, B.R.R.; Sastry, K.P.; Saleem, S.M.; Rao, E.V.S.P.; Syamasundar, K.V.; Ramesh, S.,
Volatile flower oils of three genotypes of rose-scented geranium (Pelargonium sp.),
Flavour Fragr. J., 2000, 15, 2, 105-107, https://doi.org/10.1002/(SICI)1099-1026(200003/04)15:2<105::AID-FFJ875>3.0.CO;2-G
. [all data]
Roussis, Tsoukatou, et al., 2000
Roussis, V.; Tsoukatou, M.; Petrakis, P.V.; Chinou, I.; Skoula, M.; Harborne, J.B.,
Volatile constituents of four Helichrysum species growing in Greece,
Biochem. Syst. Ecol., 2000, 28, 2, 163-175, https://doi.org/10.1016/S0305-1978(99)00046-0
. [all data]
Tzakou, Harvala, et al., 2000
Tzakou, O.; Harvala, C.; Galati, E.M.; Sanogo, R.,
Essential oil composition of Nepeta argolica Borey et Chaub. subsp. argolica,
Flavour Fragr. J., 2000, 15, 2, 115-118, https://doi.org/10.1002/(SICI)1099-1026(200003/04)15:2<115::AID-FFJ877>3.0.CO;2-9
. [all data]
Adams, 1999
Adams, R.P.,
Systematics of multi-seeded eastern hemisphere Juniperus based on leaf essential oils and RAPD DNA fingerprinting,
Biochem. Syst. Ecol., 1999, 27, 7, 709-725, https://doi.org/10.1016/S0305-1978(99)00016-2
. [all data]
Jantan I. and Ahmad A.S., 1999
Jantan I.; Ahmad A.S.,
Oleoresins of three pinus species from malaysian pine plantations,
ASEAN Review of BiodiversityEnvironment Conservation, 1999, November-December, 1-9. [all data]
John, Rao, et al., 1999
John, K.S.; Rao, L.J.M.; Bhat, S.G.; Rao, U.J.S.P.,
Characterization of aroma components of sap from different Indian mango varieties,
Phytochemistry, 1999, 52, 5, 891-894, https://doi.org/10.1016/S0031-9422(99)00296-4
. [all data]
Kaul, Gujral, et al., 1999
Kaul, V.K.; Gujral, R.K.; Singh, B.,
Volatile constituents of the essential oil of flowers of Rosa brunonii Lindl,
Flavour Fragr. J., 1999, 14, 1, 9-11, https://doi.org/10.1002/(SICI)1099-1026(199901/02)14:1<9::AID-FFJ761>3.0.CO;2-C
. [all data]
Kuiate, Zollo, et al., 1999
Kuiate, J.-R.; Zollo, P.-H.A.; Lamaty, G.; Menut, C.; Bessière, J.-M.,
Composition of the essential oils from the leaves of two varieties of Aspilia africana (Pers.) C. D. Adams from Cameroon,
Flavour Fragr. J., 1999, 14, 3, 167-169, https://doi.org/10.1002/(SICI)1099-1026(199905/06)14:3<167::AID-FFJ802>3.0.CO;2-O
. [all data]
Lopes, Kato, et al., 1999
Lopes, N.P.; Kato, M.J.; Andrade, E.H.A.; Maia, J.G.S.; Yoshida, M.; Planchart, A.R.; Katzin, A.M.,
Antimalarial use of volatile oil from leaves of Virola surinamensis (Rol.) Warb. by Waiãpi Amazon Indians,
J. Ethnopharmacol., 1999, 67, 3, 313-319, https://doi.org/10.1016/S0378-8741(99)00072-0
. [all data]
Sajjadi and Ghassemi, 1999
Sajjadi, S.E.; Ghassemi, N.,
Volatile constituents of Nepeta glomerulosa Boiss. subsp. carmanica,
Flavour Fragr. J., 1999, 14, 5, 265-267, https://doi.org/10.1002/(SICI)1099-1026(199909/10)14:5<265::AID-FFJ822>3.0.CO;2-A
. [all data]
Senatore and de Feo, 1999
Senatore, F.; de Feo, V.,
Chemical composition of the essential oil from Tagetes mandonii Sch. Bip. (Asteraceae),
Flavour Fragr. J., 1999, 14, 1, 32-34, https://doi.org/10.1002/(SICI)1099-1026(199901/02)14:1<32::AID-FFJ772>3.0.CO;2-7
. [all data]
Siani, Ramos, et al., 1999
Siani, A.C.; Ramos, M.F.S.; Menezes-de-Lima, O., Jr.; Ribeiro-dos-Santos, R.; Fernadez-Ferreira, E.; Soares, R.O.A.; Rosas, E.C.; Susunaga, G.S.; Guimarães, A.C.; Zoghbi, M.G.B.; Henriques, M.G.M.O.,
Evaluation of anti-inflammatory-related activity of essential oils from the leaves and resin of species of Protium,
J. Ethnopharmacol., 1999, 66, 1, 57-69, https://doi.org/10.1016/S0378-8741(98)00148-2
. [all data]
da Silva, Andrade, et al., 1999
da Silva, M.H.L.; Andrade, E.H.A.; Zoghbi, M.G.B.; Luz, A.I.R.; da Silva, J.D.; Maia, J.G.S.,
The essential oils of Lantana camara L. occurring in North Brazil,
Flavour Fragr. J., 1999, 14, 4, 208-210, https://doi.org/10.1002/(SICI)1099-1026(199907/08)14:4<208::AID-FFJ811>3.0.CO;2-F
. [all data]
da Silva, Zoghbi, et al., 1999
da Silva, M.H.L.; Zoghbi, M.G.B.; Andrade, E.H.A.; Maia, J.G.S.,
The essential oils of Peperomia pellucida Kunth and P. circinnata link var. circinnata,
Flavour Fragr. J., 1999, 14, 5, 312-314, https://doi.org/10.1002/(SICI)1099-1026(199909/10)14:5<312::AID-FFJ835>3.0.CO;2-B
. [all data]
Vera and Chane-Ming, 1999
Vera, R.R.; Chane-Ming, J.,
Chemical composition of the essential oil of marjoram (Origanum majorana L.) from Reunion Island,
Food Chem., 1999, 66, 2, 143-145, https://doi.org/10.1016/S0308-8146(98)00018-1
. [all data]
Adegoke, Rao, et al., 1998
Adegoke, G.O.; Rao, L.J.M.; Shankaracharya, N.B.,
A comparison of the essential oils of Aframomum daniellii (Hook. f.) K. Schum. and Amomum subulatum Roxb,
Flavour Fragr. J., 1998, 13, 5, 349-352, https://doi.org/10.1002/(SICI)1099-1026(1998090)13:5<349::AID-FFJ758>3.0.CO;2-O
. [all data]
Bylaite, Venskutonis, et al., 1998
Bylaite, E.; Venskutonis, R.P.; Roozen, J.P.,
Influence of harvesting time on the composition of volatile components in different anatomical parts of lovage (Levisticum officinale Koch.),
J. Agric. Food Chem., 1998, 46, 9, 3735-3740, https://doi.org/10.1021/jf9800559
. [all data]
de Feo, Porta, et al., 1998
de Feo, V.; Porta, G.D.; Urrunaga Soria, E.; Urrunaga Soria, R.; Senatore, F.,
Composition of the essential oil of Tagetes filifolia Lag.,
Flavour Fragr. J., 1998, 13, 3, 145-147, https://doi.org/10.1002/(SICI)1099-1026(199805/06)13:3<145::AID-FFJ707>3.0.CO;2-Q
. [all data]
Kaul and Vats, 1998
Kaul, V.K.; Vats, S.K.,
Essential oil composition of Bothriochloa pertusa and phyletic relationship in aromatic grasses,
Biochem. Syst. Ecol., 1998, 26, 3, 347-356, https://doi.org/10.1016/S0305-1978(97)00103-8
. [all data]
Kulkarni, Mallavarapu, et al., 1998
Kulkarni, R.N.; Mallavarapu, G.R.; Baskaran, K.; Ramesch, S.; Kumar, S.,
Composition of the essential oils of two isomenthone-rich variants of geranium (Pelargonium sp.),
Flavour Fragr. J., 1998, 13, 6, 389-392, https://doi.org/10.1002/(SICI)1099-1026(199811/12)13:6<389::AID-FFJ757>3.0.CO;2-2
. [all data]
Mallavarapu, Rao, et al., 1998
Mallavarapu, G.R.; Rao, B.R.R.; Kaul, P.N.; Ramesh, S.; Bhattacharya, A.K.,
Volatile constituents of the essential oils of the seeds and the herb of palmarosa (Cymbopogon martinii (Roxb.) Wats. var. motia Burk.),
Flavour Fragr. J., 1998, 13, 3, 167-169, https://doi.org/10.1002/(SICI)1099-1026(199805/06)13:3<167::AID-FFJ719>3.0.CO;2-B
. [all data]
Senatore, 1998
Senatore, F.,
Volatile constituents of Minthostachys setosa (Briq.) Epl. (Lamiaceae) from Peru,
Flavour Fragr. J., 1998, 13, 4, 263-265, https://doi.org/10.1002/(SICI)1099-1026(1998070)13:4<263::AID-FFJ738>3.0.CO;2-H
. [all data]
Zoghbi, Andrade, et al., 1998
Zoghbi, M.G.B.; Andrade, E.H.A.; Santos, A.S.; Silva, M.H.L.; Maia, J.G.S.,
Essential oils of Lippia alba (Mill.) N. E. Br growing wild in the Brazilian Amazon,
Flavour Fragr. J., 1998, 13, 1, 47-48, https://doi.org/10.1002/(SICI)1099-1026(199801/02)13:1<47::AID-FFJ690>3.0.CO;2-0
. [all data]
Breheret, Talou, et al., 1997
Breheret, S.; Talou, T.; Rapior, S.; Bessiére, J.-M.,
Monoterpenes in the aroma of fresh wild mushrooms (Basidiomycetes),
J. Agric. Food Chem., 1997, 45, 3, 831-836, https://doi.org/10.1021/jf960417h
. [all data]
Fiorini, Fourasté, et al., 1997
Fiorini, C.; Fourasté, I.; David, B.; Bessière, J.M.,
Composition of the flower, leaf, and stem essential oils from Laurus nobilis L.,
Flavour Fragr. J., 1997, 12, 2, 91-93, https://doi.org/10.1002/(SICI)1099-1026(199703)12:2<91::AID-FFJ623>3.0.CO;2-3
. [all data]
Fournier, Hadjiakhoondi, et al., 1997
Fournier, G.; Hadjiakhoondi, A.; Leboeuf, M.; Cavé, A.; Charles, B.,
Essential oils of annonaceae. Part VII. Essential oils of Monanthotaxis declina (Sprague) verdcourt and Unonopsis guatterioides R. E. Fries,
Flavour Fragr. J., 1997, 12, 2, 95-98, https://doi.org/10.1002/(SICI)1099-1026(199703)12:2<95::AID-FFJ611>3.0.CO;2-Z
. [all data]
Jayaprakasha, Jaganmohan Rao, et al., 1997
Jayaprakasha, G.K.; Jaganmohan Rao, L.; Sakariah, K.K.,
Chemical composition of the volatile oil from the fruits of Cinnamomum zeylanicum blume,
Flavour Fragr. J., 1997, 12, 5, 331-333, https://doi.org/10.1002/(SICI)1099-1026(199709/10)12:5<331::AID-FFJ663>3.0.CO;2-X
. [all data]
Senatore, Urrunaga Soria, et al., 1997
Senatore, F.; Urrunaga Soria, E.; Urrunaga Soria, R.; Porta, G.D.; Taddeo, R.; de Feo, V.,
Essential oil of Eremocharis triradiata (Wolff.) Johnston (Apiaceae) growing wild in Perú,
Flavour Fragr. J., 1997, 12, 4, 257-259, https://doi.org/10.1002/(SICI)1099-1026(199707)12:4<257::AID-FFJ645>3.0.CO;2-4
. [all data]
Tellez, Estell, et al., 1997
Tellez, M.R.; Estell, R.E.; Fredrickson, E.L.; Havstad, K.M.,
Essential oil of Dyssodia acerosa DC.,
J. Agric. Food Chem., 1997, 45, 8, 3276-3278, https://doi.org/10.1021/jf9701502
. [all data]
Jantan, Ahmad, et al., 1996
Jantan, I.; Ahmad, A.S.; Ahmad, A.R.; Ali, N.A.M.; Ayop, N.,
Chemical composition of some citrus oils from Malaysia,
J. Essent. Oil Res., 1996, 8, 6, 627-632, https://doi.org/10.1080/10412905.1996.9701030
. [all data]
Padrayuttawat, Tamura, et al., 1996
Padrayuttawat, A.; Tamura, H.; Yamao, M.,
A split injection system for the analysis of purge and trap headspace of the volatile components in Citrus sudachi,
J. Hi. Res. Chromatogr., 1996, 19, 6, 365-369, https://doi.org/10.1002/jhrc.1240190613
. [all data]
von Poser, Menut, et al., 1996
von Poser, G.L.; Menut, C.; Toffoli, M.E.; Vérin, P.; Sobral, M.; Bessière, J.-M.; Lamaty, G.; Henriques, A.T.,
Essential oil composition and allelopathic effect of the Brazilian Lamiaceae Hesperozygis ringens (Benth.) Epling and Hesperozygis rhododon Epling,
J. Agric. Food Chem., 1996, 44, 7, 1829-1832, https://doi.org/10.1021/jf950653c
. [all data]
Jantan, Ali, et al., 1995
Jantan, I.; Ali, N.A.M.; Ahmad, A.S.; Ahmad, A.R.,
Constituents of the essential oil of Leptospermum javanicum blume from peninsular Malaysia,
Flavour Fragr. J., 1995, 10, 4, 255-258, https://doi.org/10.1002/ffj.2730100406
. [all data]
Loayza, Abujder, et al., 1995
Loayza, I.; Abujder, D.; Aranda, R.; Jakupovic, J.; Collin, G.; Deslauriers, H.; Jean, F.-I.,
Essential oils of Baccharis salicifolia, B. latifolia and B. dracunculifolia,
Phytochemistry, 1995, 38, 2, 381-389, https://doi.org/10.1016/0031-9422(94)00628-7
. [all data]
Menut, Molangui, et al., 1995
Menut, C.; Molangui, T.; Lamaty, G.E.; Bessière, J.-M.; Habimana, J.-B. Menut.; Molangui, T.; Lamaty, G.E.; Bessière, J.-M.; Habimana, J.-B.,
Aromatic plants of tropical Central Africa. 23. Chemical composition of leaf essential oils of Eucalyptus goniocalyx F. Muell. and Eucalyptus patens Benth. grown in Rwanda,
J. Agric. Food Chem., 1995, 43, 5, 1267-1271, https://doi.org/10.1021/jf00053a026
. [all data]
Saad, El-Sharkawy, et al., 1995
Saad, H.-E.A.; El-Sharkawy, S.H.; Halim, A.F.,
Essential oils of Daucus carota ssp. maximus,
Pharm. Acta Helv., 1995, 70, 1, 79-84, https://doi.org/10.1016/0031-6865(94)00054-Y
. [all data]
Ramarathnam, Rubin, et al., 1993
Ramarathnam, N.; Rubin, L.J.; Diosady, L.L.,
Studies on meat flavor. 4. Fractionation, characterization, and quantitation of volatiles from uncured and cured beef and chicken,
J. Agric. Food Chem., 1993, 41, 6, 939-945, https://doi.org/10.1021/jf00030a020
. [all data]
Wong and Tie, 1993
Wong, K.C.; Tie, D.Y.,
The Essential Oil of the Leaves of Murraya koenigii Spreng.,
J. Essent. Oil Res., 1993, 5, 4, 371-374, https://doi.org/10.1080/10412905.1993.9698245
. [all data]
Rembold, Wallner, et al., 1989
Rembold, H.; Wallner, P.; Nitz, S.; Kollmannsberger, H.; Drawert, F.,
Volatile components of chickpea (Cicer arietinum L.) seed,
J. Agric. Food Chem., 1989, 37, 3, 659-662, https://doi.org/10.1021/jf00087a018
. [all data]
Bartley, 1988
Bartley, J.P.,
Volatile flavours of Australian tropical fruits,
Biomed. Environ. Mass Spectrom., 1988, 16, 1-12, 201-205, https://doi.org/10.1002/bms.1200160136
. [all data]
Bicchi, Frattini, et al., 1988
Bicchi, C.; Frattini, C.; Nano, G.M.; D'Amato, A.,
On column injection-dual channel analysis of essential oils,
J. Hi. Res. Chromatogr. Chromatogr. Comm., 1988, 11, 1, 56-60, https://doi.org/10.1002/jhrc.1240110115
. [all data]
Ekundayo, Laakso, et al., 1988
Ekundayo, O.; Laakso, I.; Adegbola, R.-M.; Oguntimein, B.; Sofowora, A.; Hiltunen, R.,
Essential oil constituents of Ashanti pepper (Piper guineense) fruits (berries),
J. Agric. Food Chem., 1988, 36, 5, 880-882, https://doi.org/10.1021/jf00083a001
. [all data]
Gaydou, Randriamiharisoa, et al., 1986
Gaydou, E.M.; Randriamiharisoa, R.; Bianchini, J.-P.,
Composition of the essential oil of ylang-ylang (Canaga odorata Hook Fil. et Thomson forma genuina) from Madagascar,
J. Agric. Food Chem., 1986, 34, 3, 481-487, https://doi.org/10.1021/jf00069a028
. [all data]
Burns and Tingey, 1983
Burns, W.F.; Tingey, D.T.,
GC/MS Analysis of biogenic volatile hydrocarbons on a chemically-bonded fused silica column,
J. Chromatogr. Sci., 1983, 21, 8, 341-345, https://doi.org/10.1093/chromsci/21.8.341
. [all data]
Greenberg, 1981
Greenberg, M.J.,
Characterization of meat and bone meal flavor volatiles,
J. Agric. Food Chem., 1981, 29, 6, 1276-1280, https://doi.org/10.1021/jf00108a043
. [all data]
de Marchese, de Heluani, et al., 2007
de Marchese, M.J.A.; de Heluani, C.S.; Catalán, C.A.N.; Griffin, C.A.; Vaughn, J.B., Jr.; Herz, W.,
Incisol, an alcohol with a novel sesquiterpene skeleton from Xenophyllum incisum,
Biochem. Syst. Ecol., 2007, 35, 3, 169-175, https://doi.org/10.1016/j.bse.2006.10.006
. [all data]
Khan, Verma, et al., 2006
Khan, M.; Verma, S.C.; Srivastava, S.K.; Shawl, A.S.; Syamsundar, K.V.; Khanuja, S.P.S.; Kumar, T.,
Essential oil composition of Taxus wallichiana Zucc. from the Northern Himalayan region of India,
Flavour Fragr. J., 2006, 21, 5, 772-775, https://doi.org/10.1002/ffj.1682
. [all data]
Lima, Barros, et al., 2005
Lima, M.A.S.; Barros, M.C.P.; Pinheiro, S.M.; do Nascimento, R.F.; de Abreu Matos, F.J.; Silveira, E.R.,
Volatile compositions of two Asteraceae from the north-east of Brazil: Ageratum conyzoides and Acritopappus confertus (Eupatorieae),
Flavour Fragr. J., 2005, 20, 6, 559-561, https://doi.org/10.1002/ffj.1483
. [all data]
Radusiene, Judzentiene, et al., 2005
Radusiene, J.; Judzentiene, A.; Bernotiene, G.,
Essential oil composition and variability of Hypericum perforatum L. growing in Lithuania,
Biochem. Syst. Ecol., 2005, 33, 2, 113-124, https://doi.org/10.1016/j.bse.2004.06.010
. [all data]
Tuberoso, Kowalczyk, et al., 2005
Tuberoso, C.I.G.; Kowalczyk, A.; Coroneo, V.; Russo, M.T.; Dessì, S.; Cabras, P.,
Chemical Composition and Antioxidant, Antimicrobial, and Antifungal Activities of the Essential Oil of Achillea ligustica All.,
J. Agric. Food Chem., 2005, 53, 26, 10148-10153, https://doi.org/10.1021/jf0518913
. [all data]
Dwivedi, Khan, et al., 2004
Dwivedi, S.; Khan, M.; Srivastava, S.K.; Syamasunnder, K.V.; Srivastava, A.,
Essential oil composition of different accessions of Mentha × piperita L. grown on the northern plains of India,
Flavour Fragr. J., 2004, 19, 5, 437-440, https://doi.org/10.1002/ffj.1333
. [all data]
Araújo, Silveira, et al., 2003
Araújo, E.C.C.; Silveira, E.R.; Lima, M.A.S.; Neto, M.A.; de Andrade, I.L.; Lima, M.A.A.; Santiago, G.M.P.; Mesquita, A.L.M.,
Insecticidal activity and chemical composition of volatile oils from Hyptis martiusii Benth,
J. Agric. Food Chem., 2003, 51, 13, 3760-3762, https://doi.org/10.1021/jf021074s
. [all data]
Daferera, Ziogas, et al., 2003
Daferera, D.J.; Ziogas, B.N.; Polissiou, M.G.,
The effectiveness of plant essential oils on the growth of Botrytis cinerea, Fusarium sp. and Clavibacter michiganensis subsp. michiganensis,
Crop Prot., 2003, 22, 1, 39-44, retrieved from http://www.elsevier.com/gej-ng/10/25/40/84/25/31/article.pdf, https://doi.org/10.1016/S0261-2194(02)00095-9
. [all data]
Khan, Srivastava, et al., 2003
Khan, M.; Srivastava, S.K.; Jain, N.; Syamasundar, K.V.; Yadav, A.K.,
Chemical composition of fruit and stem essential oils of Lantana camara from northern India,
Flavour Fragr. J., 2003, 18, 5, 376-379, https://doi.org/10.1002/ffj.1197
. [all data]
Shellie and Marriott, 2003
Shellie, R.A.; Marriott, P.J.,
Comprehensive two-dimensional gas chromatography-mass spectrometry analysis of Pelargonium graveolens essential oil using rapid scanning quadrupole mass spectrometry,
Analyst, 2003, 128, 7, 879-883, https://doi.org/10.1039/b304371a
. [all data]
El-Shazly, Dorai, et al., 2002
El-Shazly, A.; Dorai, G.; Wink, M.,
Chemical composition and biological activity of the essential oils of Senecio aegyptus var. discoideus Boiss.,
Z. Naturforsch., 2002, 57c, 434-439. [all data]
El-Shazly, Dorai, et al., 2002, 2
El-Shazly, A.; Dorai, G.; Wink, M.,
Composition and antimicrobial activity of essential oil and hexane-ether extract of Tanacetum santolinoides (DC.) Feinbr. and Fertig,
Z. Naturforsch., 2002, 57c, 620-623. [all data]
Khan, Srivastava, et al., 2002
Khan, M.; Srivastava, S.K.; Syamasundar, K.V.; Singh, M.; Naqvi, A.A.,
Chemical composition of leaf and flower essential oil of Lantana camara from India,
Flavour Fragr. J., 2002, 17, 1, 75-77, https://doi.org/10.1002/ffj.1047
. [all data]
Bizzo, Lopes, et al., 2001
Bizzo, H.R.; Lopes, D.; Abdala, R.V.; Pimentel, F.A.; de Souza, J.A.; Pereira, M.V.G.; Bergter, L.; Guimaraes, E.F.,
Sarisan from leaves of Piper affinis hispidinervum C. DC (long pepper),
Flavour Fragr. J., 2001, 16, 2, 113-115, https://doi.org/10.1002/ffj.957
. [all data]
Frizzo, Serafini, et al., 2001
Frizzo, C.D.; Serafini, L.A.; Dellacassa, E.; Lorenzo, D.; Moyna, P.,
Essential oil of Baccharis uncinella DC. from Southern Brazil,
Flavour Fragr. J., 2001, 16, 4, 286-288, https://doi.org/10.1002/ffj.998
. [all data]
Novak, Zitterl-Eglseer, et al., 2001
Novak, J.; Zitterl-Eglseer, K.; Deans, S.G.; Franz, C.M.,
Essential oils of different cultivars of Cannabis sativa L. and their antimicrobial activity,
Flavour Fragr. J., 2001, 16, 4, 259-262, https://doi.org/10.1002/ffj.993
. [all data]
Khouri, Usubillaga, et al., 2000
Khouri, N.; Usubillaga, A.; Rojas, L.B.; Galarraga, F.,
The essential oil of Espeletia weddellii Sch. Bip. ex Wedd.,
Flavour Fragr. J., 2000, 15, 4, 263-265, https://doi.org/10.1002/1099-1026(200007/08)15:4<263::AID-FFJ907>3.0.CO;2-Q
. [all data]
Maia, Andrade, et al., 2000
Maia, J.G.S.; Andrade, E.H.A.; Zoghbi, M.G.B.,
Volatile constituents of the leaves, fruits and flowers of cashew ( Anacardium occidentaleL.),
J. Food Comp. Anal., 2000, 13, 3, 227-232, https://doi.org/10.1006/jfca.2000.0894
. [all data]
Rojas and Usubillaga, 2000
Rojas, L.B.; Usubillaga, A.,
Composition of the essential oil fo Satureja brownei (SW.) Briq. from Venezuela,
Flavour Fragr. J., 2000, 15, 1, 21-22, https://doi.org/10.1002/(SICI)1099-1026(200001/02)15:1<21::AID-FFJ861>3.0.CO;2-G
. [all data]
Adams, 1998
Adams, R.P.,
The essential oils and chemotaxonomy of Juniperus sect. Juniperus,
Biochem. Syst. Ecol., 1998, 26, 6, 637-645, https://doi.org/10.1016/S0305-1978(98)00020-9
. [all data]
Santos, Andrade, et al., 1998
Santos, A.S.; Andrade, E.H.A.; Zoghbi, M.G.B.; Maia, J.G.S.,
Volatile constituents of fruits of Annona glabra L. from Brazil,
Flavour Fragr. J., 1998, 13, 3, 148-150, https://doi.org/10.1002/(SICI)1099-1026(199805/06)13:3<148::AID-FFJ711>3.0.CO;2-Y
. [all data]
MacLeod, MacLeod, et al., 1988
MacLeod, A.J.; MacLeod, G.; Subramanian, G.,
Volatile aroma constituents of orange,
Phytochemistry, 1988, 27, 7, 2185-2188, https://doi.org/10.1016/0031-9422(88)80123-7
. [all data]
Okamoto, Ellison, et al., 1981
Okamoto, R.A.; Ellison, B.O.; Kepner, R.E.,
Volatile terpenes in Sequoia sempervirens foliage. Changes in composition during maturation,
J. Agric. Food Chem., 1981, 29, 2, 324-326, https://doi.org/10.1021/jf00104a026
. [all data]
Malingré and Maarse, 1974
Malingré, T.M.; Maarse, H.,
Composition of the essential oil of Mentha aquatica,
Phytochemistry, 1974, 13, 8, 1531-1535, https://doi.org/10.1016/0031-9422(74)80322-5
. [all data]
Minyard, Tumlinson, et al., 1967
Minyard, J.P.; Tumlinson, J.H.; Thompson, A.C.; Hedin, P.A.,
Constituents of the cotton bud. The carbonyl compounds,
J. Agric. Food Chem., 1967, 15, 3, 517-524, https://doi.org/10.1021/jf60151a021
. [all data]
Luisetti and Yunes, 1971
Luisetti, R.U.; Yunes, R.A.,
Correlation between molecular structure and GC retention of mono and sesquiterpenic hydrocarbons: The influence of shielding steric effects; a new polarity factor for stationary phases,
J. Chromatogr. Sci., 1971, 9, 10, 624-631, https://doi.org/10.1093/chromsci/9.10.624
. [all data]
Umano, Hagi, et al., 1994
Umano, K.; Hagi, Y.; Tamura, T.; Shoji, A.; Shibamoto, T.,
Identification of volatile compounds isolated from round kumquat (Fortunella japonica Swingle),
J. Agric. Food Chem., 1994, 42, 9, 1888-1890, https://doi.org/10.1021/jf00045a011
. [all data]
Umano and Shibamoto, 1988
Umano, K.; Shibamoto, T.,
A new method of headspace sampling: grapefruit volatiles
in Flavors and Fragrances: A World Perspective. Proceedings of the 10th International Congress of Essential Oils, Fragrances and Flavors, Lawrence,B.M.; Mookherjee,B.D.; Willis,B.J., ed(s)., Elsevier, New York, 1988, 981-998. [all data]
Randriamiharisoa and Gaydou, 1987
Randriamiharisoa, R.P.; Gaydou, E.M.,
Composition of Palmarosa (Cymbopogon martinii) essential oil from Madagascar,
J. Agric. Food Chem., 1987, 35, 1, 62-66, https://doi.org/10.1021/jf00073a015
. [all data]
Wyllie, Cook, et al., 1987
Wyllie, S.G.; Cook, D.; Brophy, J.J.; Richter, K.M.,
Volatile flavor components of Annona atemoya (custard apple),
J. Agric. Food Chem., 1987, 35, 5, 768-770, https://doi.org/10.1021/jf00077a029
. [all data]
Bernhard, Shibamoto, et al., 1983
Bernhard, R.A.; Shibamoto, T.; Yamaguchi, K.; White, E.,
The volatile constituents of Schinus molle L.,
J. Agric. Food Chem., 1983, 31, 2, 463-466, https://doi.org/10.1021/jf00116a075
. [all data]
Tressl, Friese, et al., 1978
Tressl, R.; Friese, L.; Fendesack, F.; Köppler, H.,
Studies of the volatile composition of hops during storage,
J. Agric. Food Chem., 1978, 26, 6, 1426-1430, https://doi.org/10.1021/jf60220a036
. [all data]
Bendahou, Muselli, et al., 2008
Bendahou, M.; Muselli, A.; Grignon-Dubois, M.; Benyoucef, M.; Desjobert, J.-M.; Bernardini, A.-F.; Costa, J.,
Antimicrobial activity and chemical composition of Origanum glandulosum Desf. essential oil and extract obtained by microwave extraction: Comparison with hydrodistillation,
Food Chem., 2008, 106, 1, 132-139, https://doi.org/10.1016/j.foodchem.2007.05.050
. [all data]
Cho, Namgung, et al., 2008
Cho, I.H.; Namgung, H.-J.; Choi, H.-K.; Kim, Y.-S.,
Volatiles and key odorants in the pileus and stipe of pine-mushroom (Tricholoma matsutake Sing.),
Food Chem., 2008, 106, 1, 71-76, https://doi.org/10.1016/j.foodchem.2007.05.047
. [all data]
Baccouri, Ben Temime, et al., 2007
Baccouri, B.; Ben Temime, S.; Campeol, E.; Cioni, P.L.; Daoud, D.; Zarrouk, M.,
Application of solid-phase microextraction to the analysis of volatile compounds in virgin olive oils from five new cultivars,
Food Chem., 2007, 102, 3, 850-856, https://doi.org/10.1016/j.foodchem.2006.06.012
. [all data]
Balbontin, Gaete-Eastman, et al., 2007
Balbontin, C.; Gaete-Eastman, C.; Vergara, M.; Herrera, R.; Moya-Leon, M.A.,
Treatment with 1-MCP and the role of ethylene in aroma development of mountain papaya fruit,
Postharvest Biol. Technol., 2007, 43, 1, 67-77, https://doi.org/10.1016/j.postharvbio.2006.08.005
. [all data]
Belsito E.L., Carbone C., et al., 2007
Belsito E.L.; Carbone C.; Di Gioia M.L.; Leggio A.; Liguoiri A.; Perri F.; Siciliano C.; Viscomi M.C.,
Comparison of the volatile constituents in cold-pressed bergamot oil and a volatile oil isolated by vacuum distillation,
J. Agric. Food Chem., 2007, 55, 19, 7847-7851, https://doi.org/10.1021/jf070997q
. [all data]
Benkaci-Ali, Baaliouamer, et al., 2007
Benkaci-Ali, F.; Baaliouamer, A.; Meklati, B.Y.; Chemat, F.,
Chemical composition of seed essential oils from Algerian Nigella sativa extracted by microwave and hydrodistillation,
Flavour Fragr. J., 2007, 22, 2, 148-153, https://doi.org/10.1002/ffj.1773
. [all data]
Benzo, Gilardoni, et al., 2007
Benzo, M.; Gilardoni, G.; Gandini, C.; Caccialanza, G.; Finzi, P.V.; Vidari, G.; Abdo, S.; Layedra, P.,
Determination of the threshold odor concentration of main odorants in essential oils using gas chromatography-olfactometry incremental dilution technique,
J. Chromatogr. A, 2007, 1150, 1-2, 131-135, https://doi.org/10.1016/j.chroma.2007.02.031
. [all data]
Castilho, Liu, et al., 2007
Castilho, P.; Liu, K.; Rodrigues, A.I.; Feio, S.; Tomi, F.; Casanova, J.,
Composition and antimicrobial activity of the essential oil of Clinopodium ascendens (Jordan) Sampaio from Madeira,
Flavour Fragr. J., 2007, 22, 2, 139-144, https://doi.org/10.1002/ffj.1771
. [all data]
Cunicao, Lopes, et al., 2007
Cunicao, M.M.; Lopes, A.R.; Côcco, L.C.; Yamamoto, C.I.; Plocharski, R.C.B.; Miguel, M.D.; Junior, A.G.; Auer, C.G.; Miguel, O.G.,
Phytochemical and antibacterial evaluation of essential oils from Ottonia Martiana Miq. (Piperaceae),
J. Braz. Chem. Soc., 2007, 18, 1, 184-188, https://doi.org/10.1590/S0103-50532007000100021
. [all data]
Dehghan, Solaimanian, et al., 2007
Dehghan, G.; Solaimanian, R.; Shahverdi, A.R.; Amin, G.; Abdollahi, M.; Shafiee, A.,
Chemical composition and antimicrobial activity of essential oil of Ferula szovitsiana D.C.,
Flavour Fragr. J., 2007, 22, 3, 224-227, https://doi.org/10.1002/ffj.1789
. [all data]
Duquesnoy, Castola, et al., 2007
Duquesnoy, E.; Castola, V.; Casanova, J.,
Composition and chemical variability of the twig oil of Abies alba Miller from Corsica,
Flavour Fragr. J., 2007, 22, 4, 293-299, https://doi.org/10.1002/ffj.1796
. [all data]
Engel and Ratel, 2007
Engel, E.; Ratel, J.,
Correction of the data generated by mass spectrometry analyses of biological tissues: Application to food authentication,
J. Chromatogr. A, 2007, 1154, 1-2, 331-341, https://doi.org/10.1016/j.chroma.2007.02.012
. [all data]
Flamini, Cioni, et al., 2007
Flamini, G.; Cioni, P.L.; Morelli, I.; Bader, A.,
Essential oils of the aerial parts of three Salvia species from Jordan: Salvia lanigera, S. spinosa and S. syriaca,
Food Chem., 2007, 100, 2, 732-735, https://doi.org/10.1016/j.foodchem.2005.10.032
. [all data]
Flamini, Tebano, et al., 2007
Flamini, G.; Tebano, M.; Cioni, P.L.,
Volatiles emission patterns of different plant organs and pollen of Citrus limon,
Anal. Chim. Acta., 2007, 589, 1, 120-124, https://doi.org/10.1016/j.aca.2007.02.053
. [all data]
Flamini, Tebano, et al., 2007, 2
Flamini, G.; Tebano, M.; Cioni, P.L.; Ceccarini, L.; Ricci, A.S.; Longo, I.,
Comparison between the conventional method of extraction of essential oil of Laurus nobilis L. and a novel method which uses microwaves applied in situ, without resorting to an oven,
J. Chromatogr. A, 2007, 1143, 1-2, 36-40, https://doi.org/10.1016/j.chroma.2007.01.031
. [all data]
Hongratanaworakit and Buchbauer, 2007
Hongratanaworakit, T.; Buchbauer, G.,
Chemical composition and stimulating effect of Citrus hystrix oil on humans,
Flavour Fragr. J., 2007, 22, 5, 443-449, https://doi.org/10.1002/ffj.1820
. [all data]
Kundakovic, Fokialakis, et al., 2007
Kundakovic, T.; Fokialakis, N.; Kovacevic, N.; Chinou, I.,
Essential oil composition of Achillea lingulata and A. umbellata,
Flavour Fragr. J., 2007, 22, 3, 184-187, https://doi.org/10.1002/ffj.1778
. [all data]
Lesueur, de Rocca Serra, et al., 2007
Lesueur, D.; de Rocca Serra, D.; Bighelli, A.; Hoi, T.M.; Ban, N.K.; Thai, T.H.; Casanova, J.,
Chemical composition and antibacterial activity of the essential oil of Michelia foveolata Merryll ex Dandy from Vietnam,
Flavour Fragr. J., 2007, 22, 4, 317-321, https://doi.org/10.1002/ffj.1799
. [all data]
Maccioni, Baldini, et al., 2007
Maccioni, S.; Baldini, R.; Luigi Cioni, P.; Tebano, M.; Flamini, G.,
In vivo volatiles emission and essential oils from different organs and pollen of Cistus albidus from Caprione (Eastern Liguria, Italy),
Flavour Fragr. J., 2007, 22, 1, 61-65, https://doi.org/10.1002/ffj.1759
. [all data]
Martins, Santos, et al., 2007
Martins, F.T.; Santos, M.H.; Polo, M.; Barbosa, L.C.A.,
Effects of the interactions among macronutrients, plant age and photoperiod in the composition of Hyptis suaveolens (L.) Poit essential oil from Alfenas (MG), Brazil,
Flavour Fragr. J., 2007, 22, 2, 123-129, https://doi.org/10.1002/ffj.1769
. [all data]
Methven L., Tsoukka M., et al., 2007
Methven L.; Tsoukka M.; Oruna-Concha M.J.; Parker J.K.; Mottram D.S.,
Influence of sulfur amino acids on the volatile and nonvolatile components of cooked salmon (Salmo salar),
J. Agric. Food Chem., 2007, 55, 4, 1427-1436, https://doi.org/10.1021/jf0625611
. [all data]
Muselli, Rossi, et al., 2007
Muselli, A.; Rossi, P.-G.; Desjobert, J.-M.; Bernardini, A.-F.; Berti, L.; Costa, J.,
Chemical composition and antibacterial activity of Otanthus maritimus (L.) Hoffmanns. Link essential oils from Corsica,
Flavour Fragr. J., 2007, 22, 3, 217-223, https://doi.org/10.1002/ffj.1787
. [all data]
Paolini J., Costa J., et al., 2007
Paolini J.; Costa J.; Bernardini A.F.,
Analysis of the essential oil from the roots of Eupatorium cannabinum subsp corsicum (L.) by GC, GC-MS and C-13-NMR,
Phytochem. Anal., 2007, 18, 3, 235-244, https://doi.org/10.1002/pca.977
. [all data]
Paolini, Muselli, et al., 2007
Paolini, J.; Muselli, A.; Bernardini, A.-F.; Bighelli, A.; Casanova, J.; Costa, J.,
Thymol derivatives from essential oil of Doronicum corsicum L.,
Flavour Fragr. J., 2007, 22, 6, 479-487, https://doi.org/10.1002/ffj.1824
. [all data]
Politeo, Jukic, et al., 2007
Politeo, O.; Jukic, M.; Milos, M.,
Chemical Composition and Antioxidant Activity of Free Volatile Aglycones from Laurel (Laurus nobilis L.) Compared to Its Essential Oil,
Croatica Chem. Acta, 2007, 80, 1, 121-126. [all data]
Quijano, Salamanca, et al., 2007
Quijano, C.E.; Salamanca, G.; Pino, J.A.,
Aroma volatile constituents of Colombian varieties of mango (Mangifera indica L.),
Flavour Fragr. J., 2007, 22, 5, 401-406, https://doi.org/10.1002/ffj.1812
. [all data]
Radulovic, Lazarevic, et al., 2007
Radulovic, N.; Lazarevic, J.; Ristic, N.; Palic, R.,
Chemotaxonomic significance of the volatiles in the genus Stachys (Lamiaceae): Essential oil composition of four Balkan Stachys species,
Biochem. Syst. Ecol., 2007, 35, 4, 196-208, https://doi.org/10.1016/j.bse.2006.10.010
. [all data]
Sabulal, Dan, et al., 2007
Sabulal, B.; Dan, M.; John, A.; Kurup, R.; Chandrika, S.P.; George, V.,
Phenylbutanoid-rich rhizome oil of Zingiber neesanum from Western Ghats, southern India,
Flavour Fragr. J., 2007, 22, 6, 521-524, https://doi.org/10.1002/ffj.1834
. [all data]
Silva, Barbosa, et al., 2007
Silva, C.J.; Barbosa, L.C.A.; Maltha, C.R.A.; Pinheiro, A.L.; Ismail, F.M.D.,
Comparative study of the essential oils of seven Melaleuca (Myrtaceae) species grown in Brazil,
Flavour Fragr. J., 2007, 22, 6, 474-478, https://doi.org/10.1002/ffj.1823
. [all data]
Telascrea, de Araujo, et al., 2007
Telascrea, M.; de Araujo, C.C.; Marques, M.O.M.; Facanali, R.; de Moraes, P.L.R.; Cavalheiro, A.J.,
Essential oil from leaves of Cryptocarya mandioccana Meisner (Lauraceae): Composition and intraspecific chemical variability,
Biochem. Syst. Ecol., 2007, 35, 4, 222-232, https://doi.org/10.1016/j.bse.2006.09.015
. [all data]
Vagionas, Ngassapa, et al., 2007
Vagionas, K.; Ngassapa, O.; Runyoro, D.; Graikou, K.; Gortzi, O.; Chinou, I.,
Chemical analysis of edible aromatic plants growing in Tanzania,
Food Chem., 2007, 105, 4, 1711-1717, https://doi.org/10.1016/j.foodchem.2007.05.029
. [all data]
Wu, Zorn, et al., 2007
Wu, S.; Zorn, H.; Krings, U.; Berger, R.G.,
Volatiles from submerged and surface-cultured beefsteak fungus, Fistulina hepatica,
Flavour Fragr. J., 2007, 22, 1, 53-60, https://doi.org/10.1002/ffj.1758
. [all data]
Yu, Liao, et al., 2007
Yu, J.Q.; Liao, Z.X.; Cai, X.Q.; Lei, J.C.; Zou, G.L.,
Composition, antimicrobial activity and cytotoxicity of essential oils from Aristolochia mollissima,
Environmental Toxicology and Pharmacology, 2007, 23, 2, 162-167, https://doi.org/10.1016/j.etap.2006.08.004
. [all data]
Zeng, Zhao, et al., 2007
Zeng, Y.-X.; Zhao, C.-X.; Liang, Y.-Z.; Yang, H.; Fang, H.-Z.; Yi, L.-Z.; Zeng, Z.-D.,
Comparative analysis of volatile components from Clematis species growing in China,
Anal. Chim. Acta., 2007, 595, 1-2, 328-339, https://doi.org/10.1016/j.aca.2006.12.022
. [all data]
Andrianoelisoa H.S., Menut C., et al., 2006
Andrianoelisoa H.S.; Menut C.; de Chatelperron P.C.; Saracco J.; Ramanoelina P.; Danthu P.,
Intraspecific chemical variability and highlighting of chemotypes of leaf essential oils from Ravensara aromatica Sonnerat a tree endemic to Madagascar,
Flavour Fragr. J., 2006, 21, 5, 833-838, https://doi.org/10.1002/ffj.1735
. [all data]
Bastos, Ishimoto, et al., 2006
Bastos, D.H.M.; Ishimoto, E.; Marques, M.O.M.; Ferri, A.F.; Torres, E.A.F.S.,
Essential oil and antioxidant activity of green mate and mate tea (Ilex paraguariensis) infusions,
J. Food Comp. Anal., 2006, 19, 6-7, 538-543, https://doi.org/10.1016/j.jfca.2005.03.002
. [all data]
Basta, Tzakou, et al., 2006
Basta, A.; Tzakou, O.; Couladis, M.,
The essential oil composition of Phlomis cretica C. Presl,
Flavour Fragr. J., 2006, 21, 5, 795-797, https://doi.org/10.1002/ffj.1717
. [all data]
Batista-Pereira, Fernandes, et al., 2006
Batista-Pereira, L.G.; Fernandes, J.B.; Correa, A.G.; da Silva, M.F.G.F.; Vieira, P.C.,
Electrophysiological responses of eucalyptus brown looper Thyrinteina arnobia to essential oils of seven Eucalyptus species,
J. Braz. Chem. Soc., 2006, 17, 3, 555-561, https://doi.org/10.1590/S0103-50532006000300019
. [all data]
Blagojevic, Radulovic, et al., 2006
Blagojevic, P.; Radulovic, N.; Palic, R.; Stojanovic, G.,
Chemical composition of the essential oils of Serbian wild-growing Srtemisia absinthium and Artemisia vulgaris,
J. Agric. Food Chem., 2006, 54, 13, 4780-4789, https://doi.org/10.1021/jf060123o
. [all data]
Block, Flamini, et al., 2006
Block, S.; Flamini, G.; Brkic, D.; Morelli, I.; Quetin-Leclercq, J.,
Analysis of the essential oil from leaves of Croton zambesicus Muell. Arg. growing in Benin,
Flavour Fragr. J., 2006, 21, 2, 222-224, https://doi.org/10.1002/ffj.1558
. [all data]
Boti, Bighelli, et al., 2006
Boti, J.B.; Bighelli, A.; Cavaleiro, C.; Salgueiro, L.; Casanova, J.,
Chemical variability of Juniperus oxycedrus ssp. oxycedrus berry and leaf oils from Corsica, analysed by combination of GC, GC-MS and 13C-NMR,
Flavour Fragr. J., 2006, 21, 2, 268-273, https://doi.org/10.1002/ffj.1579
. [all data]
Bousmaha, Boti, et al., 2006
Bousmaha, L.; Boti, J.B.; Bekkara, F.A.; Castola, V.; Casanova, J.,
Infraspecific chemical variability of the essential oil of Lavandula dentata L. from Algeria,
Flavour Fragr. J., 2006, 21, 2, 368-372, https://doi.org/10.1002/ffj.1659
. [all data]
Bylaite and Meyer, 2006
Bylaite, E.; Meyer, A.S.,
· Characterisation of volatile aroma compounds of orange juices by three dynamic and static headspace gas chromatography techniques,
Eur. Food Res. Technol., 2006, 222, 1-2, 176-184, https://doi.org/10.1007/s00217-005-0141-8
. [all data]
Cavalli, Tomi, et al., 2006
Cavalli, J.-F.; Tomi, F.; Bernardini, A.-F.; Casanova, J.,
Chemical variability of the essential oil of Helichrysum faradifani Sc. Ell. from Madagascar,
Flavour Fragr. J., 2006, 21, 1, 111-114, https://doi.org/10.1002/ffj.1531
. [all data]
Chorianopoulos N., Evergets E., et al., 2006
Chorianopoulos N.; Evergets E.; Mallouchos A.; Kalpoutzakis E.; Nychas G.J.; Haroutounian S.A.,
Characterization of the essential oil volatiles of Satureja thymbra and Satureja parnassica: Influence of harvesting time and antimicrobial activity,
J. Agric. Food Chem., 2006, 54, 8, 3139-3145, https://doi.org/10.1021/jf053183n
. [all data]
Djarri, Medjroubi, et al., 2006
Djarri, L.; Medjroubi, K.; Akkal, S.; Elomri, A.; Seguin, E.; Vérité, P.,
Composition of the essential oil of aerial parts of an endemic species of the Apiaceae of Algeria, Daucus reboudii Coss.,
Flavour Fragr. J., 2006, 21, 4, 647-649, https://doi.org/10.1002/ffj.1636
. [all data]
Dob, Dahmane, et al., 2006
Dob, T.; Dahmane, D.; Chelghoum, C.,
Essential oil composition of Juniperus oxycedrus growing in Algeria,
Pharm. Biol., 2006, 44, 1, 1-6, https://doi.org/10.1080/13880200500530922
. [all data]
Dob, Dahmane, et al., 2006, 2
Dob, T.; Dahmane, D.; Agli, M.; Chelghoum, C.,
Essential oil composition of Lavandula stoechas from Algeria,
Pharm. Biol., 2006, 44, 1, 60-64, https://doi.org/10.1080/13880200500496421
. [all data]
Duquesnoy, Dinh, et al., 2006
Duquesnoy, E.; Dinh, N.H.; Castola, V.; Casanova, J.,
Composition of a Pyrolytic oil from Cupressus funebris Endl. of Vietnamese origin,
Flavour Fragr. J., 2006, 21, 3, 453-457, https://doi.org/10.1002/ffj.1676
. [all data]
Esmaeili, Nematollahi, et al., 2006
Esmaeili, A.; Nematollahi, F.; Rustaiyan, A.; Moazami, N.; Masoudi, S.; Bamasian, S.,
Volatile constituents of Achillea pachycephala, A. oxyodonta and A. biebersteinii from Iran,
Flavour Fragr. J., 2006, 21, 2, 253-256, https://doi.org/10.1002/ffj.1571
. [all data]
Flamini, Tebano, et al., 2006
Flamini, G.; Tebano, M.; Cioni, P.L.; Bagci, Y.; Dural, H.; Ertugrul, K.; Uysal, T.; Savran, A.,
A multivariate statistical approach to Centaurea classification using essential oil composition data of some species from Turkey,
Pl. Syst. Evol., 2006, 261, 1-4, 217-228, https://doi.org/10.1007/s00606-006-0448-3
. [all data]
Gonny, Cavaleiro, et al., 2006
Gonny, M.; Cavaleiro, C.; Salgueiro, L.; Casanova, J.,
Analysis of Juniperus communis subsp. alpina needle, berry, wood and root oils by combination of GC, GC/MS and 13C-NMR,
Flavour Fragr. J., 2006, 21, 1, 99-106, https://doi.org/10.1002/ffj.1527
. [all data]
Javidnia, Miri, et al., 2006
Javidnia, K.; Miri, R.; Banani, A.,
Volatile oil constituents of Haplophyllum tuberculatum (Forssk.) A. Juss. (Rutaceae) from Iran,
J. Essent. Oil Res., 2006, 18, 4, 355-356, https://doi.org/10.1080/10412905.2006.9699111
. [all data]
Javidnia, Miri, et al., 2006, 2
Javidnia, K.; Miri, R.; Kamalinejad, M.; Khazraii, H.,
Chemical composition of the volatile oil of aerial parts of Valeriana sisymbriifolia Vahl. grown in Iran,
Flavour Fragr. J., 2006, 21, 3, 516-518, https://doi.org/10.1002/ffj.1660
. [all data]
Javidnia K., Miri R., et al., 2006
Javidnia K.; Miri R.; Javidnia A.,
Constituents of the essential oil of Scabiosa flavida from Iran,
Chem. Nat. Compd. (Engl. Transl.), 2006, 42, 5, 529-530, https://doi.org/10.1007/s10600-006-0206-3
. [all data]
Kuiate, Bessière, et al., 2006
Kuiate, J.R.; Bessière, J.M.; Vilarem, G.; Amvam Zollo, P.H.,
Chemical composition and antidermatophytic properties of the essential oils from leaves, flowers and fruits of Cupressus lusitanica Mill. from Cameroon,
Flavour Fragr. J., 2006, 21, 4, 693-697, https://doi.org/10.1002/ffj.1686
. [all data]
Liu J.M., Nan P., et al., 2006
Liu J.M.; Nan P.; Tsering Q.; Tsering T.; Bai Z.K.; Wang L.; Liu Z.J.; Zhong Y.,
Volatile constituents of the leaves and flowers of Salvia przewalskii Maxim. from Tibet,
Flavour Fragr. J., 2006, 21, 3, 435-438, https://doi.org/10.1002/ffj.1607
. [all data]
Masoudi, Esmaeili, et al., 2006
Masoudi, S.; Esmaeili, A.; Khalilzadeh, M.A.; Rustaiyan, A.; Moazami, N.; Akhgar, M.R.; Varavipoor, M.,
Volatile constituents of Dorema aucheri Boiss., Seseli libanotis (L.) W. D. Koch var. armeniacum bordz. and Conium maculatum L. three Umbelliferae herbs growing wild in Iran,
Flavour Fragr. J., 2006, 21, 5, 801-804, https://doi.org/10.1002/ffj.1722
. [all data]
Mondello and Costa, 2006
Mondello, L.; Costa, R.,
A new generation of GC capillary columns: SLB-5ms,
The Reporter (Europe), 2006, 20, March, 17-19. [all data]
Nath, Baruah, et al., 2006
Nath, S.C.; Baruah, A.; Kanjilal, P.B.,
Chemical composition of the leaf essential oil of Cinnamomum pauciflorum Nees,
Flavour Fragr. J., 2006, 21, 3, 531-533, https://doi.org/10.1002/ffj.1688
. [all data]
Paolini J., Desjobert J.M., et al., 2006
Paolini J.; Desjobert J.M.; Costa J.; Bernardini A.F.; Castellini C.B.; Cioni P.L.; Flamini G.; Morelli I.,
Composition of essential oils of Helichrysum italicum (Roth) G. Don fil subsp. italicum from Tuscan archipelago islands,
Flavour Fragr. J., 2006, 21, 5, 805-808, https://doi.org/10.1002/ffj.1726
. [all data]
Pavlovic, Kovacevic, et al., 2006
Pavlovic, M.; Kovacevic, N.; Tzakou, O.; Couladis, M.,
Essential oil composition of Anthemis triumfetti (L.) DC.,
Flavour Fragr. J., 2006, 21, 2, 297-299, https://doi.org/10.1002/ffj.1592
. [all data]
Pavlovic, Tzakou, et al., 2006
Pavlovic, M.; Tzakou, O.; Petrakis, P.V.; Couladis, M.,
The essential oil of Hypericum perforatum L., Hypericum tetrapterum Fries and Hypericum olympicum L. growing in Greece,
Flavour Fragr. J., 2006, 21, 1, 84-87, https://doi.org/10.1002/ffj.1521
. [all data]
Perraudin, Popovici, et al., 2006
Perraudin, F.; Popovici, J.; Bertrand, C.,
Analysis of headspace-solid microextracts from flowers of Maxillaria tenuifolia Lindl. by GC-MS,
Electronic Journal of Natural Substances, 2006, 1, 1-5. [all data]
Pinto, Pina-Vaz, et al., 2006
Pinto, E.; Pina-Vaz, C.; Salgueiro, L.; Goncalves, M.J.; Costa-de-Oliveira, S.; Cavaleiro, C.; Palmeira, A.; Rodrigues, A.; Martinez-de-Oliveira, J.,
Antifuncal activity of the essential oil Thymus pulegioides on Candida, Aspergillus and dermatophyte species,
Journal of Medical Microbiology, 2006, 55, 10, 1367-1373, https://doi.org/10.1099/jmm.0.46443-0
. [all data]
Radulovic, Lazarevic, et al., 2006
Radulovic, N.; Lazarevic, J.; Stojanovic, G.; Palic, R.,
Chemotaxonomically significant 2-ethyl substituted fatty acids from Stachys milanii Petrovic (Lamiaceae),
Biochem. Syst. Ecol., 2006, 34, 4, 341-344, https://doi.org/10.1016/j.bse.2005.10.008
. [all data]
Radulovic, Mananjarasoa, et al., 2006
Radulovic, N.; Mananjarasoa, E.; Harinantenaina, L.; Yoshinori, A.,
Essential oil composition of four Croton species from Madagascar and their chemotaxonomy,
Biochem. Syst. Ecol., 2006, 34, 8, 648-653, https://doi.org/10.1016/j.bse.2006.02.005
. [all data]
Ramezani, Behravan, et al., 2006
Ramezani, M.; Behravan, J.; Yazdinezhad, A.,
Composition and antimicrobial activity of the volatile oil of Artemisia kopetdaghensis Krasch., M.Pop. Linecz ex Poljak from Iran,
Flavour Fragr. J., 2006, 21, 6, 869-871, https://doi.org/10.1002/ffj.1644
. [all data]
Rezazadeh, Hamedani, et al., 2006
Rezazadeh, S.; Hamedani, M.P.; Dowlatabadi, R.; Yazdani, D.; Shafiee, A.,
Chemical composition of the essential oils of Stachys schtschegleevii Sosn. and Stachys balansae Boiss Kotschy from Iran,
Flavour Fragr. J., 2006, 21, 2, 290-293, https://doi.org/10.1002/ffj.1587
. [all data]
Rubiolo P., Matteodo M., et al., 2006
Rubiolo P.; Matteodo M.; Riccio G.; Ballero M.; Christen P.; Fleury-Souverain S.; Veuthey J.L.; Bicchi C.,
Analytical discrimination of poisonous and nonpoisonous chemotypes of giant fennel (Ferula communis L.) through their biologically active and volatile fractions,
J. Agric. Food Chem., 2006, 54, 20, 7556-7563, https://doi.org/10.1021/jf061592t
. [all data]
Salgueiro L.R., Pinto E., et al., 2006
Salgueiro L.R.; Pinto E.; Goncalves M.J.; Costa I.; Palmeira A.; Cavaleiro C.; Pina-Vaz C.; Rodrigues A.G.; Martinez-De-Oliveira J.,
Antifungal activity of the essential oil of Thymus capitellatus against Candida, Aspergillus and dermatophyte strains,
Flavour Fragr. J., 2006, 21, 5, 749-753, https://doi.org/10.1002/ffj.1610
. [all data]
Su, Ho, et al., 2006
Su, Y.C.; Ho, C.L.; Wang, E.I.C.,
Analysis of leaf essential oils from the indigenous five conifers of Taiwan,
Flavour Fragr. J., 2006, 21, 3, 447-452, https://doi.org/10.1002/ffj.1685
. [all data]
Su, Ho, et al., 2006, 2
Su, Y.-C.; Ho, C.-L.; Wang, E.I.-C.; Chang, S.-T.,
Antifungal activities and chemical compositions of essential oils from leaves of four eucalypts,
Taiwan J. For. Sci., 2006, 21, 1, 49-61. [all data]
Vundac, Pfeifhofer, et al., 2006
Vundac, V.B.; Pfeifhofer, H.W.; Brantner, A.H.; Males, Z.; Plazibat, M.,
Essential oils of seven Stachys taxa from Croatia,
Biochem. Syst. Ecol., 2006, 34, 12, 875-881, https://doi.org/10.1016/j.bse.2006.04.010
. [all data]
Zhao C.X., Li, et al., 2006
Zhao C.X.; Li, X.N.; Liang Y.Z.; Fang H.Z.; Huang L.F.; Guo F.Q.,
Comparative analysis of chemical components of essential oils from different samples of Rhododendron with the help of chemometrics methods,
Chemom. Intell. Lab. Syst., 2006, 82, 1-2, 218-228, https://doi.org/10.1016/j.chemolab.2005.08.008
. [all data]
Zhao J.Y., Liu J.M., et al., 2006
Zhao J.Y.; Liu J.M.; Zhang X.Y.; Liu Z.J.; Tsering T.; Zhong Y.; Nan P.,
Chemical composition of the volatiles of three wild Bergenia species from western China,
Flavour Fragr. J., 2006, 21, 3, 431-434, https://doi.org/10.1002/ffj.1689
. [all data]
Ziegenbein, Hanssen, et al., 2006
Ziegenbein, F.C.; Hanssen, H.-P.; König, W.A.,
Secondary metabolites from Ganoderma lucidum and Spongiporus leucomallellus,
Phytochemistry, 2006, 67, 2, 202-211, https://doi.org/10.1016/j.phytochem.2005.10.025
. [all data]
Ziegenbein, Hanssen, et al., 2006, 2
Ziegenbein, F.C.; Hanssen, H.-P.; König, W.A.,
Chemical constituents of the essential oils of three wood-rotting fungi,
Flavour Fragr. J., 2006, 21, 5, 813-816, https://doi.org/10.1002/ffj.1732
. [all data]
Agnihotri, Agarwal, et al., 2005
Agnihotri, V.K.; Agarwal, S.G.; Dhar, P.L.; Thappa, R.K.; Baleshwar; Kapahi, B.K.; Saxena, R.K.; Qazi, G.N.,
Essential oil composition of Mentha pulegium L. growing wild in the north-western Himalayas India,
Flavour Fragr. J., 2005, 20, 6, 607-610, https://doi.org/10.1002/ffj.1497
. [all data]
Agnaniet, Makani, et al., 2005
Agnaniet, H.; Makani, T.; Akagah, A.; Menut, C.; Bessière, J.M.,
Volatile constituents and antioxidant activity of essential oils from Lippia multiflora Mold. growing in Gabon,
Flavour Fragr. J., 2005, 20, 1, 34-38, https://doi.org/10.1002/ffj.1383
. [all data]
Boskovic, Radulovic, et al., 2005
Boskovic, Z.; Radulovic, N.; Stojanovic, G.,
Essential oil composition of four Achillea species from the balkans and its chemotaxonomic significance,
Chem. Nat. Compd. (Engl. Transl.), 2005, 41, 6, 674-678, https://doi.org/10.1007/s10600-006-0009-6
. [all data]
Boti J.B., Koukoua G., et al., 2005
Boti J.B.; Koukoua G.; N'Guessan T.Y.; Muselli A.; Bernardini A.F.; Casanova J.,
Composition of the leaf, stem bark and root bark oils of Isolona cooperi investigated by GC (retention index), GC-MS and C-13-NMR spectroscopy,
Phytochem. Anal., 2005, 16, 5, 357-363, https://doi.org/10.1002/pca.857
. [all data]
Brantner, Pfeifhofer, et al., 2005
Brantner, A.H.; Pfeifhofer, H.W.; Ercegovac, O.; Males, Z.; Plazibat, M.,
Essential oil composition and antioxidant activity of Thymus bracteosus Vis. ex Benth.,
Flavour Fragr. J., 2005, 20, 6, 596-600, https://doi.org/10.1002/ffj.1494
. [all data]
Celik, Gokturk, et al., 2005
Celik, S.; Gokturk, R.S.; Flamini, G.; Cioni, P.L.; Morelli, I.,
Essential oils of Phlomis leucophracta, Phlomis chimerae and Phlomis grandiflora var. grandiflora from Turkey,
Biochem. Syst. Ecol., 2005, 33, 6, 617-623, https://doi.org/10.1016/j.bse.2004.11.010
. [all data]
Choi, 2005
Choi, H.-S.,
Characteristic odor components of kumquat (Fortunella japonica Swingle) peel oil,
J. Agric. Food Chem., 2005, 53, 5, 1642-1647, https://doi.org/10.1021/jf040324x
. [all data]
Cioni, Flamini, et al., 2005
Cioni, P.L.; Flamini, G.; Caponi, C.; Ceccarini, L.; Morelli, I.,
Analysis of volatile fraction, fixed oil and tegumental waxes of the seeds of two different cultivars of Helianthus annuus,
Food Chem., 2005, 90, 4, 713-717, https://doi.org/10.1016/j.foodchem.2004.04.031
. [all data]
Cozzani, Muselli, et al., 2005
Cozzani, S.; Muselli, A.; Desjobert, J.-M.; Bernardini, A.-F.; Tomi, F.; Casanova, J.,
Chemical composition of essential oil of Teucrium polium subsp. capitatum (L.) from Corsica,
Flavour Fragr. J., 2005, 20, 4, 436-441, https://doi.org/10.1002/ffj.1463
. [all data]
Dob, Berramdane, et al., 2005
Dob, T.; Berramdane, T.; Dahmane, D.; Chelghoum, C.,
Chemical composition of the needles oil of Pinus canariensis from Algeria,
Chem. Nat. Compd. (Engl. Transl.), 2005, 41, 2, 165-167, https://doi.org/10.1007/s10600-005-0103-1
. [all data]
Dob, Berramdane, et al., 2005, 2
Dob, T.; Berramdane, T.; Chelgoum, C.,
Chemical composition of essential oil of Pinus halepensis Miller growing in Algeria,
C.R. Chim., 2005, 8, 11-12, 1939-1945, https://doi.org/10.1016/j.crci.2005.05.007
. [all data]
Dob, Dahmane, et al., 2005
Dob, T.; Dahmane, D.; Berramdane, T.; Chelghoum, C.,
Chemical composition of the essential oil of Artemisia campestris L. from Algeria,
Pharm. Biol., 2005, 43, 6, 512-514, https://doi.org/10.1080/13880200500220664
. [all data]
Dugo, Mondello, et al., 2005
Dugo, P.; Mondello, L.; Favoino, O.; Cicero, L.; Rodriguez Zenteno, N.A.; Dugo, G.,
Characterization of cold-pressed Mexican dancy tangerine oils,
Flavour Fragr. J., 2005, 20, 1, 60-66, https://doi.org/10.1002/ffj.1367
. [all data]
Elmore, Cooper, et al., 2005
Elmore, J.S.; Cooper, S.L.; Enser, M.; Mottram, D.S.; Sinclair, L.A.; Wilkinson, R.G.; Wood, J.D.,
Dietary manipulation of fatty acid composition in lamb meat and its effect on the volatile aroma compounds of grilled lamb,
Meat Sci., 2005, 69, 2, 233-242, https://doi.org/10.1016/j.meatsci.2004.07.002
. [all data]
Estevez, Ventanas, et al., 2005
Estevez, M.; Ventanas, S.; Ramirez, R.; Cava, R.,
Influence of the Addition of Rosemary Essential Oil on the Volatiles Pattern of Porcine Frankfurters,
J. Agric. Food Chem., 2005, 53, 21, 8317-8324, https://doi.org/10.1021/jf051025q
. [all data]
Fanciullino, Gancel, et al., 2005
Fanciullino, A.-L.; Gancel, A.-L.; Froelicher, Y.; Luro, F.; Ollitrault, P.; Brillouet, J.-M.,
Effects of Nucleo-cytoplasmic Interactions on Leaf Volatile Compounds from Citrus Somatic Diploid Hybrids,
J. Agric. Food Chem., 2005, 53, 11, 4517-4523, https://doi.org/10.1021/jf0502855
. [all data]
de Feo, Urrunaga Soria, et al., 2005
de Feo, V.; Urrunaga Soria, E.; Urrunaga Soria, R.; Pizza, C.,
Composition and in vitro toxicity of the essential oil of Tagetes terniflora HBK. (Asteraceae),
Flavour Fragr. J., 2005, 20, 1, 89-92, https://doi.org/10.1002/ffj.1379
. [all data]
Ferrari, Tomi, et al., 2005
Ferrari, B.; Tomi, F.; Casanova, J.,
Composition and chemical variability of Ferula communis essential oil from Corsica,
Flavour Fragr. J., 2005, 20, 2, 180-185, https://doi.org/10.1002/ffj.1405
. [all data]
Flamini, Luigi Cioni, et al., 2005
Flamini, G.; Luigi Cioni, P.; Morelli, I.; Celik, S.; Gokturk, R.S.; Unal, O.,
Essential oil of Stachys aleurites from Turkey,
Biochem. Syst. Ecol., 2005, 33, 1, 61-66, https://doi.org/10.1016/j.bse.2004.05.013
. [all data]
Flamini, Luigi Cioni, et al., 2005, 2
Flamini, G.; Luigi Cioni, P.; Morelli, I.,
Composition of the essential oils and in vivo emission of volatiles of four Lamium species from Italy: L. purpureum, L. hybridum, L. bifidum and L. amplexicaule,
Food Chem., 2005, 91, 1, 63-68, https://doi.org/10.1016/j.foodchem.2004.05.047
. [all data]
Gancel, Ollitrault, et al., 2005
Gancel, A.-L.; Ollitrault, P.; Froelicher, Y.; Tomi, F.; Jacquemond, C.; Luro, F.; Brillouet, J.-M.,
Leaf volatile compounds of six citrus somatic allotetraploid hybrids originating from various combinations of lime, lemon, citron, sweet orange, and grapefruit,
J. Agric. Food Chem., 2005, 53, 6, 2224-2230, https://doi.org/10.1021/jf048315b
. [all data]
Idzojtic, Kajba, et al., 2005
Idzojtic, M.; Kajba, D.; Franjic, J.,
Differentiation of F1 hybrids P. nigra J. F. Arnold × P. sylvestris L., P. nigra J. F. Arnold × P. densiflora Siebold et Zucc., P. nigra J. F. Arnold × P. thunbergiana Franco and their parental species by needle volatile composition,
Biochem. Syst. Ecol., 2005, 33, 4, 427-439, https://doi.org/10.1016/j.bse.2004.10.008
. [all data]
Insausti, Goñi, et al., 2005
Insausti, K.; Goñi, V.; Petri, E.; Gorraiz, C.; Beriain, M.J.,
Effect of weight at slaughter on the volatile compounds of cooked beef from Spanish cattle breeds,
Meat Sci., 2005, 70, 1, 83-90, https://doi.org/10.1016/j.meatsci.2004.12.003
. [all data]
bin Jantan, Yalvema, et al., 2005
bin Jantan, I.; Yalvema, M.F.; Ahmad, N.W.; Jamal, J.A.,
Insecticidal activities of the leaf oils of eight Cinnamomum species against Aedes aegypti and Aedes albopictus,
Pharm. Biol., 2005, 43, 6, 526-532, https://doi.org/10.1080/13880200500220771
. [all data]
bin Jantan, Yalvema, et al., 2005, 2
bin Jantan, I.; Yalvema, M.F.; Ayop, N.; Ahmad, A.S.,
Constituents of the essential oils of Cinnamomum sintoc Blume from a mountain forest of Peninsular Malaysia,
Flavour Fragr. J., 2005, 20, 6, 601-604, https://doi.org/10.1002/ffj.1495
. [all data]
Javidnia, Miri, et al., 2005
Javidnia, K.; Miri, R.; Jamalian, A.,
Composition of the essential oil of Salvia macrosiphon Boiss. from Iran,
Flavour Fragr. J., 2005, 20, 5, 542-543, https://doi.org/10.1002/ffj.1468
. [all data]
Paolini, Costa, et al., 2005
Paolini, J.; Costa, J.; Bernardini, A.,
Analysis of the essential oil from aerial parts of Eupatorium cannabinum subsp. corsicum (L.) by gas chromatography with electron impact and chemical ionization mass spectrometry,
J. Chromatogr. A, 2005, 1076, 1-2, 170-178, https://doi.org/10.1016/j.chroma.2005.03.131
. [all data]
Pino, Mesa, et al., 2005
Pino, J.A.; Mesa, J.; Muñoz, Y.; Martí, M.P.; Marbot, R.,
Volatile components from mango (Mangifera indica L.) cultivars,
J. Agric. Food Chem., 2005, 53, 6, 2213-2223, https://doi.org/10.1021/jf0402633
. [all data]
Sati and Mathela, 2005
Sati, S.; Mathela, C.S.,
Essential oil composition of Valeriana hardwickii var. arnottiana from the Himalayas,
Flavour Fragr. J., 2005, 20, 3, 299-301, https://doi.org/10.1002/ffj.1415
. [all data]
Senatore, Napolitano, et al., 2005
Senatore, F.; Napolitano, F.; Arnold, N.A.; Bruno, M.; Herz, W.,
Composition and antimicrobial activity of the essential oil of Achillea falcata L. (Asteraceae),
Flavour Fragr. J., 2005, 20, 3, 291-294, https://doi.org/10.1002/ffj.1411
. [all data]
Seo and Baek, 2005
Seo, W.H.; Baek, H.H.,
Identification of characteristic aroma-active compounds from water dropword (Oenanthe javanica DC.),
J. Agric. Food Chem., 2005, 53, 17, 6766-6770, https://doi.org/10.1021/jf050150z
. [all data]
Simionatto, Porto, et al., 2005
Simionatto, E.; Porto, C.; da Silva, U.F.; Squizani, A.; Dalcol, I.I.; Morel, A.F.,
Composition and antimicrobial activity of the essential oil from Aloysia sellowii,
J. Braz. Chem. Soc., 2005, 16, 6B, 1458-1462, https://doi.org/10.1590/S0103-50532005000800028
. [all data]
Smadja, Rondeau, et al., 2005
Smadja, J.; Rondeau, P.; Sing, A.S.C.,
Volatile constituents of five Citrus Petitgrain essential oils from Reunion,
Flavour Fragr. J., 2005, 20, 4, 399-402, https://doi.org/10.1002/ffj.1438
. [all data]
Tchoumbougnang, Zollo, et al., 2005
Tchoumbougnang, F.; Zollo, P.H.A.; Boyom, F.F.; Nyegue, M.A.; Bessière, J.M.; Menut, C.,
Aromatic plants of tropical Central Africa. XLVIII. Comparative study of the essential oils of four Hyptis species from Cameroon: H. lanceolata Poit., H. pectinata (L.) Poit., H. spicigera Lam. and H. suaveolens Poit.,
Flavour Fragr. J., 2005, 20, 3, 340-343, https://doi.org/10.1002/ffj.1441
. [all data]
Verzera, Trozzi, et al., 2005
Verzera, A.; Trozzi, A.; Zappala, M.; Condurso, C.; Cotroneo, A.,
Essential Oil Composition of Citrus meyerii Y. Tan. and Citrus medica L. cv. Diamante and Their Lemon Hybrids,
J. Agric. Food Chem., 2005, 53, 12, 4890-4894, https://doi.org/10.1021/jf047879c
. [all data]
Zhang, Xu, et al., 2005
Zhang, F.; Xu, Q.; Fu, S.; Ma, X.; Xiao, H.; Liang, X.,
Chemical constituents of the essential oil of Asarum forbesii Maxim (Aristolochiaceae),
Flavour Fragr. J., 2005, 20, 3, 318-320, https://doi.org/10.1002/ffj.1423
. [all data]
Aligiannis, Kalpoutzakis, et al., 2004
Aligiannis, N.; Kalpoutzakis, E.; Kyriakopoulou, I.; Mitaku, S.; Chinou, I.B.,
Essential oils of Phlomis species growing in Greece: chemical composition and antimicrobial activity,
Flavour Fragr. J., 2004, 19, 4, 320-324, https://doi.org/10.1002/ffj.1305
. [all data]
Alma, Nitz, et al., 2004
Alma, M.H.; Nitz, S.; Kollmannsberger, H.; Digrak, M.; Efe, F.T.; Yilmaz, N.,
Chemical composition and antimicrobial activity of the essential oils from the gum of Turkish Pistachio (Pistacia vera L.),
J. Agric. Food Chem., 2004, 52, 12, 3911-3914, https://doi.org/10.1021/jf040014e
. [all data]
Antunes, Sevinate-Pinto, et al., 2004
Antunes, T.; Sevinate-Pinto, I.; Barroso, J.G.; Cavaleiro, C.; Salgueiro, L.R.,
Micromorphology of trichomes and composition of essential oil of Teucrium capitatum,
Flavour Fragr. J., 2004, 19, 4, 336-340, https://doi.org/10.1002/ffj.1310
. [all data]
Bell, 2004
Bell, W.A.-M.,
Examination of Aroma Volatiles Formed from Thermal Processing of Florida Reconstituted Grapefruit Juice. A Thesis presented to the graduate school of the university of Florida in partial fulfillment of the requirements for the degree of master of science, 2004. [all data]
Bertoli, Menichini, et al., 2004
Bertoli, A.; Menichini, F.; Noccioli, C.; Morelli, I.; Pistelli, L.,
Volatile constituents of different organs of Psoralea bituminosa L.,
Flavour Fragr. J., 2004, 19, 2, 166-171, https://doi.org/10.1002/ffj.1315
. [all data]
Bertoli, Pistelli, et al., 2004
Bertoli, A.; Pistelli, L.; Morelli, I.; Fraternale, D.; Giamperi, L.; Ricci, D.,
Volatile constituents of different parts (roots, stems and leaves) of Smyrnium olusatrum L.,
Flavour Fragr. J., 2004, 19, 6, 522-525, https://doi.org/10.1002/ffj.1382
. [all data]
Cavaleiro, Salgueiro, et al., 2004
Cavaleiro, C.; Salgueiro, L.R.; Miguel, M.G.; da Cunha, A.P.,
Analysis by gas chromatography?mass spectrometry of the volatile components of Teucrium lusitanicum and Teucrium algarbiensis,
J. Chromatogr. A, 2004, 1033, 1, 187-190, https://doi.org/10.1016/j.chroma.2004.01.005
. [all data]
Ceccarini, Macchia, et al., 2004
Ceccarini, L.; Macchia, M.; Flamini, G.; Cioni, P.L.; Caponi, C.; Morelli, I.,
Essential oil composition of Helianthus annuus L. leaves and heads of two cultivated hybride Carlos and Florom 350,
Ind. Crops Prod., 2004, 19, 1, 13-17, https://doi.org/10.1016/S0926-6690(03)00076-1
. [all data]
Chorianopoulos, Kalpoutzakis, et al., 2004
Chorianopoulos, N.; Kalpoutzakis, E.; Aligiannis, N.; Mitaku, S.; Nychas, G.-J.; Haroutounian, S.A.,
Essential oils of Satureja, Origanum, and Thymus species: chemical composition and antibacterial activities against foodborne pathogens,
J. Agric. Food Chem., 2004, 52, 26, 8261-8267, https://doi.org/10.1021/jf049113i
. [all data]
Dugo, Mondello, et al., 2004
Dugo, P.; Mondello, L.; Zappia, G.; Bonaccorsi, I.; Cotroneo, A.; Russo, M.T.,
The composition of the volatile fraction and the enantiomeric distribution of five volatile components of faustrime oil (Monocitrus australatica x Fortunella sp. x Citrus aurantifolia),
J. Essent. Oil Res., 2004, 16, 4, 328-333, https://doi.org/10.1080/10412905.2004.9698734
. [all data]
Fernández-Ocaña, Gómez-Rodríguez, et al., 2004
Fernández-Ocaña, A.M.; Gómez-Rodríguez, M.V.; Velasco-Negueruela, A.; Camacho-Simarro, A.M.; Fernández-López, C.; Altarejos, J.,
In vivo antifungal activity of the essential oil of Bupleurum gibraltarium against plasmopara halstedii in sunflower,
J. Agric. Food Chem., 2004, 52, 21, 6414-6417, https://doi.org/10.1021/jf040219n
. [all data]
Flamini, Bader, et al., 2004
Flamini, G.; Bader, A.; Cioni, P.L.; Katbeh-Bader, A.; Morelli, I.,
Composition of the essential oil of leaves, galls, and ripe and unripe fruits of Jordian Pistacia palaestina Boiss.,
J. Agric. Food Chem., 2004, 52, 3, 572-576, https://doi.org/10.1021/jf034773t
. [all data]
Flamini, Cioni, et al., 2004
Flamini, G.; Cioni, P.L.; Morelli, I.; Maccioni, S.; Baldini, R.,
Phytochemical typologies in some populations of Myrtus communis L. on Caprione Promontory (East Liguria, Italy),
Food Chem., 2004, 85, 4, 599-604, https://doi.org/10.1016/j.foodchem.2003.08.005
. [all data]
Flach A., Dondon R.C., et al., 2004
Flach A.; Dondon R.C.; Singer R.B.; Koehler S.; Amaral M.D.E.; Marsaioli A.J.,
The chemistry of pollination in selected Brazilian maxillariinae orchids: Floral rewards and fragrance,
J. Chem. Ecol., 2004, 30, 5, 1045-1056, https://doi.org/10.1023/B:JOEC.0000028466.50392.ed
. [all data]
Gonny, Bradesi, et al., 2004
Gonny, M.; Bradesi, P.; Casanova, J.,
Identification of the components of the essential oil from wild Corsican Daucus carota L. using 13C-NMR spectroscopy,
Flavour Fragr. J., 2004, 19, 5, 424-433, https://doi.org/10.1002/ffj.1330
. [all data]
Hierro, de la Hoz, et al., 2004
Hierro, E.; de la Hoz, L.; Ordóñez, J.A.,
Headspace volatile compounds from salted and occasionally smoked dried meats (cecinas) as affected by animal species,
Food Chem., 2004, 85, 4, 649-657, https://doi.org/10.1016/j.foodchem.2003.07.001
. [all data]
Javidnia, Miri, et al., 2004
Javidnia, K.; Miri, R.; Jafari, A.; Rezai, H.,
Analysis of the volatile constituents of Nepeta macrosiphon Boiss. grown in Iran,
Flavour Fragr. J., 2004, 19, 2, 156-158, https://doi.org/10.1002/ffj.1287
. [all data]
Javidnia, Miri, et al., 2004, 2
Javidnia, K.; Miri, R.; Kamalinejad, M.; Sarkarzadeh, H.; Jamalian, A.,
Chemical composition of the essential oils of Anthemis altissima L. grown in Iran,
Flavour Fragr. J., 2004, 19, 3, 213-216, https://doi.org/10.1002/ffj.1277
. [all data]
Javidnia, Miri, et al., 2004, 3
Javidnia, K.; Miri, R.; Sadeghpour, H.,
Composition of the volatile oil of Achillea wilhelmsii C. Koch from Iran,
DARU, 2004, 12, 2, 63-66, retrieved from http://www1.tums.ac.ir/daru/. [all data]
Mardarowicz, Wianowska, et al., 2004
Mardarowicz, M.; Wianowska, D.; Dawidowicz, A.L.; Sawicki, R.,
The influence of sample treatment on SPME extracts from conifers. I. Comparison of terpene composition in Engelmann Spruce (Picea engelmanii) using hydrodistillation, SPME and PLE,
Annales Universitatis Mariae Curie-Sklodowska Lublin - Polonia, 2004, 59, 3, 25-42. [all data]
Moldão-Martins, Beirão-da-Costa, et al., 2004
Moldão-Martins, M.; Beirão-da-Costa, S.; Neves, C.; Cavaleiro, C.; Salgueiro, L.; Beirão-da-Costa, M.L.,
Olive oil flavoured by the essential oils of Mentha × piperita and Thymus mastichina L.,
Food Qual. Pref., 2004, 15, 5, 447-452, https://doi.org/10.1016/j.foodqual.2003.08.001
. [all data]
Mumm, Tiemann, et al., 2004
Mumm, R.; Tiemann, T.; Schulz, S.; Hilker, M.,
Analysis of volatiles from black pine (Pinus nigra): significance of wounding and egg deposition by a herbivorous sawfly,
Phytochemistry, 2004, 65, 24, 3221-3230, https://doi.org/10.1016/j.phytochem.2004.10.010
. [all data]
Ngassoum, Ousmaila, et al., 2004
Ngassoum, M.B.; Ousmaila, H.; Ngamo, L.T.; Maponmetsem, P.M.; Jirovetz, L.; Buchbauer, G.,
Aroma compounds of essential oils of two varieties of the spice plant Ocimum canum Sims from northern Cameroon,
J. Food Comp. Anal., 2004, 17, 2, 197-204, https://doi.org/10.1016/j.jfca.2003.08.002
. [all data]
Omidbaigi, Sefidkon, et al., 2004
Omidbaigi, R.; Sefidkon, F.; Kazemi, F.,
Influence of drying methods on the essential oil content and composition of Roman chamomile,
Flavour Fragr. J., 2004, 19, 3, 196-198, https://doi.org/10.1002/ffj.1340
. [all data]
Özcan and Chalchat, 2004
Özcan, M.; Chalchat, J.-C.,
Aroma profile of Thymus vulgaris L. growing wild in Turkey,
Bulg. J. Plant Physiol., 2004, 30, 3-4, 68-73. [all data]
Pino, Marbot, et al., 2004
Pino, J.A.; Marbot, R.; Vazquez, C.,
Volatile components of tamarind (Tamarindus indica L.) grown in Cuba,
J. Essent. Oil Res., 2004, 16, 4, 318-320, https://doi.org/10.1080/10412905.2004.9698731
. [all data]
Pino, Marbot, et al., 2004, 2
Pino, J.A.; Marbot, R.; Rosado, A.; Vázquez, C.,
Volatile constituents of Malay rose apple [Syzygium malaccense (L.) Merr. Perry],
Flavour Fragr. J., 2004, 19, 1, 32-35, https://doi.org/10.1002/ffj.1269
. [all data]
Raina, Kumar, et al., 2004
Raina, V.K.; Kumar, A.; Srivastava, S.K.; Syamsundar, K.V.; Kahol, A.P.,
Essential oil composition of 'kewda' (Pandanus odoratissimus) from India,
Flavour Fragr. J., 2004, 19, 5, 434-436, https://doi.org/10.1002/ffj.1331
. [all data]
Ramezani, Behravan, et al., 2004
Ramezani, M.; Behravan, J.; Yazdinezhad, A.,
Chemical composition and antimicrobial activity of the volatile oil of Artemisia khorassanica from Iran,
Pharm. Biol., 2004, 42, 8, 599-602, https://doi.org/10.1080/13880200490902482
. [all data]
Ramezani, Khaje-Karamoddin, et al., 2004
Ramezani, M.; Khaje-Karamoddin, M.; Karimi-Fard, V.,
Chemical composition and anti-Helicobacter pylori activity of the essential oil of Pistacia vera,
Pharm. Biol., 2004, 42, 7, 488-490, https://doi.org/10.3109/13880200490891755
. [all data]
Salido, Valenzuela, et al., 2004
Salido, S.; Valenzuela, L.R.; Altarejos, J.; Nogueras, M.; Sánchez, A.; Cano, E.,
Composition and infraspecific variability of Artemisia herba-alba from southern Spain,
Biochem. Syst. Ecol., 2004, 32, 3, 265-277, https://doi.org/10.1016/j.bse.2003.09.002
. [all data]
Stashenko, Jaramillo, et al., 2004
Stashenko, E.E.; Jaramillo, B.E.; Martínez, J.R.,
Analysis of volatile secondary metabolites from Colombian Xylopia aromatica (Lamarck) by different extraction and headspace methods and gas chromatography,
J. Chromatogr. A, 2004, 1025, 1, 105-113, https://doi.org/10.1016/j.chroma.2003.10.059
. [all data]
Stashenko, Jaramillo, et al., 2004, 2
Stashenko, E.E.; Jaramillo, B.E.; Martínez, J.R.,
Comparison of different extraction methods for the analysis of volatile secondary metabolites of Lippia alba (Mill.) N.E. Brown, grown in Colombia, and evaluation of its in vitro antioxidant activity,
J. Chromatogr. A, 2004, 1025, 1, 93-103, https://doi.org/10.1016/j.chroma.2003.10.058
. [all data]
Tam, Thuam, et al., 2004
Tam, N.T.; Thuam, D.T.; Bighelli, A.; Castola, V.; Muselli, A.; Richomme, P.; Casanova, J.,
Baeckea frutescens leaf oil from Vietnam: composition and chemical variability,
Flavour Fragr. J., 2004, 19, 3, 217-220, https://doi.org/10.1002/ffj.1281
. [all data]
Tzakou, Vagias, et al., 2004
Tzakou, O.; Vagias, C.; Gani, A.; Yannitsaros, A.,
Volatile constituents of essential oils isolated at different growth stages from three Conyza species growing in Greece,
Flavour Fragr. J., 2004, 19, 425-428. [all data]
Vérité, Nacer, et al., 2004
Vérité, P.; Nacer, A.; Kabouche, Z.; Seguin, E.,
Composition of seeds and stems essential oils of Pituranthos scoparius (Coss. Dur.) Schinz,
Flavour Fragr. J., 2004, 19, 6, 562-564, https://doi.org/10.1002/ffj.1353
. [all data]
Weissbecker, Holighaus, et al., 2004
Weissbecker, B.; Holighaus, G.; Schütz, S.,
Gas chromatography with mass spectrometric and electroantennographic detection: analysis of wood odorants by direct coupling of insect olfaction and mass spectrometry,
J. Chromatogr. A, 2004, 1056, 1-2, 209-216, https://doi.org/10.1016/j.chroma.2004.06.120
. [all data]
Yoo, Kim, et al., 2004
Yoo, Z.-W.; Kim, N.-S.; Lee, D.-S.,
Comparative analyses of the flavors from Hallabong (Citrus sphaerocarpa) with lemon, orange, and grapefruit by SPTE and HS-SPME combined with GC-MS,
Bull. Korean Chem. Soc., 2004, 25, 2, 271-279, https://doi.org/10.5012/bkcs.2004.25.2.271
. [all data]
Yu, Kim, et al., 2004
Yu, E.J.; Kim, T.H.; Kim, K.H.; Lee, H.J.,
Aroma-active compounds of Pinus densiflora (red pine) needles,
Flavour Fragr. J., 2004, 19, 6, 532-537, https://doi.org/10.1002/ffj.1337
. [all data]
Yu, Kim, et al., 2004, 2
Yu, E.J.; Kim, T.H.; Kim, K.H.; Lee, H.J.,
Characterization of aroma-active compounds of Abies nephrolepis (Khingan fir) needles using aroma extract dilution analysis,
Flavour Fragr. J., 2004, 19, 1, 74-79, https://doi.org/10.1002/ffj.1314
. [all data]
Zheng, Kim, et al., 2004
Zheng, C.H.; Kim, T.H.; Kim, K.H.; Leem, Y.H.; Lee, H.J.,
Characterization of potent aroma compounds in Chrysanthemum coronarium L. (Garland) using aroma extract dilution analysis,
Flavour Fragr. J., 2004, 19, 5, 401-405, https://doi.org/10.1002/ffj.1447
. [all data]
bin Ahmad and bin Jantan, 2003
bin Ahmad, F.; bin Jantan, I.,
Chemical constituents of the essential oils of Goniothalamus uvariodes King,
Flavour Fragr. J., 2003, 18, 2, 128-130, https://doi.org/10.1002/ffj.1142
. [all data]
Angelini, Carpanese, et al., 2003
Angelini, L.G.; Carpanese, G.; Cioni, P.L.; Morelli, I.; Macchia, M.; Flamini, G.,
Essential oils from Mediterranean lamiaceae as weed germination inhibitors,
J. Agric. Food Chem., 2003, 51, 21, 6158-6164, https://doi.org/10.1021/jf0210728
. [all data]
Bader, Caponi, et al., 2003
Bader, A.; Caponi, C.; Cioni, P.L.; Flamini, G.; Morelli, I.,
Composition of the essential oil of Ballota undulata, B. nigra ssp. foetida and B. saxatilis,
Flavour Fragr. J., 2003, 18, 6, 502-504, https://doi.org/10.1002/ffj.1257
. [all data]
Bader, Caponi, et al., 2003, 2
Bader, A.; Caponi, C.; Cioni, P.L.; Flamini, G.; Morelli, I.,
Acorenone in the essential oil of flowering aerial parts of Seseli tortuosum L.,
Flavour Fragr. J., 2003, 18, 1, 57-58, https://doi.org/10.1002/ffj.1154
. [all data]
Bader, Flamini, et al., 2003
Bader, A.; Flamini, G.; Cioni, P.L.; Morelli, I.,
Essential oil composition of Achillea santolina L. and Achillea biebersteinii Afan. collected in Jordan,
Flavour Fragr. J., 2003, 18, 1, 36-38, https://doi.org/10.1002/ffj.1147
. [all data]
Bianchini, Tomi, et al., 2003
Bianchini, A.; Tomi, P.; Bernardini, A.F.; Morelli, I.; Flamini, G.; Cioni, P.L.; Usai, M.; Marchetti, M.,
A comparative study of volatile constituents of two Helichrysum italicum (Roth) Guss. Don Fil subspecies growing in Corsica (France), Tuscany and Sardinia (Italy),
Flavour Fragr. J., 2003, 18, 6, 487-491, https://doi.org/10.1002/ffj.1231
. [all data]
Bicchi, Rubiolo, et al., 2003
Bicchi, C.; Rubiolo, P.; Camargo, E.E.S.; Vilegas, W.; Gracioso, J.S.; Brito, A.R.M.S.,
Components of Turnera diffusa Willd. var. afrodisiaca (Ward) Urb. essential oil,
Flavour Fragr. J., 2003, 18, 1, 59-61, https://doi.org/10.1002/ffj.1155
. [all data]
Bougatsos, Meyer, et al., 2003
Bougatsos, C.; Meyer, J.J.M.; Magiatis, P.; Vagias, C.; Chinou, I.B.,
Composition and antimicrobial activity of the essential oils of Helichrysum kraussii Sch. Bip. and H. rugulosum Less. from south Africa,
Flavour Fragr. J., 2003, 18, 1, 48-51, https://doi.org/10.1002/ffj.1152
. [all data]
Brat, Rega, et al., 2003
Brat, P.; Rega, B.; Alter, P.; Reynes, M.; Brillouet, J.-M.,
Distribution of volatile compounds in the pulp, cloud, and serum of freshly squeezed orange juice,
J. Agric. Food Chem., 2003, 51, 11, 3442-3447, https://doi.org/10.1021/jf026226y
. [all data]
Cavaleiro, Salgueiro, et al., 2003
Cavaleiro, C.; Salgueiro, L.R.; da Cunha, A.P.; Figueiredo, A.C.; Barroso, J.G.; Bighelli, A.; Casanova, J.,
Composition and variability of the essential oils of the leaves and berries from Juniperus navicularis,
Biochem. Syst. Ecol., 2003, 31, 2, 193-201, https://doi.org/10.1016/S0305-1978(02)00080-7
. [all data]
Cavalli, Tomi, et al., 2003
Cavalli, J.-F.; Tomi, F.; Bernardini, A.-F.; Casanova, J.,
Composition and chemical variability of the bark oil of Cedrelopsis grevei H. Baillon from Madagascar,
Flavour Fragr. J., 2003, 18, 6, 532-538, https://doi.org/10.1002/ffj.1263
. [all data]
Ceva-Antunes, Bizzo, et al., 2003
Ceva-Antunes, P.M.N.; Bizzo, H.R.; Alves, S.M.; Antunes, O.A.C.,
Analysis of volatile compounds of taperebá (Spondias mombin L.) and Cajá (Spondias mombin L.) by simultaneous distillation and extraction (SDE) and solid phase microextraction (SPME),
J. Agric. Food Chem., 2003, 51, 5, 1387-1392, https://doi.org/10.1021/jf025873m
. [all data]
Chisholm, Wilson, et al., 2003
Chisholm, M.G.; Wilson, M.A.; Gaskey, G.M.,
Characterization of aroma volatiles in key lime essential oils (Cirtrus aurantifolia Swingle),
Flavour Fragr. J., 2003, 18, 2, 106-115, https://doi.org/10.1002/ffj.1172
. [all data]
Chosson, Vérité, et al., 2003
Chosson, E.; Vérité, P.; Blanckaert, A.; Seguin, E.; Litaudon, M.; Sévenet, T.,
Non polar compounds from the bark of Sarcomelicope follicularis,
Biochem. Syst. Ecol., 2003, 31, 10, 1185-1188, https://doi.org/10.1016/S0305-1978(03)00065-6
. [all data]
Choi, 2003
Choi, H.-S.,
Character impact odorants of Citrus Hallabong [(C. unshiu Marcov × C. sinensis Osbeck) × C. reticulata Blanco] cold-pressed peel oil,
J. Agric. Food Chem., 2003, 51, 9, 2687-2692, https://doi.org/10.1021/jf021069o
. [all data]
Dural, Bagci, et al., 2003
Dural, H.; Bagci, Y.; Ertugrul, K.; Demirelma, H.; Flamini, G.; Cioni, P.L.; Morelli, I.,
Essential oil composition of two endemic Centaurea species from Turkey, Centaurea mucronifera and Centaurea chrysantha, collected in the same habitat,
Biochem. Syst. Ecol., 2003, 31, 12, 1417-1425, https://doi.org/10.1016/S0305-1978(03)00128-5
. [all data]
Emilio Tomei, Manganelli, et al., 2003
Emilio Tomei, P.; Manganelli, R.E.U.; Flamini, G.; Cioni, P.L.; Morelli, I.,
Composition of the essential oil of Mentha microphylla from the Gennargentu Mountains (Sardinia, Italy),
J. Agric. Food Chem., 2003, 51, 12, 3614-3617, https://doi.org/10.1021/jf026091w
. [all data]
Ertugrul, Dural, et al., 2003
Ertugrul, K.; Dural, H.; Tugay, O.; Flamini, G.; Cioni, P.L.; Morelli, I.,
Essential oils from flowers of Centaurea kotschyi var. kotschyi and C. kotschyi var. decumbens from Turkey,
Flavour Fragr. J., 2003, 18, 2, 95-97, https://doi.org/10.1002/ffj.1168
. [all data]
de Feo, Bruno, et al., 2003
de Feo, V.; Bruno, M.; Tahiri, B.; Napolitano, F.; Senatore, F.,
Chemical composition and antibacterial activity of essential oils from Thymus spinulosus Ten. (Lamiaceae),
J. Agric. Food Chem., 2003, 51, 13, 3849-3853, https://doi.org/10.1021/jf021232f
. [all data]
de Feo, Urrunaga Soria, et al., 2003
de Feo, V.; Urrunaga Soria, E.; Urrunaga Soria, R.; Senatore, F.,
Chemical composition of essential oils of senecio nutans Sch.-Bip. (Asteraceae),
Flavour Fragr. J., 2003, 18, 3, 234-236, https://doi.org/10.1002/ffj.1204
. [all data]
Flamini, Luigi Cioni, et al., 2003
Flamini, G.; Luigi Cioni, P.; Morelli, I.,
Differences in the fragrances of pollen, leaves, and floral parts of garland (Chrysanthemum coronarium) and composition of the essential oils from flowerheads and leaves,
J. Agric. Food Chem., 2003, 51, 8, 2267-2271, https://doi.org/10.1021/jf021050l
. [all data]
Flamini, Luigi Cioni, et al., 2003, 2
Flamini, G.; Luigi Cioni, P.; Morelli, I.,
Short communication. Use of solid-phase micro-extraction as a sampling technique in the determination of volatiles emitted by flowers, isolated flower parts and pollen,
J. Chromatogr. A, 2003, 998, 1-2, 229-233, https://doi.org/10.1016/S0021-9673(03)00641-1
. [all data]
Flamini, Luigi Cioni, et al., 2003, 3
Flamini, G.; Luigi Cioni, P.; Morelli, I.,
Variability of the essential oil of Viola etrusca,
Ann. Bot. Rome, 2003, 91, 4, 493-497, https://doi.org/10.1093/aob/mcg039
. [all data]
Gancel, Ollitrault, et al., 2003
Gancel, A.-L.; Ollitrault, P.; Froelicher, Y.; Tomi, F.; Jacquemond, C.; Luro, F.; Brillouet, J.-M.,
Leaf volatile compounds of seven citrus somatic tetraploid hybrids sharing willow leaf mandarin (Citrus deliciosa Ten.) as their common parent,
J. Agric. Food Chem., 2003, 51, 20, 6006-6013, https://doi.org/10.1021/jf0345090
. [all data]
Högnadóttir and Rouseff, 2003
Högnadóttir, Á.; Rouseff, R.L.,
Identification of aroma active compounds in organce essence oil using gas chromatography-olfactometry and gas chromatography-mass spectrometry,
J. Chromatogr. A, 2003, 998, 1-2, 201-211, https://doi.org/10.1016/S0021-9673(03)00524-7
. [all data]
Isidorov, Vinogorova, et al., 2003
Isidorov, V.A.; Vinogorova, V.T.; Rafalowski, K.,
HS-SPME analysis of volatile organic compounds of coniferous needle litter,
Atmos. Environ., 2003, 37, 33, 4645-4650, https://doi.org/10.1016/j.atmosenv.2003.07.005
. [all data]
Jantan, Ling, et al., 2003
Jantan, I.; Ling, Y.E.; Romli, S.; Ayop, N.; Ahmad, A.S.,
A comparative study of the constituents of the essential oils of three Cinnamomum species from Malaysia,
J. Essent. Oil Res., 2003, 15, 6, 387-391, https://doi.org/10.1080/10412905.2003.9698618
. [all data]
bin Jantan, Yassin, et al., 2003
bin Jantan, I.; Yassin, M.S.M.; Chin, C.B.; Chen, L.L.; Sim. N.L.,
Antifungal activity of the essential oils of nine Zingiberaceae species,
Pharm. Biol., 2003, 41, 5, 392-397, https://doi.org/10.1076/phbi.41.5.392.15941
. [all data]
Javidnia, Miri, et al., 2003
Javidnia, K.; Miri, R.; Azarpira, A.; Tabaei, S.M.H.,
Composition of the essential oil of Stachys setifera C.A. Mey ssp. iranica growing in Iran,
Flavour Fragr. J., 2003, 18, 4, 299-300, https://doi.org/10.1002/ffj.1165
. [all data]
Karioti, Skaltsa, et al., 2003
Karioti, A.; Skaltsa, H.; Demetzos, C.; Perdetzoglou, D.; Economakis, C.D.; Salem, A.B.,
Effect of nitrogen concentration of the nutrient solution on the volatile constituents of leaves of Salvia fruticosa Mill. in solution culture,
J. Agric. Food Chem., 2003, 51, 22, 6505-6508, https://doi.org/10.1021/jf030308k
. [all data]
Macchioni, Cioni, et al., 2003
Macchioni, F.; Cioni, P.L.; Flamini, G.; Morelli, I.; Maccioni, S.; Ansaldi, M.,
Chemical composition of essential oils from needles, branches and cones of Pinus pinea, P. halepensis, P. pinaster and P. nigra from central Italy,
Flavour Fragr. J., 2003, 18, 2, 139-143, https://doi.org/10.1002/ffj.1178
. [all data]
Mimica-Dukic, Kujundzic, et al., 2003
Mimica-Dukic, N.; Kujundzic, S.; Sokovic, M.; Couladis, M.,
Essential oil composition and antifungal activity of Foeniculum vulgare Mill. obtained by different distillation conditions,
Phytother. Res., 2003, 17, 4, 368-371, https://doi.org/10.1002/ptr.1159
. [all data]
Ngassapa, Runyoro, et al., 2003
Ngassapa, O.; Runyoro, D.K.B.; Harvala, E.; Chinou, I.B.,
Composition and antimicrobial activity of essential oils of two populations of Tanzanian Lippia javanica (Burm. f.) Spreng. (Verbenaceae),
Flavour Fragr. J., 2003, 18, 3, 221-224, https://doi.org/10.1002/ffj.1195
. [all data]
Pino, Almora, et al., 2003
Pino, J.; Almora, K.; Marbot, R.,
Volatile components of papaya (Carica papaya L., maradol variety) fruit,
Flavour Fragr. J., 2003, 18, 6, 492-496, https://doi.org/10.1002/ffj.1248
. [all data]
Pino, Marbot, et al., 2003
Pino, J.; Marbot, R.; Rosado, A.; Vázquez, C.,
Volatile constituents of fruits of Garcinia dulcis Kurz. from Cuba,
Flavour Fragr. J., 2003, 18, 4, 271-274, https://doi.org/10.1002/ffj.1187
. [all data]
Salido, Altarejos, et al., 2003
Salido, S.; Altarejos, J.; Nogueras, M.; Sánchez, A.; Luque, P.,
Chemical composition and seasonal variations of rosemary oil from Southern Spain,
J. Essent. Oil Res., 2003, 15, 1, 10-14, https://doi.org/10.1080/10412905.2003.9712248
. [all data]
Shao, Marriott, et al., 2003
Shao, Y.; Marriott, P.; Shellie, R.; Hügel, H.,
Solid-phase micro-extraction-comprehensive two-dimensional gas chromatography of ginger (Zingiber officinale) volatiles,
Flavour Fragr. J., 2003, 18, 1, 5-12, https://doi.org/10.1002/ffj.1133
. [all data]
Shellie, Marriott, et al., 2003
Shellie, R.; Marriott, P.; Zappia, G.; Mondello, L.; Dugo, G.,
Interactive use of linear retention indices on polar and apolar columns with an MS-Library for reliable characterization of Australian tea tree and other Melaleuca sp. oils,
J. Essent. Oil Res., 2003, 15, 5, 305-312, https://doi.org/10.1080/10412905.2003.9698597
. [all data]
Skaltsa, Demetzos, et al., 2003
Skaltsa, H.D.; Demetzos, C.; Lazari, D.; Sokovic, M.,
Essential oil analysis and antimicrobial activity of eight Stachys species from Greece,
Phytochemistry, 2003, 64, 3, 743-752, https://doi.org/10.1016/S0031-9422(03)00386-8
. [all data]
Sun and Stremple, 2003
Sun, G.; Stremple, P.,
Retention index characterization of flavor, fragrance, and many other compounds on DB-1 and DB-XLB, 2003, retrieved from http://www.chem.agilent.com/cag/cabu/pdf/b-0279.pdf. [all data]
Tampieri, Galuppi, et al., 2003
Tampieri, M.P.; Galuppi, R.; Carelle, M.S.; Macchioni, F.; Cioni, P.L.; Morelli, I.,
Effect of selected essential oils and pure compounds on Saprolegnia parasitica,
Pharm. Biol., 2003, 41, 8, 584-591, https://doi.org/10.1080/13880200390501839
. [all data]
Tsiri, Kretsi, et al., 2003
Tsiri, D.; Kretsi, O.; Chinou, I.B.; Spyropoulos, C.G.,
Composition of fruit volatiles and annual changes in the volatiles of leaves of Eucalyptus camaldulensis Dehn. growing in Greece,
Flavour Fragr. J., 2003, 18, 3, 244-247, https://doi.org/10.1002/ffj.1220
. [all data]
Tzakou, Couladis, et al., 2003
Tzakou, O.; Couladis, M.; Slavkovska, V.; Mimica-Dukic, N.; Jancic, R.,
The essential oil composition of Salvia brachyodon Vandas,
Flavour Fragr. J., 2003, 18, 1, 2-4, https://doi.org/10.1002/ffj.1132
. [all data]
Verzera, Trozzi, et al., 2003
Verzera, A.; Trozzi, A.; Gazea, F.; Cicciarelloi, G.; Cotroneo, A.,
Effects of rootstock on the composition of bergamot (Citrus bergamia Risso et Poiteau) essential oil,
J. Agric. Food Chem., 2003, 51, 1, 206-210, https://doi.org/10.1021/jf0206872
. [all data]
Xu, van Stee, et al., 2003
Xu, X.; van Stee, L.L.P.; Williams, J.; Beens, J.; Adahchour, M.; Vreuls, R.J.J.; Brinkman, U.A.Th.; Lelieveld, J.,
Comprehensive two-dimensional gas chromatography (GC×GC) measurements of volatile organic compounds in the atmosphere,
Atmos. Chem. Phys., 2003, 3, 3, 665-682, https://doi.org/10.5194/acp-3-665-2003
. [all data]
Afsharypuor and Suleimany, 2002
Afsharypuor, S.; Suleimany, M.,
Volatile oil constituents of Brassica oleracea var. gongylodes seeds,
J. Essent. Oil Res., 2002, 14, 1, 18-19, https://doi.org/10.1080/10412905.2002.9699748
. [all data]
Cavaleiro, Salgueiro, et al., 2002
Cavaleiro, C.; Salgueiro, L.R.; Antunes, T.; Sevinate-Pinto, I.; Barroso, J.G.,
Composition of the essential oil and micromorphology of trichomes of Teucrium salviastrum, an endemic species from Portugal,
Flavour Fragr. J., 2002, 17, 4, 287-291, https://doi.org/10.1002/ffj.1068
. [all data]
Couladis, Chinou, et al., 2002
Couladis, M.; Chinou, I.B.; Tzakou, O.; Loukis, A.,
Composition and antimicrobial activity of the essential oil of Ballota pseudodictamnus L. Bentham,
Phytother. Res., 2002, 16, 8, 723-726, https://doi.org/10.1002/ptr.1043
. [all data]
Duckham, Dodson, et al., 2002
Duckham, S.C.; Dodson, A.T.; Bakker, J.; Ames, J.M.,
Effect of cultivar and storage time on the volatile flavor components of baked potato,
J. Agric. Food Chem., 2002, 50, 20, 5640-5648, https://doi.org/10.1021/jf011326+
. [all data]
Economakis, Skaltsa, et al., 2002
Economakis, C.; Skaltsa, H.; Demetzos, C.; Sokovic, M.; Thanos, C.A.,
Effect of phosphorus concentration of the nutrient solution on the volatile constituents of leaves and bracts of Origanum dictamnus,
J. Agric. Food Chem., 2002, 50, 22, 6276-6280, https://doi.org/10.1021/jf0203444
. [all data]
Flamini, Cioni, et al., 2002
Flamini, G.; Cioni, P.L.; Morelli, I.,
Analysis of the essential oil of the aerial parts of Viola etrusca from Monte Labbro (South Tuscany, Italy) and in vivo analysis of flower volatiles using SPME,
Flavour Fragr. J., 2002, 17, 2, 147-149, https://doi.org/10.1002/ffj.1060
. [all data]
Flamini, Cioni, et al., 2002, 2
Flamini, G.; Cioni, P.L.; Morelli, I.; Macchia, M.; Ceccarini, L.,
Main agronomic-productive characteristics of two ecotypes of Rosmarinus officinalis L. and chemical composition of their essential oils,
J. Agric. Food Chem., 2002, 50, 12, 3512-3517, https://doi.org/10.1021/jf011138j
. [all data]
Flamini, Cioni, et al., 2002, 3
Flamini, G.; Cioni, P.L.; Morelli, I.,
Differences in the fragrances of pollen and different floral parts of male and female flowers of Laurus nobilis,
J. Agric. Food Chem., 2002, 50, 16, 4647-4652, https://doi.org/10.1021/jf020269x
. [all data]
Fokialakis, Magiatis, et al., 2002
Fokialakis, N.; Magiatis, P.; Mitaku, S.,
Essential oil constituents of Valeriana italica and Valeriana tuberosa. Stereochemical and conformational study of 15-acetoxyvaleranone,
Z. Naturforsch., 2002, 57c, 791-796. [all data]
Hudaib, Speroni, et al., 2002
Hudaib, M.; Speroni, E.; di Pietra, A.M.; Cavrini, V.,
GC/MS evaluation of thyme (Thymus vulgaris L.) oil composition and variations during the vegetative cycle,
J. Pharm. Biomed. Anal., 2002, 29, 4, 691-700, https://doi.org/10.1016/S0731-7085(02)00119-X
. [all data]
bin Jantan, Ayop, et al., 2002
bin Jantan, I.; Ayop, N.; Hiong, A.B.; Ahmad, A.S.,
Chemical composition of the essential oils of Cinnamomum cordatum Kosterm,
Flavour Fragr. J., 2002, 17, 3, 212-214, https://doi.org/10.1002/ffj.1075
. [all data]
Javidnia, Miri, et al., 2002
Javidnia, K.; Miri, R.; Kamalinejad, M.; Nasiri, A.,
Composition of the essential oil of Salvia mirzayanii Rech. f. Esfand from Iran,
Flavour Fragr. J., 2002, 17, 6, 465-467, https://doi.org/10.1002/ffj.1128
. [all data]
Kovacevic, Pavlovic, et al., 2002
Kovacevic, N.; Pavlovic, M.; Menkovic, N.; Tzakou, O.; Couladis, M.,
Composition of the essential oil from roots and rhizomes of Valeriana pancicii Halácsy Bald,
Flavour Fragr. J., 2002, 17, 5, 355-357, https://doi.org/10.1002/ffj.1100
. [all data]
Lota, de Rocca Serra, et al., 2002
Lota, M.-L.; de Rocca Serra, D.; Tomi, F.; Jacquemond, C.; Casanova, J.,
Volatile components of peel and leaf oils of lemon and lime species,
J. Agric. Food Chem., 2002, 50, 4, 796-805, https://doi.org/10.1021/jf010924l
. [all data]
Magiatis, Skaltsounis, et al., 2002
Magiatis, P.; Skaltsounis, A.-L.; Chinou, I.; Haroutounian, S.A.,
Chemical composition and in-vitro antimicrobial activity of the essential oils of three greek Achillea species,
Z. Naturforsch., 2002, 57c, 287-290. [all data]
Miri, Ramezani, et al., 2002
Miri, R.; Ramezani, M.; Javidnia, K.; Ahmadi, L.,
Composition of the volatile oil of Thymus transcaspicus Klokov from Iran,
Flavour Fragr. J., 2002, 17, 4, 245-246, https://doi.org/10.1002/ffj.1104
. [all data]
Mondello, Zappia, et al., 2002
Mondello, L.; Zappia, G.; Cotroneo, A.; Bonaccorsi, I.; Chowdhury, J.U.; Yusuf, M.; Dugo, G.,
Studies on the essential oil-bearing plants of Bangladesh. Part VIII. Composition of some Ocimum oils O. basilicum L. var. purpurascens; O. sanctum L. green; O. sanctum L. purple; O. americanum L., citral type; O. americanum L., camphor type,
Flavour Fragr. J., 2002, 17, 5, 335-340, https://doi.org/10.1002/ffj.1108
. [all data]
Nath, Sarma, et al., 2002
Nath, S.C.; Sarma, K.K.; Vajezikova, I.; Leclercq, P.A.,
Comparison of volatile inflorescence oils and taxonomy of certain Cymbopogon taxa described as Cymbopogon flexuosus (Nees ex Steud.) Wats.,
Biochem. Syst. Ecol., 2002, 30, 2, 151-162, https://doi.org/10.1016/S0305-1978(01)00066-7
. [all data]
Oruna-Concha, Ames, et al., 2002
Oruna-Concha, M.J.; Ames, J.M.; Bakker, J.,
Comparison of the volatile components of eight cultivars of potato after microwave baking,
Lebensm. Wiss. Technol., 2002, 35, 1, 80-86, https://doi.org/10.1006/fstl.2001.0819
. [all data]
Pino, Marbot, et al., 2002
Pino, J.A.; Marbot, R.; Quert, R.; García, H.,
Study of essential oils of Eucalyptus resinifera Smith, E. tereticornis Smith and Corymbia maculata (Hook.) K.D. Hill L.A.S. Johnson, grown in Cuba,
Flavour Fragr. J., 2002, 17, 1, 1-4, https://doi.org/10.1002/ffj.1026
. [all data]
Pino, Marbot, et al., 2002, 2
Pino, J.; Marbot, R.; Rosado, A.,
Volatile constituents of star apple (Chrysophyllum cainito L.) from Cuba,
Flavour Fragr. J., 2002, 17, 5, 401-403, https://doi.org/10.1002/ffj.1116
. [all data]
Pino, Marbot, et al., 2002, 3
Pino, J.A.; Marbot, R.; Bello, A.,
Volatile compounds of Psidium salutare (H.B.K.) Berg. fruit,
J. Agric. Food Chem., 2002, 50, 18, 5146-5148, https://doi.org/10.1021/jf0116303
. [all data]
Pino, Marbot, et al., 2002, 4
Pino, J.A.; Marbot, R.; Vázquez, C.,
Characterization of volatile in Cosa Rican Guava [Psidium friedrichsthalianum (Berg) Niedenzu] fruit,
J. Agric. Food Chem., 2002, 50, 21, 6023-6026, https://doi.org/10.1021/jf011456i
. [all data]
Pintore, Usai, et al., 2002
Pintore, G.; Usai, M.; Bradesi, P.; Juliano, C.; Boatto, G.; Tomi, F.; Chessa, M.; Cerri, R.; Casanova, J.,
Chemical composition and antimicrobial activity of Rosmarinus officinalis L. oils from Sardinia and Corsica,
Flavour Fragr. J., 2002, 17, 1, 15-19, https://doi.org/10.1002/ffj.1022
. [all data]
Pitarokili, Couladis, et al., 2002
Pitarokili, D.; Couladis, M.; Petsikos-Panayotarou, N.; Tzakou, O.,
Composition and antifungal activity on soil-borne pathogens of the essential oil of Salvia sclarea from Greece,
J. Agric. Food Chem., 2002, 50, 23, 6688-6691, https://doi.org/10.1021/jf020422n
. [all data]
Shang, Hu, et al., 2002
Shang, C.; Hu, Y.; Deng, C.; Hu, K.,
Rapid determination of volatile constituents of Michelia alba flowers by gas chromatography-mass spectrometry with solid-phase microextraction,
J. Chromatogr. A, 2002, 942, 1-2, 283-288, https://doi.org/10.1016/S0021-9673(01)01382-6
. [all data]
Shellie, Mondello, et al., 2002
Shellie, R.; Mondello, L.; Marriott, P.; Dugo, G.,
Characterisation of lavender essential oils by using gas chromatography-mass spectrometry with correlation of linear retention indices and comparison with comprehensive two-dimensional gas chromatography,
J. Chromatogr. A, 2002, 970, 1-2, 225-234, https://doi.org/10.1016/S0021-9673(02)00653-2
. [all data]
Aligiannis, Kalpoutzakis, et al., 2001
Aligiannis, N.; Kalpoutzakis, E.; Mitaku, S.; Chinou, I.B.,
Composition and antimicrobial activity of the essential oils of two Origanum species,
J. Agric. Food Chem., 2001, 49, 9, 4168-4170, https://doi.org/10.1021/jf001494m
. [all data]
Aligiannis, Kalpoutzakis, et al., 2001, 2
Aligiannis, N.; Kalpoutzakis, E.; Chinou, I.B.; Mitaku, S.; Gikas, E.; Tsarbopoulos, A.,
Composition and antimicrobial activity of the essential oils of five taxa of Sideritis from Greece,
J. Agric. Food Chem., 2001, 49, 2, 811-815, https://doi.org/10.1021/jf001018w
. [all data]
Bianchini, Tomi, et al., 2001
Bianchini, A.; Tomi, P.; Costa, J.; Bernardini, A.F.,
Composition of Helichrysum italicum (Roth) G. Don fil. subsp. italicum essential oils from Corsica (France),
Flavour Fragr. J., 2001, 16, 1, 30-34, https://doi.org/10.1002/1099-1026(200101/02)16:1<30::AID-FFJ941>3.0.CO;2-F
. [all data]
Bruna, Hierro, et al., 2001
Bruna, J.M.; Hierro, E.M.; de la Hoz, L.; Mottram, D.S.; Fernández, M.; Ordóñez, J.A.,
The contribution of Penicillium aurantiogriseum to the volatile composition and sensory quality of dry fermented sausages,
Meat Sci., 2001, 59, 1, 97-107, https://doi.org/10.1016/S0309-1740(01)00058-4
. [all data]
Couladis, Baziou, et al., 2001
Couladis, M.; Baziou, P.; Petrakis, P.V.; Harvala, C.,
Essential oil composition of Hypericum perfoliatum L. growing in different locations in Greece,
Flavour Fragr. J., 2001, 16, 3, 204-206, https://doi.org/10.1002/ffj.979
. [all data]
Couladis, Tsortanidou, et al., 2001
Couladis, M.; Tsortanidou, V.; Francisco-Ortega, J.; Santos-Guerra, A.; Harvala, C.,
Composition of the essential oils of Argyranthemum species growing in the Canary Islands,
Flavour Fragr. J., 2001, 16, 2, 103-106, https://doi.org/10.1002/ffj.954
. [all data]
Couladis, Tzakou, et al., 2001
Couladis, M.; Tzakou, O.; Stojanovic, D.; Mimica-Dukic, N.; Jancic, R.,
The essential oil composition of Salvia argentea L.,
Flavour Fragr. J., 2001, 16, 3, 227-229, https://doi.org/10.1002/ffj.989
. [all data]
Giamakis, Kretsi, et al., 2001
Giamakis, A.; Kretsi, O.; Chinou, I.; Spyropoulos, C.G.,
Eucalyptus camaldulensis: volatiles from immature flowers and high production of 1,8-cineole and β-pinene by in vitro cultures,
Phytochemistry, 2001, 58, 2, 351-355, https://doi.org/10.1016/S0031-9422(01)00193-5
. [all data]
Guilliard, Delgado, et al., 2001
Guilliard, M.; Delgado, W.; Martínez, J.R.; Stashenko, E.,
Determination of the enantiomeric purity of carvone, main component of Colombian Lippia alba (Mill) oil by means of bidimensional gas chromatography (23rd International Symposium on Capillary Chromatography), 2001, retrieved from http://www.richrom.com/assets/CD23PDF/i01.pdf. [all data]
Hudaib, Grazia Bellardi, et al., 2001
Hudaib, M.; Grazia Bellardi, M.; Rubies-Autonell, C.; Fiori, J.; Cavrini, V.,
Chromatographic (GC-MS, HPLC) and virological evaluations of Salvia sclarea infected by BBWV-I,
Farmaco, 2001, 56, 3, 219-227, https://doi.org/10.1016/S0014-827X(01)01038-2
. [all data]
bin Jantan, Basni, et al., 2001
bin Jantan, I.; Basni, I.; Ahmad, A.S.; Ali, N.A.M.; Ahmad, A.R.; Ibrahim, H.,
Constituents of the rhizome oils of Boesenbergia pandurata (Roxb.) Schlecht from Malaysia, Indonesia and Thailand,
Flavour Fragr. J., 2001, 16, 2, 110-112, https://doi.org/10.1002/ffj.956
. [all data]
Larráyoz, Addis, et al., 2001
Larráyoz, P.; Addis, M.; Gauch, R.; Bosset, J.O.,
Comparison of dynamic headspace and simultaneous distillation extraction techniques used for the analysis of the volatile components in three European PDO ewes milk cheeses,
Int. Dairy J., 2001, 11, 11-12, 911-926, https://doi.org/10.1016/S0958-6946(01)00144-3
. [all data]
Lota, Serra, et al., 2001
Lota, M.-L.; Serra, D.R.; Jacquemond, C.; Tomi, F.; Casanova, J.,
Chemical variability of peel and leaf essential oils of sour orange,
Flavour Fragr. J., 2001, 16, 2, 89-96, https://doi.org/10.1002/1099-1026(200103/04)16:2<89::AID-FFJ950>3.0.CO;2-D
. [all data]
Pino, Marbot, et al., 2001
Pino, J.A.; Marbot, R.; Vázquez, C.,
Characterization of volatiles in strawberry guava (Psidium cattleianum Sabine) fruit,
J. Agric. Food Chem., 2001, 49, 12, 5883-5887, https://doi.org/10.1021/jf010414r
. [all data]
Rezzi, Bighelli, et al., 2001
Rezzi, S.; Bighelli, A.; Mouillot, D.; Casanova, J.,
Composition and chemical variability of the needle essential oil of Pinus nigra subsp. laricio from corsica,
Flavour Fragr. J., 2001, 16, 5, 379-383, https://doi.org/10.1002/ffj.1018
. [all data]
Rezzi, Cavaleiro, et al., 2001
Rezzi, S.; Cavaleiro, C.; Bighelli, A.; Salgueiro, L.; da Cunha, A.P.; Casanova, J.,
Intraspecific chemical variability of the leaf essential oil of Juniperus phoenicea subsp. turbinata from Corsica,
Biochem. Syst. Ecol., 2001, 29, 2, 179-188, https://doi.org/10.1016/S0305-1978(00)00044-2
. [all data]
Salido, Altarejos, et al., 2001
Salido, S.; Altarejos, J.; Nogueras, M.; Sánchez, A.,
Chemical composition of the essential oil of Artemisia herba-alba Asso ssp. valentina (Lam.) Marcl.,
J. Essent. Oil Res., 2001, 13, 4, 221-224, https://doi.org/10.1080/10412905.2001.9699675
. [all data]
Skaltsa, Mavrommati, et al., 2001
Skaltsa, H.D.; Mavrommati, A.; Constantinidis, T.,
A chemotaxonomic investigation of volatile constituents in Stachys subsect. Swainsonianeae (Labiatae),
Phytochemistry, 2001, 57, 2, 235-244, https://doi.org/10.1016/S0031-9422(01)00003-6
. [all data]
Yin, Xiu, et al., 2001
Yin, W.; Xiu, Z.; Aijin, H.,
Analysis of the volatile components in trogopterorum feces by capillary gas chromatography and gas chromatography/mass spectrometry,
Fenxi Huaxue, 2001, 29, 2, 195-198. [all data]
Zabaras and Wyllie, 2001
Zabaras, D.; Wyllie, S.G.,
Quantitative analysis of terpenoids in the gas phase using headspace solid-phase microextraction (HS-SPME),
Flavour Fragr. J., 2001, 16, 6, 411-416, https://doi.org/10.1002/ffj.1025
. [all data]
Alonzo, Bosco, et al., 2000
Alonzo, G.; Bosco, S.F.D.; Palazzolo, E.; Saiano, F.; Tusa, N.,
Citrus somatic hybrid leaf essential oil,
Flavour Fragr. J., 2000, 15, 4, 258-262, https://doi.org/10.1002/1099-1026(200007/08)15:4<258::AID-FFJ906>3.0.CO;2-F
. [all data]
Baldovini, Ristorcelli, et al., 2000
Baldovini, N.; Ristorcelli, D.; Tomi, F.; Casanova, J.,
Infraspecific variability of the essential oil of Calamintha nepeta from Corsica (France),
Flavour Fragr. J., 2000, 15, 1, 50-54, https://doi.org/10.1002/(SICI)1099-1026(200001/02)15:1<50::AID-FFJ871>3.0.CO;2-F
. [all data]
Bartley and Jacobs, 2000
Bartley, J.P.; Jacobs, A.L.,
Effects of drying on flavour compounds in Australian-grown ginger (Zingiber officinale),
J. Sci. Food Agric., 2000, 80, 2, 209-215, https://doi.org/10.1002/(SICI)1097-0010(20000115)80:2<209::AID-JSFA516>3.0.CO;2-8
. [all data]
Brat, Brillouet, et al., 2000
Brat, P.; Brillouet, J.-M.; Reynes, M.; Cogat, P.-O.; Ollé, D.,
Free volatile components of passion fruit puree obtained by flash vacuum-expansion,
J. Agric. Food Chem., 2000, 48, 12, 6210-6214, https://doi.org/10.1021/jf000645i
. [all data]
Chevance, Farmer, et al., 2000
Chevance, F.F.V.; Farmer, L.J.; Desmond, E.M.; Novelli, E.; Troy, D.J.; Chizzolini, R.,
Effect of some fat replacers on the release of volatile aroma compounds from low-fat meat products,
J. Agric. Food Chem., 2000, 48, 8, 3476-3484, https://doi.org/10.1021/jf991211u
. [all data]
Kim, Thuy, et al., 2000
Kim, T.H.; Thuy, N.T.; Shin, J.H.; Baek, H.H.; Lee, H.J.,
Aroma-active compounds of miniature beefsteakplant (Mosla dianthera Maxim.),
J. Agric. Food Chem., 2000, 48, 7, 2877-2881, https://doi.org/10.1021/jf000219x
. [all data]
Lazari, Skaltsa, et al., 2000
Lazari, D.M.; Skaltsa, H.D.; Constantinidis, T.,
Volatile constituents of Centaurea pelia DC., C. thessala Hausskn. subsp. drakiensis (Freyn Sint.) Georg. and C. zuccariniana DC. from Greece,
Flavour Fragr. J., 2000, 15, 1, 7-11, https://doi.org/10.1002/(SICI)1099-1026(200001/02)15:1<7::AID-FFJ860>3.0.CO;2-3
. [all data]
Lota, de Rocca Serra, et al., 2000
Lota, M.-L.; de Rocca Serra, D.; Tomi, F.; Casanova, J.,
Chemical variability of peel and leaf essential oils of mandarins from Citrus reticulata Blanco,
Biochem. Syst. Ecol., 2000, 28, 1, 61-78, https://doi.org/10.1016/S0305-1978(99)00036-8
. [all data]
Milos and Radonic, 2000
Milos, M.; Radonic, A.,
Gas chromatography mass spectral analysis of free and glycosidically bound volatile compounds from Juniperus oxycedrus L. growing wild in Croatia,
Food Chem., 2000, 68, 3, 333-338, https://doi.org/10.1016/S0308-8146(99)00192-2
. [all data]
Mondello, Zappia, et al., 2000
Mondello, L.; Zappia, G.; Dugo, P.; Dugo, G.; Bonaccorsi, I.; Dugo, G.,
Identification of complex samples by Fast-GC/MS using linear retention indices in conjunction with the MS-library, Proceedings, 23rd ISCC; CD-ROM, 2000, retrieved from http://www.richrom.com/assets/CD23PDF. [all data]
Paramonov, Khalilova, et al., 2000
Paramonov, E.A.; Khalilova, A.Z.; Odinokov, V.N.; Khalilov, L.M.,
Identification and biological activity of volatile organic compounds isolated from plants and insects. III. Chromatography-mass spectrometry of volatile compoundsof Aegopodium podagraria,
Chem. Nat. Compd. (Engl. Transl.), 2000, 36, 6, 584-586, https://doi.org/10.1023/A:1017563708858
. [all data]
Pfeifhofer, 2000
Pfeifhofer, H.W.,
Composition of the essential oil of Pinus canariensis Sweet ex Sprengel,
Flavour Fragr. J., 2000, 15, 4, 266-270, https://doi.org/10.1002/1099-1026(200007/08)15:4<266::AID-FFJ908>3.0.CO;2-E
. [all data]
Skaltsa, Lazari, et al., 2000
Skaltsa, H.D.; Lazari, D.M.; Loukis, A.E.; Constantinidis, T.,
Essential oil analysis of Nepeta argolica Bory Chaub. subsp. argolica (Lamiaceae) growing wild in Greece,
Flavour Fragr. J., 2000, 15, 2, 96-99, https://doi.org/10.1002/(SICI)1099-1026(200003/04)15:2<96::AID-FFJ873>3.0.CO;2-F
. [all data]
Song, Sawamura, et al., 2000
Song, H.S.; Sawamura, M.; Ito, T.; Kawashimo, K.; Ukeda, H.,
Quantitative determination of characteric flavour of Citrus junos (yuzu) peel oil,
Flavour Fragr. J., 2000, 15, 4, 245-250, https://doi.org/10.1002/1099-1026(200007/08)15:4<245::AID-FFJ904>3.0.CO;2-V
. [all data]
Song, Sawamura, et al., 2000, 2
Song, H.S.; Sawamura, M.; Ito, T.; Ido, A.; Ukeda, H.,
Quantitative determination and characteristic flavour of daidai (Citrus aurantium L. var. cyathifera Y. Tanaka) peel oil,
Flavour Fragr. J., 2000, 15, 5, 323-328, https://doi.org/10.1002/1099-1026(200009/10)15:5<323::AID-FFJ918>3.0.CO;2-J
. [all data]
Verzera, la Rosa, et al., 2000
Verzera, A.; la Rosa, G.; Zappalà, M.; Cotroneo, A.,
Essential oil composition of different cultivars of bergamot grown in Sicily,
Ital. J. Food Sci., 2000, 12, 4, 493-501. [all data]
Verzera, Trozzi, et al., 2000
Verzera, A.; Trozzi, A.; Cotroneo, A.; Lorenzo, D.; Dellacassa, E.,
Uruguayan essential oil. 12. Composition of Nova and Satsuma mandarin oils,
J. Agric. Food Chem., 2000, 48, 7, 2903-2909, https://doi.org/10.1021/jf990734z
. [all data]
Yassaa, Meklati, et al., 2000
Yassaa, N.; Meklati, B.Y.; Cecinato, A.,
Evaluation of monoterpenic biogenic volatile organic compounds in ambient air around Eucalyptus globulus, Pinus halepensis and Cedrus atlantica trees growing in Algiers city area by chiral and achiral capillary gas chromatography,
Atmos. Environ., 2000, 34, 17, 2809-2816, https://doi.org/10.1016/S1352-2310(99)00436-7
. [all data]
Zunino, Lopez, et al., 2000
Zunino, M.P.; Lopez, M.L.; Faillacik, S.M.; Lopez, A.G.; Espinar, L.A.; Zygadlo, J.A.,
Essential oil of Baccharis cordobensis Heering,
Flavour Fragr. J., 2000, 15, 3, 151-152, https://doi.org/10.1002/1099-1026(200005/06)15:3<151::AID-FFJ884>3.0.CO;2-E
. [all data]
Chevance and Farmer, 1999
Chevance, F.F.V.; Farmer, L.J.,
Identification of major volatile odor compounds in frankfurters,
J. Agric. Food Chem., 1999, 47, 12, 5151-5160, https://doi.org/10.1021/jf990515d
. [all data]
Helmig, Klinger, et al., 1999
Helmig, D.; Klinger, L.F.; Guenther, A.; Vierling, L.; Geron, C.; Zimmerman, P.,
Biogenic volatile organic compound emissions (BVOCs). I. Identifications from three continental sites in the U.S.,
Chemosphere, 1999, 38, 9, 2163-2187, https://doi.org/10.1016/S0045-6535(98)00425-1
. [all data]
Javidnia and Shafiee, 1999
Javidnia, K.; Shafiee, A.,
Constituents of the essential oil of Matricaria decipiens C. Koch,
Flavour Fragr. J., 1999, 14, 3, 153-155, https://doi.org/10.1002/(SICI)1099-1026(199905/06)14:3<153::AID-FFJ792>3.0.CO;2-V
. [all data]
Lota, Serra, et al., 1999
Lota, M.-L.; Serra, D.R.; Tomi, F.; Bessiere, J.-M.; Casanova, J.,
Chemical composition of peel and leaf essential oils of Citrus medica L. and C. limonimedica Lush.,
Flavour Fragr. J., 1999, 14, 3, 161-166, https://doi.org/10.1002/(SICI)1099-1026(199905/06)14:3<161::AID-FFJ801>3.0.CO;2-8
. [all data]
Mazzoni, Tomi, et al., 1999
Mazzoni, V.; Tomi, F.; Casanova, J.,
A daucane-type sesquiterpene from Faucus carota seed oil,
Flavour Fragr. J., 1999, 14, 5, 268-272, https://doi.org/10.1002/(SICI)1099-1026(199909/10)14:5<268::AID-FFJ823>3.0.CO;2-Z
. [all data]
Menut, Bessiere, et al., 1999
Menut, C.; Bessiere, J.M.; Samate, A.D.; Millogo-Rasolodimby, J.; Nacro, M.,
Apodophyllone and isotorquatone, two arenic ketones from Eucalyptus apodophylla,
Phytochemistry, 1999, 51, 8, 975-978, https://doi.org/10.1016/S0031-9422(99)00050-3
. [all data]
Mirza and Sefidkon, 1999
Mirza, M.; Sefidkon, F.,
Essential oil composition of two Salvia species from Iran, Salvia nemorosa L. and Salvia reuterana Boiss.,
Flavour Fragr. J., 1999, 14, 4, 230-232, https://doi.org/10.1002/(SICI)1099-1026(199907/08)14:4<230::AID-FFJ816>3.0.CO;2-L
. [all data]
Muselli, Hoi, et al., 1999
Muselli, A.; Hoi, T.M.; Cu, L.D.; Moi, L.D.; Bessière, J.-M.; Bighelli, A.; Casanova, J.,
Composition of the essential oil of Acanthopanax trifoliatus (L.) Merr. (Araliacaea) from Vietnam,
Flavour Fragr. J., 1999, 14, 1, 41-44, https://doi.org/10.1002/(SICI)1099-1026(199901/02)14:1<41::AID-FFJ781>3.0.CO;2-B
. [all data]
Stashenko, Cervantes, et al., 1999
Stashenko, E.E.; Cervantes, M.; Combariza, Y.; Fuentes, H.; Martínez, J.R.,
HRGC/FID and HRGC/MSD analysis of the secondary metabolites obtained by different extraction methods from Lepechinia schiedeana, an in vitro evaluation of its antioxidant activity,
J. Hi. Res. Chromatogr., 1999, 22, 6, 343-349, https://doi.org/10.1002/(SICI)1521-4168(19990601)22:6<343::AID-JHRC343>3.0.CO;2-J
. [all data]
Sumathykutty, Rao, et al., 1999
Sumathykutty, M.A.; Rao, J.M.; Padmakumari, K.P.; Narayanan, C.S.,
Essential oil constituents of some Piper species,
Flavour Fragr. J., 1999, 14, 5, 279-282, https://doi.org/10.1002/(SICI)1099-1026(199909/10)14:5<279::AID-FFJ821>3.0.CO;2-0
. [all data]
Weyerstahl, Marschall, et al., 1999
Weyerstahl, P.; Marschall, H.; Wahlburg, H.-C.; Christiansen, C.; Rustaiyan, A.; Mirdjalili, F.,
Constituents of the essential oil of Pulicaria gnaphalodes (Vent.) Boiss. from Iran,
Flavour Fragr. J., 1999, 14, 2, 121-130, https://doi.org/10.1002/(SICI)1099-1026(199903/04)14:2<121::AID-FFJ790>3.0.CO;2-K
. [all data]
Bicchi, Rubiolo, et al., 1998
Bicchi, C.; Rubiolo, P.; Marschall, H.; Weyerstahl, P.; Laurent, R.,
Constituents of Artemisia roxburghiana Besser essential oil,
Flavour Fragr. J., 1998, 13, 1, 40-46, https://doi.org/10.1002/(SICI)1099-1026(199801/02)13:1<40::AID-FFJ688>3.0.CO;2-Z
. [all data]
Isidorov, Zenkevich, et al., 1998
Isidorov, V.A.; Zenkevich, I.G.; Dubis, E.N.; Slowikowski, A.; Wojciuk, E.,
Group identification of essential oils components using partition coefficients in a hexane-acetonitrile system,
J. Chromatogr. A, 1998, 814, 1-2, 253-260, https://doi.org/10.1016/S0021-9673(98)00398-7
. [all data]
Verdier-Metz., Coulon, et al., 1998
Verdier-Metz., I.; Coulon, J.-B.; PPradel, P.; Viallon, C.; Berdague, J.-L.,
Effect of forage conservation (hay or silage) and cow breed on the coagulation properties of milks and on the characteristics of ripened cheeses,
J. Dairy Res., 1998, 65, 1, 9-21, https://doi.org/10.1017/S0022029997002616
. [all data]
Oprean, Tamas, et al., 1998
Oprean, R.; Tamas, M.; Sandulescu, R.; Roman, L.,
Essential oils analysis. I. Evaluation of essential oils composition using both GC and MS fingerprints,
J. Pharm. Biomed. Anal., 1998, 18, 4-5, 651-657, https://doi.org/10.1016/S0731-7085(98)00283-0
. [all data]
Tam, An, et al., 1998
Tam, N.T.; An, H.L.; Muselli, a.; Bighelli, A.; Casanova, J.,
Essential oil of an unidentified Illicium species from Ninh Binh Province, Vietnam,
Flavour Fragr. J., 1998, 13, 6, 393-396, https://doi.org/10.1002/(SICI)1099-1026(199811/12)13:6<393::AID-FFJ764>3.0.CO;2-R
. [all data]
Analytical Methods Committee, 1997
Analytical Methods Committee, The Royal Society of Chemistry,
Application of gas-liquid chromatography to the analysis of essential oils. Part XVII. Fingerprinting of essential oils by temperature-programmed gas-liquid chromatography using capillary columns with non-polar stationary phases,
Analyst, 1997, 122, 10, 1167-1174, https://doi.org/10.1039/a704651k
. [all data]
Mariotti, Costa, et al., 1997
Mariotti, J.P.; Costa, J.; Bianchini, A.; Bernardini, A.F.; Casanova, J.,
Composition and variability of the essential oil of Stachys glutinosa L. from Corsica (France),
Flavour Fragr. J., 1997, 12, 3, 205-209, https://doi.org/10.1002/(SICI)1099-1026(199705)12:3<205::AID-FFJ636>3.0.CO;2-I
. [all data]
Perry, van Klink, et al., 1997
Perry, N.B.; van Klink, J.W.; Brennan, N.J.; Harris, W.; Anderson, R.E.; Douglas, M.H.; Smallfield, B.M.,
Essential oils from New Zealand manuka and kanuka: chemotaxonomy of Kunzea,
Phytochemistry, 1997, 45, 8, 1605-1612, https://doi.org/10.1016/S0031-9422(97)00203-3
. [all data]
Tzakou, Roussis, et al., 1997
Tzakou, O.; Roussis, V.; Loukis, A.; Harvala, C.; Galati, E.M.; Germanò, M.P.,
Essential oil analysis of Teucrium divaricatum Heldr. ssp. divaricatum growing in Greece,
Flavour Fragr. J., 1997, 12, 2, 113-115, https://doi.org/10.1002/(SICI)1099-1026(199703)12:2<113::AID-FFJ633>3.0.CO;2-3
. [all data]
Helmig, Pollock, et al., 1996
Helmig, D.; Pollock, W.; Greenberg, J.; Zimmerman, P.,
Gas chromatography mass spectrometry analysis of volatile organic trace gases at Mauna Loa Observatory, Hawaii,
J. Geophys. Res., 1996, 101, D9, 14697-14710, https://doi.org/10.1029/96JD00212
. [all data]
Stashenko, Prada, et al., 1996
Stashenko, E.E.; Prada, N.Q.; Martínez, J.R.,
HRGC/FID/NP and HRGC/MSD study of Colombian Ylang-Ylang (Cananga odorata) oils obtained by different extraction techniques,
J. Hi. Res. Chromatogr., 1996, 19, 6, 353-358, https://doi.org/10.1002/jhrc.1240190609
. [all data]
Píry, Príbela, et al., 1995
Píry, J.; Príbela, A.; Durcanská, J.; Farkas, P.,
Fractionation of volatiles from blackcurrant (Ribes nigrum L.) by different extractive methods,
Food Chem., 1995, 54, 1, 73-77, https://doi.org/10.1016/0308-8146(95)92665-7
. [all data]
Ahmad, Sirat, et al., 1994
Ahmad, U.K.; Sirat, H.M.; Sanagi, M.M.; Smith, R.M.,
Supercritical fluid extraction and capillary gas chromatography of the rhizomes of Z. zerumbet,
J. Microcolumn Sep., 1994, 6, 1, 27-32, https://doi.org/10.1002/mcs.1220060107
. [all data]
Combariza, Tirado, et al., 1994
Combariza, M.Y.; Tirado, C.B.; Stashenko, E.; Shibamoto, T.,
Limonene concentration in lemon (Citrus volkameriana) peel oil as a function of ripeness,
J. Hi. Res. Chromatogr., 1994, 17, 9, 643-646, https://doi.org/10.1002/jhrc.1240170905
. [all data]
Farkas, Le Quere, et al., 1994
Farkas, P.; Le Quere, J.M.; Maarse, H.; Kovac, M.,
The standard GC retention index library of flavour compounds
in Trends in flavour research. Proceedings of the 7th Weurman Flavour Research Symposium, Maarse,H.; van der Heij,D.G., ed(s)., Weurman Flavour Research Symposium, Noordwijkerhout, Netherlands, 1994, 145-149. [all data]
Chung, Eiserich, et al., 1993
Chung, T.Y.; Eiserich, J.P.; Shibamoto, T.,
Volatile compounds isolated from edible Korean chamchwi (Aster scaber Thunb),
J. Agric. Food Chem., 1993, 41, 10, 1693-1697, https://doi.org/10.1021/jf00034a033
. [all data]
Yang, Sugisawa, et al., 1992
Yang, R.; Sugisawa, H.; Nakatani, H.; Tamura, H.; Takagi, N.,
Comparison of odor quality in peel oils of acid citrus,
Nippon Shokuhin Kogyo Gakkaishi, 1992, 39, 1, 16-24, https://doi.org/10.3136/nskkk1962.39.16
. [all data]
Le Quere and Latrasse, 1990
Le Quere, J.-L.; Latrasse, A.,
Composition of the Essential Oils of Blackcurrant Buds (Ribes nigrum L.),
J. Agric. Food Chem., 1990, 38, 1, 3-10, https://doi.org/10.1021/jf00091a001
. [all data]
Tang, Zhang, et al., 1990
Tang, J.; Zhang, Y.; Hartman, T.G.; Rosen, R.T.; Ho, C.-T.,
Free and glycosidically bound volatile compounds in fresh celery (Apium graveolens L.),
J. Agric. Food Chem., 1990, 38, 10, 1937-1940, https://doi.org/10.1021/jf00100a013
. [all data]
Pieribattesti, Smadja, et al., 1988
Pieribattesti, J.C.; Smadja, J.; Mondon, J.M.,
Composition of the essential oil of cardamom (Elettaria cardamomum maton)
in Flavors and Fragrances: A World Perspective. Proceedings of the 10th International Congress of Essential Oils, Fragrances and Flavors, Lawrence,B.M.; Mookherjee,B.D.; Willis,B.J., ed(s)., Elsevier, New York, 1988, 697-706. [all data]
Montanarella, Bos, et al., 1986
Montanarella, L.; Bos, R.; Fischer, F.C.,
The Essential Oil in Lamina and Petiole of Heracleum dissectum Leaves,
Planta Medica, 1986, 52, 04, 332-334, https://doi.org/10.1055/s-2007-969171
. [all data]
De Pooter, Omar, et al., 1985
De Pooter, H.L.; Omar, M.N.; Coolsaet, B.A.; Schamp, N.M.,
The Essential Oil of Greater Galanga (Alpinia Galanga) from Malaysia,
Phytochemistry, 1985, 24, 1, 93-96, https://doi.org/10.1016/S0031-9422(00)80814-6
. [all data]
Bruni, Bianchi, et al., 2007
Bruni, R.; Bianchi, A.; Bellardi, M.G.,
Essential oil composition of Agastache anethiodora Britton (Lamiaceae) infected by cucumber mosaic virus (CMV),
Flavour Fragr. J., 2007, 22, 1, 66-70, https://doi.org/10.1002/ffj.1760
. [all data]
Dharmawan, Kasapis, et al., 2007
Dharmawan, J.; Kasapis, S.; Curran, P.; Johnson, J.R.,
Characterization of volatile compounds in selected citrus fruits from Asia. Part I: freshly-squeezed juice,
Flavour Fragr. J., 2007, 22, 3, 228-232, https://doi.org/10.1002/ffj.1790
. [all data]
Pérez, Navarro, et al., 2007
Pérez, R.A.; Navarro, T.; de Lorenzo, C.,
HS-SPME analysis of the volatile compounds from spices as a source of flavour in 'Campo Real' table olive preparations,
Flavour Fragr. J., 2007, 22, 4, 265-273, https://doi.org/10.1002/ffj.1791
. [all data]
Cardeal, da Silva, et al., 2006
Cardeal, Z.L.; da Silva, M.D.R.G.; Marriott, P.J.,
Comprehensive two-dimensional gas chromatography/mass spectrometric analysis of pepper volatiles,
Rapid Commun. Mass Spectrom., 2006, 20, 19, 2823-2836, https://doi.org/10.1002/rcm.2665
. [all data]
Guerrini, Sacchetti, et al., 2006
Guerrini, A.; Sacchetti, G.; Muzzoli, M.; Rueda, G.M.; Medici, A.; Besco, E.; Bruni, R.,
Composition of the Volatile Fraction of Ocotea bofo Kunth (Lauraceae) Calyces by GC-MS and NMR Fingerprinting and Its Antimicrobial and Antioxidant Activity,
J. Agric. Food Chem., 2006, 54, 20, 7778-7788, https://doi.org/10.1021/jf0605493
. [all data]
Moon, Cliff, et al., 2006
Moon, S.-Y.; Cliff, M.A.; Li-Chan, E.C.Y.,
Odour-active components of simulated beef flavour analysed by solid phase microextraction and gas chromatography-mass spectrometry and -olfactometry,
Food Res. Int., 2006, 39, 3, 294-308, https://doi.org/10.1016/j.foodres.2005.08.002
. [all data]
Özel, Gögüs, et al., 2006
Özel, M.Z.; Gögüs, F.; Lewis, A.C.,
Determination of Teucrium chamaedrys volatiles by using direct thermal desorption-comprehensive two-dimensional gas chromatography-time-of-flight mass spectrometry,
J. Chromatogr. A, 2006, 1114, 1, 164-169, https://doi.org/10.1016/j.chroma.2006.02.036
. [all data]
Sacchetti, Guerrini, et al., 2006
Sacchetti, G.; Guerrini, A.; Noriega, P.; Bianchi, A.; Bruni, R.,
Essential oil of wild Ocotea quixos (Lam.) Kosterm. (Lauraceae) leaves from Amazonian Ecuador,
Flavour Fragr. J., 2006, 21, 4, 674-676, https://doi.org/10.1002/ffj.1648
. [all data]
Selli, Rannou, et al., 2006
Selli, S.; Rannou, C.; Prost, C.; Robin, J.; Serot, T.,
Characterization of Aroma-Active Compounds in Rainbow Trout (Oncorhynchus mykiss) Eliciting an Off-Odor,
J. Agric. Food Chem., 2006, 54, 25, 9496-9502, https://doi.org/10.1021/jf0619582
. [all data]
Akpulat, Tepe, et al., 2005
Akpulat, H.A.; Tepe, B.; Sokmen, A.; Daferera, D.; Polissiou, M.,
Composition of the essential oils of Tanacetum argyrophyllum (C. Koch) Tvzel. var. argyrophyllum and Tanacetum parthenium (L.) Schultz Bip. (Asteraceae) from Turkey,
Biochem. Syst. Ecol., 2005, 33, 5, 511-516, https://doi.org/10.1016/j.bse.2004.10.006
. [all data]
Bruni, Pellati, et al., 2005
Bruni, R.; Pellati, F.; Grazia Bellardi, M.; Benvenuti, S.; Paltrinieri, S.; Bertaccini, A.; Bianchi, A.,
Herbal drug quality and phytochemical composition of Hypericum perforatum L. affected by ash yellows phytoplasma infection,
J. Agric. Food Chem., 2005, 53, 4, 964-968, https://doi.org/10.1021/jf0487654
. [all data]
Lorenzo, Paz, et al., 2005
Lorenzo, D.; Paz, D.; Davies, P.; Villamil, J.; Vila, R.; Canigueral, S.; Dellacassa, E.,
Application of Multidimensional Gas Chromatography to the Enantioselective Characterisation of the Essential Oil of Eupatorium buniifolium Hooker et Arnott,
Phytochem. Anal., 2005, 16, 1, 39-44, https://doi.org/10.1002/pca.808
. [all data]
Oliveira, Campos, et al., 2005
Oliveira, M.J.; Campos, I.F.P.; Oliveira, C.B.A.; Santos, M.R.; Souza, P.S.; Santos, S.C.; Seraphin, J.C.; Ferri, P.H.,
Influence of growth phase on the essential oil composition of Hyptis suaveolens,
Biochem. Syst. Ecol., 2005, 33, 3, 275-285, https://doi.org/10.1016/j.bse.2004.10.001
. [all data]
Sacchetti, Maietti, et al., 2005
Sacchetti, G.; Maietti, S.; Muzzoli, M.; Scaglianti, M.; Manfredini, S.; Radice, M.; Bruni, R.,
Comparative evaluation of 11 essential oils of different origin as functional antioxidants, antiradicals and antimicrobials in foods,
Food Chem., 2005, 91, 4, 621-632, https://doi.org/10.1016/j.foodchem.2004.06.031
. [all data]
Wang, Finn, et al., 2005
Wang, Y.; Finn, C.; Qian, M.C.,
Impact of Growing Environment on Chickasaw Blackberry ( Rubus L.) Aroma Evaluated by Gas Chromatography Olfactometry Dilution Analysis,
J. Agric. Food Chem., 2005, 53, 9, 3563-3571, https://doi.org/10.1021/jf048102m
. [all data]
Zheng, Kim, et al., 2005
Zheng, C.H.; Kim, K.H.; Kim, T.H.; Lee, H.J.,
Analysis and characterization of aroma-active compounds of Schizandra chinensis (omija) leaves,
J. Sci. Food Agric., 2005, 85, 1, 161-166, https://doi.org/10.1002/jsfa.1975
. [all data]
Díaz-Maroto, Sánchez Palomo, et al., 2004
Díaz-Maroto, M.C.; Sánchez Palomo, E.; Castro, L.; González Viñas, M.A.; Pérez-Coello, M.S.,
Changes produced in the aroma compounds and structural integrity of basil (Ocimum basilicum L) during drying,
J. Sci. Food Agric., 2004, 84, 15, 2070-2076, https://doi.org/10.1002/jsfa.1921
. [all data]
Frizzo, Lorenzo, et al., 2004
Frizzo, C.D.; Lorenzo, D.; Dellacassa, E.,
Composition and seasonal variation of the essential oils from two mandarin cultivars of Southern Brazil,
J. Agric. Food Chem., 2004, 52, 10, 3036-3041, https://doi.org/10.1021/jf030685x
. [all data]
Klesk, Qian, et al., 2004
Klesk, K.; Qian, M.; Martin, R.R.,
Aroma extract dilution analysis of cv. meeker (Rubus idaeus L.) red raspberries from Oregon and Washington,
J. Agric. Food Chem., 2004, 52, 16, 5155-5161, https://doi.org/10.1021/jf0498721
. [all data]
Lorenzo, Paz, et al., 2004
Lorenzo, D.; Paz, D.; Davies, P.; Villamil, J.; Vila, R.; Cañigueral, S.; Dellacassa, E.,
Characterization and enantiomeric distribution of some terpenes in the essential oil of a Uruguayan biotype of Salvia sclarea L.,
Flavour Fragr. J., 2004, 19, 4, 303-307, https://doi.org/10.1002/ffj.1282
. [all data]
Sacchetti, Medici, et al., 2004
Sacchetti, G.; Medici, A.; Maietti, S.; Radice, M.; Muzzoli, M.; Manfredini, S.; Braccioli, E.; Bruni, R.,
Composition and functional properties of the essential oil of Amazonian basil, Ocimum micranthum Willd., Labiatae in comparison with commercial essential oils,
J. Agric. Food Chem., 2004, 52, 11, 3486-3491, https://doi.org/10.1021/jf035145e
. [all data]
Sanz, Soria, et al., 2004
Sanz, J.; Soria, A.C.; García-Vallejo, M.C.,
Analysis of volatile components of Lavandula luisieri L. by direct thermal desorption-gas chromatography-mass spectrometry,
J. Chromatogr. A, 2004, 1024, 1-2, 139-146, https://doi.org/10.1016/j.chroma.2003.10.024
. [all data]
Kim, Lee, et al., 2003
Kim, T.H.; Lee, S.M.; Kim, Y.-S.; Kim, K.H.; Oh, S.; Lee, H.J.,
Aroma dilution method using GC injector split ratio for volatile compounds extracted by headspace solid phase microextraction,
Food Chem., 2003, 83, 1, 151-158, https://doi.org/10.1016/S0308-8146(03)00221-8
. [all data]
Klesk and Qian, 2003
Klesk, K.; Qian, M.,
Preliminary aroma comparison of Marion (Rubus spp. hyb) and Evergreen (R. laciniatus L.) blackberries by dynamic headspace/OSME technique,
J. Food Sci., 2003, 68, 2, 697-700, https://doi.org/10.1111/j.1365-2621.2003.tb05734.x
. [all data]
Lorenzo, Loayza, et al., 2003
Lorenzo, D.; Loayza, I.; Dellacassa, E.,
Composition of the essential oils from leaves of two Hedyosmum spp. from Bolivia,
Flavour Fragr. J., 2003, 18, 1, 32-35, https://doi.org/10.1002/ffj.1146
. [all data]
Mockute and Judzentiene, 2003
Mockute, D.; Judzentiene, A.,
Variability of the essential oils composition of Achillea millefolium ssp. millefolium growing wild in Lithuania,
Biochem. Syst. Ecol., 2003, 31, 9, 1033-1045, https://doi.org/10.1016/S0305-1978(03)00066-8
. [all data]
Azevedo, Campos, et al., 2002
Azevedo, N.R.; Campos, I.F.P.; Ferreira, H.D.; Portes, T.A.; Seraphin, J.C.; de Paula, J.R.; Santos, S.C.; Ferri, P.H.,
Essential oil chemotypes in Hyptis suaveolens from Brazilian Cerrado,
Biochem. Syst. Ecol., 2002, 30, 3, 205-216, https://doi.org/10.1016/S0305-1978(01)00075-8
. [all data]
García, Alvarez, et al., 2002
García, D.; Alvarez, A.; Tornos, P.; Fernandez, A.; Sáenz, T.,
Gas chromatographic-mass spectrometry study of the essential oils of Pimenta racemosa var. terebinthina and P. racemosa var. grisea,
Z. Naturforsch., 2002, 57c, 449-451. [all data]
Lorenzo, Loayza, et al., 2002
Lorenzo, D.; Loayza, I.; Dellacassa, E.,
Composition of the essential oil of Tagetes maxima Kuntze from Bolivia,
Flavour Fragr. J., 2002, 17, 2, 115-118, https://doi.org/10.1002/ffj.1062
. [all data]
Lorenzo, Paz, et al., 2002
Lorenzo, D.; Paz, D.; Dellacassa, E.; Davies, P.; Vila, R.; Cañigueral, S.,
Essential oils of Mentha pulegium and Mentha rotundifolia from Uruguay,
Braz. Arch. Biol. Technol., 2002, 45, 4, 519-524, https://doi.org/10.1590/S1516-89132002000600016
. [all data]
Oruna-Concha, Bakker, et al., 2002
Oruna-Concha, M.J.; Bakker, J.; Ames, J.M.,
Comparison of the volatile components of two cultivars of potato cooked by boiling, conventional baking and microwave baking,
J. Sci. Food Agric., 2002, 82, 9, 1080-1087, https://doi.org/10.1002/jsfa.1148
. [all data]
Cavalli, Ranarivelo, et al., 2001
Cavalli, J.-F.; Ranarivelo, L.; Ratsimbason, M.; Bernardini, A.-F.; Casanova, J.,
Constituents of the essential oil of six Helichrysum species from Madagascar,
Flavour Fragr. J., 2001, 16, 4, 253-256, https://doi.org/10.1002/ffj.994
. [all data]
Duckham, Dodson, et al., 2001
Duckham, S.C.; Dodson, A.T.; Bakker, J.; Ames, J.M.,
Volatile flavour components of baked potato flesh. A comparison of eleven potato cultivars,
Nahrung/Food, 2001, 45, 5, 317-323, https://doi.org/10.1002/1521-3803(20011001)45:5<317::AID-FOOD317>3.0.CO;2-4
. [all data]
Lorenzo, Dellacassa, et al., 2001
Lorenzo, D.; Dellacassa, E.; Bonaccorsi, I.; Mondello, L.,
Uruguayan essential oils. Composition of leaf oil of Myrcianthes cisplatensis (Camb.) Berg. ('Guayabo colorado') (Myrtaceae),
Flavour Fragr. J., 2001, 16, 2, 97-99, https://doi.org/10.1002/1099-1026(200103/04)16:2<97::AID-FFJ952>3.0.CO;2-C
. [all data]
Lorenzo, Paz, et al., 2001
Lorenzo, D.; Paz, D.; Davies, P.; Vila, R.; Canigueral, S.; Dellacassa, E.,
Composition of a new essential oil type of Lippia alba (Mill.) N.E. Brown from Uruguay,
Flavour Fragr. J., 2001, 16, 5, 356-359, https://doi.org/10.1002/ffj.1011
. [all data]
Lorenzo, Saavedra, et al., 2001
Lorenzo, D.; Saavedra, G.; Loayza, I.; Dellacassa, E.,
Composition of the essential oil of Erechtites hieracifolia from Bolivia,
Flavour Fragr. J., 2001, 16, 5, 353-355, https://doi.org/10.1002/ffj.1010
. [all data]
Eri, Khoo, et al., 2000
Eri, S.; Khoo, B.K.; Lech, J.; Hartman, T.G.,
Direct thermal desorption-gas chromatography and gas chromatography-mass spectrometry profiling of hop (Humulus lupulus L.) essential oils in support of varietal characterization,
J. Agric. Food Chem., 2000, 48, 4, 1140-1149, https://doi.org/10.1021/jf9911850
. [all data]
Filippini, Tomi, et al., 2000
Filippini, M.-H.; Tomi, F.; Casanova, J.,
Composition of the leaf oil of Ferula arrigonii Bocchieri,
Flavour Fragr. J., 2000, 15, 3, 195-198, https://doi.org/10.1002/1099-1026(200005/06)15:3<195::AID-FFJ891>3.0.CO;2-6
. [all data]
Parker, Hassell, et al., 2000
Parker, J.K.; Hassell, G.M.E.; Mottram, D.S.; Guy, R.C.E.,
Sensory and instrumental analyses of volatiles generated during the extrusion cooking of oat flours,
J. Agric. Food Chem., 2000, 48, 8, 3497-3506, https://doi.org/10.1021/jf991302r
. [all data]
Hassoun, Pilling, et al., 1999
Hassoun, S.; Pilling, M.J.; Bartle, K.D.,
A catalogue of urban hydrocarbons for the city of Leeds: atmospheric monitoring of volatile organic compounds by thermal desorption-gas chromatography,
J. Environ. Monitor., 1999, 1, 5, 453-458, https://doi.org/10.1039/a904879k
. [all data]
Jagella and Grosch, 1999
Jagella, T.; Grosch, W.,
Flavour and off-flavour compounds of black and white pepper ( Piper nigrum L.) I. Evaluation of potent odorants of black pepper by dilution and concentration techniques,
Eur. Food Res. Technol., 1999, 209, 1, 16-21, https://doi.org/10.1007/s002170050449
. [all data]
Loayza, de Groot, et al., 1999
Loayza, I.; de Groot, W.; Lorenzo, D.; Dellacassa, E.; Mondello, L.; Dugo, G.,
Composition of the essential oil of Porophyllum ruderale (Jacq.) Cass. from Bolivia,
Flavour Fragr. J., 1999, 14, 6, 393-398, https://doi.org/10.1002/(SICI)1099-1026(199911/12)14:6<393::AID-FFJ849>3.0.CO;2-5
. [all data]
Tairu, Hofmann, et al., 1999
Tairu, A.O.; Hofmann, T.; Schieberle, P.,
Characterization of the key aroma compounds in dried fruits of the West African peppertree Xylopia aethiopica (Dunal) A. Rich (Annonaceae) using aroma extract dilution analysis,
J. Agric. Food Chem., 1999, 47, 8, 3285-3287, https://doi.org/10.1021/jf990228+
. [all data]
Tairu, Hofmann, et al., 1999, 2
Tairu, A.O.; Hofmann, T.; Schieberle, P.,
Identification of the key aroma compounds in dried fruits of Xylopia aethiopica
in Perspectives on new crops and new users, Janick, J., ed(s)., ASHS Press, Alexandria, VA, USA, 1999, 474-478. [all data]
Mattinen, Tuominen, et al., 1995
Mattinen, M.-L.; Tuominen, J.; Saarela, K.,
Analysis of TVOC and certain selected compounds from indoor air using GC/FID-RIM technique,
Indoor Air, 1995, 5, 1, 56-61, https://doi.org/10.1111/j.1600-0668.1995.t01-1-00009.x
. [all data]
Mondello, Dugo, et al., 1995
Mondello, L.; Dugo, P.; Basile, A.; Dugo, G.,
Interactive use of linear retention indices, on polar and apolar columns, with a MS-library for reliable identification of complex mixtures,
J. Microcolumn Sep., 1995, 7, 6, 581-591, https://doi.org/10.1002/mcs.1220070605
. [all data]
Lozano P.R., Miracle E.R., et al., 2007
Lozano P.R.; Miracle E.R.; Krause A.J.; Drake M.; Cadwallader K.R.,
Effect of cold storage and packaging material on the major aroma components of sweet cream butter,
J. Agric. Food Chem., 2007, 55, 19, 7840-7846, https://doi.org/10.1021/jf071075q
. [all data]
Maric, Jukic, et al., 2007
Maric, S.; Jukic, M.; Katalinic, V.; Milos, M.,
Comparison of chemical composition and free radical scavenging ability of glycosidically bound and free volatiles from Bosnian pine (Pinus heldreichii Christ. var. leucodermis),
Molecules, 2007, 12, 3, 283-289, https://doi.org/10.3390/12030283
. [all data]
Arena, Guarrera, et al., 2006
Arena, E.; Guarrera, N.; Campisi, S.; Nicolosi Asmundo, C.,
Comparison of odour active compounds detected by gas-chromatography-olfactometry between hand-squeezed juices from different orange varieties,
Food Chem., 2006, 98, 1, 59-63, https://doi.org/10.1016/j.foodchem.2005.04.035
. [all data]
Cho, Choi, et al., 2006
Cho, I.H.; Choi, H.-K.; Kim, Y.-S.,
Difference in the volatile composition of pine-mushrooms (Tricholoma matsutake Sing.) according to their grades,
J. Agric. Food Chem., 2006, 54, 13, 4820-4825, https://doi.org/10.1021/jf0601416
. [all data]
Osorio, Alarcon, et al., 2006
Osorio, C.; Alarcon, M.; Moreno, C.; Bonilla, A.; Barrios, J.; Garzon, C.; Duque, C.,
Characterization of Odor-Active Volatiles in Champa ( Campomanesia lineatifolia R. P.),
J. Agric. Food Chem., 2006, 54, 2, 509-516, https://doi.org/10.1021/jf052098c
. [all data]
Pala-Paul, Copeland, et al., 2006
Pala-Paul, J.; Copeland, L.M.; Brophy, J.J.; Goldsack, R.J.,
Essential oil composition of two variants of Prostanthera lasianthos Labill. from Australia,
Biochem. Syst. Ecol., 2006, 34, 1, 48-55, https://doi.org/10.1016/j.bse.2005.04.003
. [all data]
Skocibusic, Bezic, et al., 2006
Skocibusic, M.; Bezic, N.; Dunkic, V.,
Phytochemical composition and antimicrobial activities of the essential oils from Satureja subspicata Vis. growing in Croatia,
Food Chem., 2006, 96, 1, 20-28, https://doi.org/10.1016/j.foodchem.2005.01.051
. [all data]
Varming, Andersen, et al., 2006
Varming, C.; Andersen, M.L.; Poll, L.,
Volatile Monoterpenes in Black Currant (Ribes nigrum L.) Juice: Effects of Heating and Enzymatic Treatment by β-Glucosidase,
J. Agric. Food Chem., 2006, 54, 6, 2298-2302, https://doi.org/10.1021/jf051938k
. [all data]
Alasalvar, Taylor, et al., 2005
Alasalvar, C.; Taylor, K.D.A.; Shahidi, F.,
Comparison of volatiles of cultured and wild sea bream (Sparus aurata) during storage in ice by dynamic headspace analysis/gas chromatography-mass spectrometry,
J. Agric. Food Chem., 2005, 53, 7, 2616-2622, https://doi.org/10.1021/jf0483826
. [all data]
Berlinet, Ducruet, et al., 2005
Berlinet, C.; Ducruet, V.; Brillouet, J.-M.; Reynes, M.; Brat, P.,
Evolution of aroma compounds from orange juice stored in polyethylene terephthalate (PET),
Food Addit. Contam., 2005, 22, 2, 185-195, https://doi.org/10.1080/02652030500037860
. [all data]
Elmore, Nisyrios, et al., 2005
Elmore, J.S.; Nisyrios, I.; Mottram, D.S.,
Analysis of the headspace aroma compounds of walnuts (Juglans regia L.),
Flavour Fragr. J., 2005, 20, 5, 501-506, https://doi.org/10.1002/ffj.1477
. [all data]
Lee, Lee, et al., 2005
Lee, J.-G.; Lee, C.-G.; Kwag, J.-J.; Buglass, A.J.; Lee, G.-H.,
Determination of optimum conditions for the analysis of volatile components in pine needles by double-shot pyrolysis-gas chromatography-mass spectrometry,
J. Chromatogr. A, 2005, 1089, 1-2, 227-234, https://doi.org/10.1016/j.chroma.2005.06.060
. [all data]
Njoroge, Koaze, et al., 2005
Njoroge, S.M.; Koaze, H.; Karanja, P.N.; Sawamura, M.,
Volatile Constituents of Redblush Grapefruit ( Citrus paradisi) and Pummelo ( Citrus grandis) Peel Essential Oils from Kenya,
J. Agric. Food Chem., 2005, 53, 25, 9790-9794, https://doi.org/10.1021/jf051373s
. [all data]
Brophy, Goldsack, et al., 2004
Brophy, J.J.; Goldsack, R.J.; O'Sullivan, W.,
Chemistry of the Australian gymnosperms. Part VII. The leaf oils of the genus Actinostrobus,
Biochem. Syst. Ecol., 2004, 32, 10, 867-873, https://doi.org/10.1016/j.bse.2004.05.001
. [all data]
Rega, Fournier, et al., 2004
Rega, B.; Fournier, N.; Nicklaus, S.; Guichard, E.,
Role of pulp in flavor release and sensory perception in orange juice,
J. Agric. Food Chem., 2004, 52, 13, 4204-4212, https://doi.org/10.1021/jf035361n
. [all data]
Skocibusic and Bezic, 2004
Skocibusic, M.; Bezic, N.,
Phytochemical Analysis and In vitro Antimicrobial Activity of Two Satureja Species Essential Oils,
Phytother. Res., 2004, 18, 12, 967-970, https://doi.org/10.1002/ptr.1489
. [all data]
Bassole, Ouattara, et al., 2003
Bassole, I.H.N.; Ouattara, A.S.; Nebie, R.; Ouattara, C.A.T.; Kabore, Z.I.; Traore, S.A.,
Chemical composition and antibacterial activities of the essential oils of Lippia chevalieri and Lippia multiflora from Burkina Faso,
Phytochemistry, 2003, 62, 2, 209-212, https://doi.org/10.1016/S0031-9422(02)00477-6
. [all data]
Bezic, Skocibusic, et al., 2003
Bezic, N.; Skocibusic, M.; Dunkic, V.; Radonic, A.,
Composition and antimicrobial activity of Achillea clavennae L. essential oil,
Phytother. Res., 2003, 17, 9, 1037-1040, https://doi.org/10.1002/ptr.1290
. [all data]
Jerkovic, Mastelic, et al., 2003
Jerkovic, I.; Mastelic, J.; Milos, M.; Juteau, F.; Masotti, V.; Viano, J.,
Chemical variability of Artemisia vulgaris L. essential oils originated from the Mediterranean area of France and Croatia,
Flavour Fragr. J., 2003, 18, 5, 436-440, https://doi.org/10.1002/ffj.1246
. [all data]
Kjeldsen, Christensen, et al., 2003
Kjeldsen, F.; Christensen, L.P.; Edelenbos, M.,
Changes in volatile compounds of carrots (Daucus carota L.) during refrigerated and frozen storage,
J. Agric. Food Chem., 2003, 51, 18, 5400-5407, https://doi.org/10.1021/jf030212q
. [all data]
Radonic and Milso, 2003
Radonic, A.; Milso, M.,
Chemical Composition and In Vitro Evaluation of Antioxidant Effect of Free Volatile Compounds From Satureja montana L.,
Free Radical Research, 2003, 37, 6, 673-679, https://doi.org/10.1080/1071576031000105643
. [all data]
Rega, Fournier, et al., 2003
Rega, B.; Fournier, N.; Guichard, E.,
Solid phase microextraction (SPME) of orange juice flavor: odor representativeness by direct gas chromatography olfactometry (D-GC-O),
J. Agric. Food Chem., 2003, 51, 24, 7092-7099, https://doi.org/10.1021/jf034384z
. [all data]
Skocibusic and Bezic, 2003
Skocibusic, M.; Bezic, N.,
Chemical composition and antidiarrhoeal activities of winter savory (Satureja montana L.) essential oil,
Pharm. Biol., 2003, 41, 8, 622-626, https://doi.org/10.1080/13880200390502180
. [all data]
Choi, Kim. M.-S.L., et al., 2002
Choi, H.-S.; Kim. M.-S.L.; Sawamura, M.,
Constituents of the essential oil of cnidium officinale Makino, a Korean medicinal plant,
Flavour Fragr. J., 2002, 17, 1, 49-53, https://doi.org/10.1002/ffj.1038
. [all data]
Chung, Yung, et al., 2002
Chung, H.-Y.; Yung, I.K.S.; Ma, W.C.J.; Kim, J.-S.,
Analysis of volatile components in frozen and dried scallops (Patinopecten yessoensis) by gas chromatography/mass spectrometry,
Food Res. Int., 2002, 35, 1, 43-53, https://doi.org/10.1016/S0963-9969(01)00107-7
. [all data]
Chung, Yung, et al., 2001
Chung, H.Y.; Yung, I.K.S.; Kim, J.-S.,
Comparison of volatile components in dried scallops (Chlamys farreri and Patinopecten yessoensis) prepared by boiling and steaming methods,
J. Agric. Food Chem., 2001, 49, 1, 192-202, https://doi.org/10.1021/jf000692a
. [all data]
Kjeldsen, Christensen, et al., 2001
Kjeldsen, F.; Christensen, L.P.; Edelenbos, M.,
Quantitative analysis of aroma compounds in carrot (Daucus carota L.) cultivars by capillary gas chromatography using large-volume injection technique,
J. Agric. Food Chem., 2001, 49, 9, 4342-4348, https://doi.org/10.1021/jf010213n
. [all data]
Milos, Radonic, et al., 2001
Milos, M.; Radonic, A.; Bezic, N.; Dunkic, V.,
Localities and seasonal variations in the chemical composition of essential oils of Satureja montana L. and S. cuneifolia Ten,
Flavour Fragr. J., 2001, 16, 3, 157-160, https://doi.org/10.1002/ffj.965
. [all data]
Brophy, Goldsack, et al., 2000
Brophy, J.J.; Goldsack, R.J.; Forster, P.I.,
Essential oils of the genus Lophostemon (Myrtaceae),
Flavour Fragr. J., 2000, 15, 1, 17-20, https://doi.org/10.1002/(SICI)1099-1026(200001/02)15:1<17::AID-FFJ859>3.0.CO;2-D
. [all data]
Brophy, Goldsack, et al., 2000, 2
Brophy, J.; Goldsack, R.J.; Bean, A.R.; Forster, P.I.; Lepschi, B.J.,
Leaf essential oils of the genus Leptospermum (Myrtaceae) in eastern Australia. Part 6. Leptospermum polygalifolium and allies,
Flavour Fragr. J., 2000, 15, 4, 271-277, https://doi.org/10.1002/1099-1026(200007/08)15:4<271::AID-FFJ910>3.0.CO;2-E
. [all data]
Brophy, Goldsack, et al., 2000, 3
Brophy, J.J.; Goldsack, R.J.; Punruckvong, A.; Bean, A.R.; Forster, P.I.; Lepschi, B.J.; Doran, J.C.; Rozefelds, A.C.,
Leaf essential oils of the genus Leptospermum (Myrtaceae) in eastern Australia. Part 7. Leptospermum petersonii, L. liversidgei and allies,
Flavour Fragr. J., 2000, 15, 5, 342-351, https://doi.org/10.1002/1099-1026(200009/10)15:5<342::AID-FFJ924>3.0.CO;2-V
. [all data]
Chagonda, Makanda, et al., 2000
Chagonda, L.S.; Makanda, C.D.; Chalchat, J.-C.,
The essential oils of Ocimum canum Sims (basilic camphor) and Ocimum urticifolia Roth from Zimbabwe,
Flavour Fragr. J., 2000, 15, 1, 23-26, https://doi.org/10.1002/(SICI)1099-1026(200001/02)15:1<23::AID-FFJ866>3.0.CO;2-W
. [all data]
Choi and Sawamura, 2000
Choi, H.-S.; Sawamura, M.,
Composition of the essential oil of Citrus tamurana Hort. ex Tanaka (Hyuganatsu),
J. Agric. Food Chem., 2000, 48, 10, 4868-4873, https://doi.org/10.1021/jf000651e
. [all data]
Brophy, Goldsack, et al., 1999
Brophy, J.J.; Goldsack, R.J.; Bean, A.R.; Forster, P.I.; Lepschi, B.J.,
Leaf essential oils of the genus Leptospermum (Myrtaceae) in eastern Australia. Part 5. Leptospermum continentale and allies,
Flavour Fragr. J., 1999, 14, 2, 98-104, https://doi.org/10.1002/(SICI)1099-1026(199903/04)14:2<98::AID-FFJ797>3.0.CO;2-V
. [all data]
Chevance and Farmer, 1999, 2
Chevance, F.F.V.; Farmer, L.J.,
Release of volatile odor compounds from full-fat and reduced-fat frankfurters,
J. Agric. Food Chem., 1999, 47, 12, 5161-5168, https://doi.org/10.1021/jf9905166
. [all data]
Christensen, Jakobsen, et al., 1999
Christensen, L.P.; Jakobsen, H.B.; Paulsen, E.; Hodal, L.; Andersen, K.E.,
Airborne compositae dermatitis: monoterpenes and no parthenolide are released from flowering Tanacetum parthenium (feverfew) plants,
Arch. Dermatol. Res., 1999, 291, 7-8, 425-431, https://doi.org/10.1007/s004030050433
. [all data]
Brophy, Forster, et al., 1998
Brophy, J.J.; Forster, P.I.; Goldsack, R.J.,
Esssential oils of some Australian monimiaceae,
Flavour Fragr. J., 1998, 13, 4, 273-276, https://doi.org/10.1002/(SICI)1099-1026(1998070)13:4<273::AID-FFJ745>3.0.CO;2-O
. [all data]
Brophy, Forster, et al., 1998, 2
Brophy, J.J.; Forster, P.I.; Goldsack, R.J.,
The essential oils of three unusual Eucalypts: Eucalyptus curtisii, E. rubiginosa and E. tenuipes (Myrtaceae),
Flavour Fragr. J., 1998, 13, 2, 87-89, https://doi.org/10.1002/(SICI)1099-1026(199803/04)13:2<87::AID-FFJ699>3.0.CO;2-Y
. [all data]
Brophy, Goldsack, et al., 1998
Brophy, J.J.; Goldsack, R.J.; Forster, P.I.; Bean, A.R.; Clarkson, J.R.; Lepschi, B.J.,
Leaf essential oils of the genus Leptospermum (Myrtaceae) in Eastern Australia. Part 1. Leptospermum brachyandrum and Leptospermum pallidum groups,
Flavour Fragr. J., 1998, 13, 1, 19-25, https://doi.org/10.1002/(SICI)1099-1026(199801/02)13:1<19::AID-FFJ679>3.0.CO;2-9
. [all data]
Brophy, Goldsack, et al., 1998, 2
Brophy, J.J.; Goldsack, R.J.; Bean, A.R.; Forster, P.I.; Lepschi, B.J.,
Leaf essential oils of the genus Leptospermum (Myrtaceae) in eastern Australia. Part 2. Leptospermum blakelyi and allies,
Flavour Fragr. J., 1998, 13, 5, 353-358, https://doi.org/10.1002/(SICI)1099-1026(1998090)13:5<353::AID-FFJ759>3.0.CO;2-1
. [all data]
Cha, Kim, et al., 1998
Cha, Y.J.; Kim, H.; Cadwallader, K.R.,
Aroma-active compounds in Kimchi during fermentation,
J. Agric. Food Chem., 1998, 46, 5, 1944-1953, https://doi.org/10.1021/jf9706991
. [all data]
Ollé, Baumes, et al., 1998
Ollé, D.; Baumes, R.L.; Bayonove, C.L.; Lozano, Y.F.; Sznaper, C.; Brillouet, J.-M.,
Comparison of free and glycosidically linked volatile components from polyembryonic and monoembryonic mango (Mangifera indica L.) cultivars,
J. Agric. Food Chem., 1998, 46, 3, 1094-1100, https://doi.org/10.1021/jf9705781
. [all data]
Brophy, Goldsack, et al., 1997
Brophy, J.J.; Goldsack, R.J.; Forster, P.I.,
The essential oils of the Australian species of Rhodomyrtus (Myrtaceae),
Flavour Fragr. J., 1997, 12, 2, 103-108, https://doi.org/10.1002/(SICI)1099-1026(199703)12:2<103::AID-FFJ621>3.0.CO;2-B
. [all data]
Brophy, Goldsack, et al., 1997, 2
Brophy, J.J.; Goldsack, R.J.; Forster, P.I.,
The leaf essential oils of the Australian species of Rhodamnia (Myrtaceae),
Flavour Fragr. J., 1997, 12, 5, 345-354, https://doi.org/10.1002/(SICI)1099-1026(199709/10)12:5<345::AID-FFJ658>3.0.CO;2-6
. [all data]
Möllenbeck, König, et al., 1997
Möllenbeck, S.; König, T.; Schreier, P.; Schwab, W.; Rajaonarivony, J.; Ranarivelo, L.,
Chemical composition and analyses of enantiomers of essential oils from Madagascar,
Flavour Fragr. J., 1997, 12, 2, 63-69, https://doi.org/10.1002/(SICI)1099-1026(199703)12:2<63::AID-FFJ614>3.0.CO;2-Z
. [all data]
Chyau, Mau, et al., 1996
Chyau, C.-C.; Mau, J.-L.; Wu, C.-M.,
Characteristics of the steam-distilled oil and carbon dioxide extract of Zanthoxylum simulans and fruits,
J. Agric. Food Chem., 1996, 44, 4, 1096-1099, https://doi.org/10.1021/jf950577d
. [all data]
Granicher, Christen, et al., 1995
Granicher, F.; Christen, P.; Kapetanidis, I.,
Essential oils from normal and hairy roots of valeriana officinalis var. sambucifolia,
Phytochemistry, 1995, 40, 5, 1421-1424, https://doi.org/10.1016/0031-9422(95)00492-P
. [all data]
Wu and Yang, 1994
Wu, J.-J.; Yang, J.-S.,
Effects of γ irradiation on the volatile compounds of ginger rhizome (Zingiber officinale Roscoe),
J. Agric. Food Chem., 1994, 42, 11, 2574-2577, https://doi.org/10.1021/jf00047a038
. [all data]
Shiratsuchi, Shimoda, et al., 1993
Shiratsuchi, H.; Shimoda, M.; Minegishi, Y.; Osajima, Y.,
Isolation and identification of volatile flavor compounds in nonfermented coarse-cut sausage. Flavor as a quality factor of nonfermented sausage. 1,
J. Agric. Food Chem., 1993, 41, 4, 647-652, https://doi.org/10.1021/jf00028a027
. [all data]
Kawakami, Sachs, et al., 1990
Kawakami, M.; Sachs, R.M.; Shibamoto, T.,
Volatile constituents of essential oils obtained from newly developed tea tree (Melaleuca alternifolia) clones,
J. Agric. Food Chem., 1990, 38, 8, 1657-1661, https://doi.org/10.1021/jf00098a007
. [all data]
Chen and Ho, 1988
Chen, C.-C.; Ho, C.-T.,
Gas chromatographic analysis of volatile components of ginger oil (Zingiber officinale Roscoe) extracted with liquid carbon dioxide,
J. Agric. Food Chem., 1988, 36, 2, 322-328, https://doi.org/10.1021/jf00080a020
. [all data]
Bianchi, Cantoni, et al., 2007
Bianchi, F.; Cantoni, C.; Careri, M.; Chiesa, L.; Musci, M.; Pinna, A.,
Characterization of the aromatic profile for the authentication and differentiation of typical Italian dry-sausages,
Talanta, 2007, 72, 4, 1552-1563, https://doi.org/10.1016/j.talanta.2007.02.019
. [all data]
Bianchi, Careri, et al., 2007
Bianchi, F.; Careri, M.; Mangia, A.; Musci, M.,
Retention indices in the analysis of food aroma volatile compounds in temperature-programmed gas chromatography: Database creation and evaluation of precision and robustness,
J. Sep. Sci., 2007, 39, 4, 563-572, https://doi.org/10.1002/jssc.200600393
. [all data]
Carrer, Vanderlinde, et al., 2007
Carrer, R.P.; Vanderlinde, R.; Dutra, S.; Marcon, A.; Echeverrigaray, S.,
Essential oil variation among Brazilian accessions of Salvia guaranitica L.,
Flavour Fragr. J., 2007, 22, 5, 430-434, https://doi.org/10.1002/ffj.1817
. [all data]
Elston, Lin, et al., 2005
Elston, A.; Lin, J.; Rouseff, R.,
Determination of the role of valencene in orange oil as a direct contributor to aroma quality,
Flavour Fragr. J., 2005, 20, 4, 381-386, https://doi.org/10.1002/ffj.1578
. [all data]
Alasalvar, Shahidi, et al., 2003
Alasalvar, C.; Shahidi, F.; Cadwallader, K.R.,
Comparison of natural and roasted Turkish Tombul hazelnut (Corylus avellana L.) volatiles and flavor by DHA/GC/MS and descriptive sensory analysis,
J. Agric. Food Chem., 2003, 51, 17, 5067-5072, https://doi.org/10.1021/jf0300846
. [all data]
Radovic, Careri, et al., 2001
Radovic, B.S.; Careri, M.; Mangia, A.; Musci, M.; Gerboles, M.; Anklam, E.,
Analytical, nutritional, and clinical methods section. Contribution of dynamic headspace GC-MS analysis of aroma compounds to authenticity testing of honey,
Food Chem., 2001, 72, 4, 511-520, https://doi.org/10.1016/S0308-8146(00)00263-6
. [all data]
Bisio, Ciarallo, et al., 1998
Bisio, A.; Ciarallo, G.; Romussi, G.; Fontana, N.; Mascolo, N.; Capasso, R.; Biscardi, D.,
Chemical Composition of Essential Oils from some Salvia species,
Phytother. Res., 1998, 12, S1, s117-s120, https://doi.org/10.1002/(SICI)1099-1573(1998)12:1+3.0.CO;2-2
. [all data]
Iversen, Jakobsen, et al., 1998
Iversen, C.K.; Jakobsen, H.B.; Olsen, C.-E.,
Aroma changes during black currant (Ribes nigrum L.) nectar processing,
J. Agric. Food Chem., 1998, 46, 3, 1132-1136, https://doi.org/10.1021/jf970513y
. [all data]
Cadwallader and Xu, 1994
Cadwallader, K.R.; Xu, Y.,
Analysis of volatile components in fresh grapefruit juice by purge and trap/gas chromatography,
J. Agric. Food Chem., 1994, 42, 3, 782-784, https://doi.org/10.1021/jf00039a036
. [all data]
Whitfield, Shea, et al., 1981
Whitfield, F.B.; Shea, S.R.; Gillen, K.J.; Shaw, K.J.,
Volatile components from the roots of Acacia pulchella R.Br. and their effect on Phytophthora cinnamomi rands,
Aust. J. Bot., 1981, 29, 2, 195-208, https://doi.org/10.1071/BT9810195
. [all data]
Hemmateenejad, Jawadnia, et al., 2007
Hemmateenejad, B.; Jawadnia, K.; Elyasi, M.,
Quantitative structure - retention relationship for the Kovats retention indices of a large set of terpenes: a comdined data splitting-feature selection strategy,
Anal. Chim. Acta, 2007, 592, 1, 72-81, https://doi.org/10.1016/j.aca.2007.04.009
. [all data]
Bertuzzi, Tirillini, et al., 2013
Bertuzzi, G.; Tirillini, B.; Angelini, P.; Venanzoni, R.,
Antioxidative action of Citrus limonum essential oil on scin,
Eur. J. Medicinal Plants, 2013, 3, 1, 1-9, https://doi.org/10.9734/EJMP/2013/1987
. [all data]
Bramston-Cook, 2013
Bramston-Cook, R.,
Kovats indices for C2-C13 hydrocarbons and selected oxygenated/halocarbons with 100 % dimethylpolysiloxane columns, 2013, retrieved from http://lotusinstruments.com/monographs/List .... [all data]
Sardashti, Valizadeh, et al., 2013
Sardashti, A.R.; Valizadeh, J.; Adhami, Y.,
Variations in the essential oil composition of Peroskia abrotonolides of different growth stage in Baluchestan,
Middle-East J. Sci. Res., 2013, 13, 6, 781-784. [all data]
Alizadeh and Shaabani, 2012
Alizadeh, A.; Shaabani, M.,
Essential oil composition, phenolic content, antioxidant and antimicrobial activity in Salvia officinalis L. cultivated in Iran,
Adv. Environ. Biol., 2012, 6, 1, 221-226. [all data]
Al-Qudah, Muhaidat, et al., 2012
Al-Qudah, M.A.; Muhaidat, R.; Trawenh, I.N.; Jaber, H.I.; Abu Zarga, M.H.; Abu Orabi, S.T.,
Volatile constituents of leaves and bulbs of Gynandriris Sisyrinchicum and their antimicrobial activities,
Jordan J. Chem., 2012, 7, 3, 287-295. [all data]
Bendiabdellah, El Amine Dib, et al., 2012
Bendiabdellah, A.; El Amine Dib, M.; Djabou, N.; Allali, H.; Tabti, B.; Costa, J.; Myseli, A.,
Biological activities and volatile cinstituents of Daucus muricatus L. from Algeria,
Chem. Centr. J., 2012, 6, 48, 1-22. [all data]
Boukhris, Bouaziz, et al., 2012
Boukhris, M.; Bouaziz, M.; Feki, I.; Jemai, H.; El Feki, A.; Sayadi, S.,
Hypoglycemic and antioxidant effects of leaf essential oil of Pelargonium graveolens L'Her. in alloxan induced diabetic rats,
Lipids in Health and Disease, 2012, 11, 1, 1-10, https://doi.org/10.1186/1476-511X-11-81
. [all data]
Dell'Agli, Sanna, et al., 2012
Dell'Agli, M.; Sanna, C.; Rubiolo, P.; BAsilico, N.; Colombo, E.; Scaltrito, M.M.; Ndiath, M.O.; Maccarone, L.; Taramelli, D.; Bicchi, C.; Ballero, M.; Bosisio, E.,
Anti-plasmodial and insecticidal activities of the essential oils of aromatic plants growing in the Mediterranian area,
Malaria Journal, 2012, 11, 1, 219-228, https://doi.org/10.1186/1475-2875-11-219
. [all data]
Goeminne, Vandendriessche, et al., 2012
Goeminne, P.C.; Vandendriessche, T.; Van Eldere, J.; Nicolai, B.M.; Hertog, M.L.; Dupont, L.J.,
Detection of Pseudomonas aeruginosa in sputum headspace through volatile organic compound analysis,
Respiratory Res., 2012, 13, 87, 1-9. [all data]
Jian-Yu, Zhu, et al., 2012
Jian-Yu, S.; Zhu, L.; Tian, Y.-J.,
Chemical composition and antimicrobial activities of essential oil of Matricaria songarica,
Int. J. Agriculture Biology, 2012, 14, 1, 107-110. [all data]
Priya, Prathapan, et al., 2012
Priya, R.; Prathapan, A.; Raghu, K.G.; Menon, A.N.,
Chemical composition and in vitro antioxidative potential of essential oil isolated from Curcuma longa L. leaves,
Asian Pacific Journal of Tropical Biomedicine, 2012, 2, 2, s695-s699, https://doi.org/10.1016/S2221-1691(12)60298-6
. [all data]
Silva, Suzuki, et al., 2012
Silva, P.S.; Suzuki, E.Y.; Moreira, A.P.; Raposo, N.R.B.; Alves, T.M.A.; Viccini, L.F.,
Stachytarpheta gesnerioides Cham.: chemical composition of hexane fraction and essential oil, antioxidant and antimicrobial activities,
Boletin Latinoamericano y del Caribe de Plantas Medicinales y Aromaticas, 2012, 11, 6, 542-548. [all data]
Velickovic, Ristic, et al., 2012
Velickovic, D.T.; Ristic, M.S.; Karabegovic, I.T.; Stojicevic, S.S.; Lazic, M.L.,
The influence of the distillation method on the chemical composition of the essential oil of sage (Salvia officinalis L.),
Advanced Technologies, 2012, 1, 1, 47-51. [all data]
Yapi, Boti, et al., 2012
Yapi, T.A.; Boti, J.B.; Attioua, B.K.; Ahibo, A.C.; Bighelli, A.; Casanova, J.; Tomi, F.,
Three new natural compounds from the root bark essential oil from Xylopia aethiopica,
Phytochem. Anal., 2012, 1-6. [all data]
Zouari, Ayadi, et al., 2012
Zouari, N.; Ayadi, I.; Fakhfakh, N.; Rebai, A.; Zouari, S.,
Variations of chemical composition of essential oils in wild-populations of Thymus algeriensis Boiss et Reut., a North African endemic species,
Lipids in Health and Desease, 2012, 11, 1, 28-39, https://doi.org/10.1186/1476-511X-11-28
. [all data]
Alizadeh, Khosh-Khui, et al., 2011
Alizadeh, A.; Khosh-Khui, M.; Javidnia, K.; Firuzi, O.; Jokar, S.M.,
Chemical composition of the essential oil, total phenolic content and antioxidant activity in Origanum maiorana L. (Lamiaceae) cultivated in Iran,
Adv. Environ. Biol., 2011, 5, 8, 2326-2331. [all data]
Ameen, Usman, et al., 2011
Ameen, O.M.; Usman, L.A.; Oganija, F.S.; Hamid, A.A.; Muhammed, N.O.; Zubair, M.F.; Adebayo, S.A.,
Chemical composition of leaf essential oil of Annona senegalensis Pers. (Annonaceae) growing in North Central Nigeria,
Int. J. Biol. Chem. Sci., 2011, 5, 1, 375-379. [all data]
Bertoli, Lepnardi, et al., 2011
Bertoli, A.; Lepnardi, M.; Krzyzanowska, J.; Oleszek, W.; Pistelli, L.,
Mentha longifolia in vitro cultures as safe source of flavouring ingradients,
Acta Biochem. Polonica, 2011, 58, 4, 581-587. [all data]
Cais-Sokolinska, Majcher, et al., 2011
Cais-Sokolinska, D.; Majcher, M.; Pikul, J.; Bielinska, S.; Czauderma, M.; Wojtowski, J.,
The effect of Camelia sativa cake diet supplementation on sensory and volatile profiles of ewe's milk,
African J. Biotechnol., 2011, 10, 37, 7245-7252. [all data]
Cao, Li, et al., 2011
Cao, H.; Li, Z.; Chen, X.,
QSRR study of GC retention indices of volatile compounds emitted from Mosla chinensis Maxim. by multiply linear regression,
Chin. J. Chem., 2011, 29, 10, 2187-2196, https://doi.org/10.1002/cjoc.201180379
. [all data]
Cui, Yang, et al., 2011
Cui, J.; Yang, X.; Dong, A.-J.; Cheng, D.-Y.; Wang, J.; Zhao, H.-T.; Xu, R.-B.; Wang, P.; Li, W.-J.,
Chemical composition and antioxidant activity of Wuphorbia fischeriana essential oil from China,
J. Med. Plants Res., 2011, 5, 19, 4894-4798. [all data]
Esseien, Aboaba, et al., 2011
Esseien, E.E.; Aboaba, S.O.; Ogunwande, I.A.,
Constituents and antimicrobial properties of the leaf essential oil of Gossypium barbadense (Linn.),
J. Med. Plant Res., 2011, 5, 5, 702-705. [all data]
Fathi, Sahari, et al., 2011
Fathi, A.; Sahari, M.A.; Zangiabadi, M.; Barzegar, M.,
Application od Satureja hortensis L. and Zataria multiflora Boiss. essential oils as two natural antioxidants in soybean oil during microwave heating,
J. Medicinal Plants, 2011, 10, 39, 12-21. [all data]
Feizbakhsh and Naeemy, 2011
Feizbakhsh, A.; Naeemy, A.,
Volatile constituents of essential oils of Eleocharis pauciflora (Light) Link and Eleocharis uniglumis (Link) J.A. Schultes growing wild in Iran,
Bull. Chem. Soc. Ethiop., 2011, 25, 3, 461-464, https://doi.org/10.4314/bcse.v25i3.68606
. [all data]
Hammami, Kamoun, et al., 2011
Hammami, I.; Kamoun, N.; Rebai, A.,
Biocontrol of Botrytis cinerea with essential oil and methanol extract of Viola odorata flowers,
Archives of Appl. Sci. Res., 2011, 3, 5, 44-51. [all data]
Kadri, Zarai, et al., 2011
Kadri, A.; Zarai, Z.; Chobba, I.B.; Bekir, A.; Gharsallah, N.; Damak, M.; Gdoura, R.,
Chemical constituents and antioxidant properties of Rosmarinus officinalis L. essential oil cultivated from the South-Western of Tunisia,
J. Medicimal Plant res., 2011, 5, 29, 6502-6508. [all data]
Karimi, Farmani, et al., 2011
Karimi, H.; Farmani, A.; Nourizadeh, H.,
A performance comparison of modern statistical technique for molecular descriptor selection and retention prediction of essential oil from leaves,
Amer. J. Sci. Res., 2011, 38, 36-40. [all data]
Leffingwell and Alford, 2011
Leffingwell, J.; Alford, E.D.,
Volatile constituents of the giant pufball mushroom (Calvatia gigantea),
Leffingwell Rep., 2011, 4, 1-17. [all data]
Menichini, Tundis, et al., 2011
Menichini, F.; Tundis, R.; Bonesi, M.; de Cindio, B.; Loizzo, M.R.; Conforti, F.; Statti, G.A.; Menabeni, R.; Bettini, R.; Menichini, F.,
Chemical composition and bioactivity of Citrus medica L. cv. Diamante essential oil obtained by hydrodistillation, cold-pressing and supercritical carbon dioxide extraction,
Nat. Prod. Res., 2011, 25, 8, 789-799, https://doi.org/10.1080/14786410902900085
. [all data]
Misharina T., 2011
Misharina T.,
Headspace analysis of aroma compounds using porous adsorbents,
Chemistry Chem. Technol., 2011, 5, 3, 347-354. [all data]
Mothana, Hasson, et al., 2011
Mothana, R.A.A.; Hasson, S.S.; Schultze, W.; Mowitz, A.; Lindequist, U.,
Phytochemical composition and in vitro antimicrobial and antioxidant activities of essential oils of three endemic Soqotraen Boswellia species,
Food Chem., 2011, 126, 3, 1149-1154, https://doi.org/10.1016/j.foodchem.2010.11.150
. [all data]
Nadim, Malik, et al., 2011
Nadim, M.M.; Malik, A.A.; Ahmad, J.; Bakshi, S.K.,
The essential oil composition of Achillea millefolium L. cultivated under tropical conditions in India,
World J. Agricultural Sci., 2011, 7, 5, 561-565. [all data]
Pattiram, Lasekan, et al., 2011
Pattiram, P.D.; Lasekan, O.; Tan, C.P.; Zaidul, I.S.M.,
Identification of the aroma-active constituents of the essential oils of Water Dropwort (Oenanthe javanica) and Kacip Fatimah (Labisia pumilia),
Int. Food Res. J., 2011, 18, 3, 1021-1026. [all data]
Taherpour, Maroofi, et al., 2011
Taherpour, A.; Maroofi, H.; Changizi, M.; Shoushtari, R.V.; Larijani, K.; Kazempour, A.,
Chemical compositions of the essential oil and calculation the biophysicochemical coefficients of the components of Hymenocrater longiflorus Benth. of Iran,
Natural Sci., 2011, 3, 2, 104-108, https://doi.org/10.4236/ns.2011.32015
. [all data]
Zarai, Kadri, et al., 2011
Zarai, Z.; Kadri, A.; Ben Chobba, I.; Ben Mansour, R.; Bekir, R.; Mejdoub, H.; Gharsallah, N.,
The in-vitro evaluation of antibacterial, antifungal and cytotoxic properties of Marrubium vulgare L. essential oil grown in Tunisia,
Lipids in Health and Disease, 2011, 10, 161, 1-8. [all data]
Baharum, Bunawan, et al., 2010
Baharum, S.N.; Bunawan, H.; Ghani, M.A.; Mustafa, W.A.W.; Noor, N.M.,
Analysis of the chemical composition of the essential oil of Polygonum minus Huds. using two-dimensional gas chromatography - time of flight mass spectrometry (GC-TOF-MS),
Molecules, 2010, 15, 10, 7006-7015, https://doi.org/10.3390/molecules15107006
. [all data]
Boix, Victorio, et al., 2010
Boix, V.F.; Victorio, C.P.; Lage, C.L.S.; Kuster, R.M.,
Volatile compounds from Rosmarinus officinalis L. and Baccharis dracunculifolia DC. growing in Southeast coast of Brasil,
Quim. Nova, 2010, 33, 2, 255-257, https://doi.org/10.1590/S0100-40422010000200004
. [all data]
Cavar, Maksimovic, et al., 2010
Cavar, S.; Maksimovic, M.; Solic, M.E.,
Comparison of essential oil composition of Stachys menthufolia Vis. from two natural habitas in Croatia,
Biologica Nyssana, 2010, 1, 1-2, 99-103. [all data]
Chalchat, Figueredo, et al., 2010
Chalchat, J.-C.; Figueredo, G.; Ozcan, M.M.; Unver, A.,
Effect of hydrodistillation and microwave distillation extraction methods on chemical composition of essential oil of pickling herb and myrtle plants,
South Western J. of Agriculture, 2010, 1, 2, 133-141. [all data]
Dib, Bendahou, et al., 2010
Dib, M.A.; Bendahou, M.; Bendiabdellah, A.; Djabou, N.; Allali, H.; Tabti, B.; Paolini, J.; Costa, J.,
Partial chemical composition and antimicrobial activity of Daucus crinitus Desf. extracts,
Grasas y Aceites, 2010, 61, 3, 271-278, https://doi.org/10.3989/gya.122609
. [all data]
Dib, Djabou, et al., 2010
Dib, M.ElA.; Djabou, N.; Desjobert, L.-M.; Allali, H.; Tabti, B.; Muselli, A.; Costa, J.,
Characterization of volatile compounds of Daucus crinitus Desf. headspace solid phase microextraction as alternative technique to hydrodistillation,
Chem, Centr. J., 2010, 4, 16, 1-15. [all data]
Georgiou, Koutsaviti, et al., 2010
Georgiou, C.; Koutsaviti, A.; Bazos, I.; Tzakou, O.,
Chemical composition of Echinophora tenuifolia subsp. sibthorpiana essential oil from Greece,
Rec. Nat. Prod., 2010, 4, 3, 167-170. [all data]
Hajimahdipoor, Samadi, et al., 2010
Hajimahdipoor, H.; Samadi, N.; Mozaffarian, V.; Rahimifard, N.; Shoeibi, Sh.; Pirali, H.M.,
Chemical composition and antimicrobial activity of Oliveria decumbens volatile oil from west of Iran,
J. of Medicinal Plants, 2010, 9, Suppl. # 6., 39-44. [all data]
Ho, Wang, et al., 2010
Ho, C.-L.; Wang, E.I.-C.; Yu, H.-T.; Yu, H.-M.; Su, Y.-C.,
Composition amd antioxidant activities of essential oils of different tissues from Cryptomeria japonica D. Don,
Quarterly J. Chin. Forestry, 2010, 32, 1, 63-76. [all data]
Lazarevic, Palic, et al., 2010
Lazarevic, J.S.; Palic, R.V.M.; Radulovic, N.S.; Ristic, N.R.; Stojanovic, G.S.,
Chemical composition and screening of the antimicrobial and antioxidative acrivity of extracts of Stachys species,
J. Serb. Chem. Soc., 2010, 75, 10, 1347-1359, https://doi.org/10.2298/JSC100601117L
. [all data]
Majcher, Lawrowski, et al., 2010
Majcher, M.; Lawrowski, P.; Jelen, H.,
Comparison of original and adulterated oscypek cheese based on volatile and sensory profiles,
Acta Sci. Pol. Technol. Aliment., 2010, 9, 3, 265-275. [all data]
Mesa-Arango, Betancur-Galvis, et al., 2010
Mesa-Arango, A.C.; Betancur-Galvis, L.; Montiel, J.; Bueno, J.G.; Baena, A.; Duran, D.C.; Martinez, J.R.; Stashenko, E.E.,
Antifungal activity and chemical composition of the essential oils of Lippia alba (Miller) N.E. Brown grown in different regions of Colombia,
J. Essential Oil Res., 2010, 22, 6, 568-574, https://doi.org/10.1080/10412905.2010.9700402
. [all data]
Meshkatalsadat, Safaei-Ghomi. J., et al., 2010
Meshkatalsadat, M.H.; Safaei-Ghomi. J.; Moharramipour, S.; Nasseri, M.,
Chemical characterization of volatile components of Tagetes minuta L. cultivated in South West of Iran by nano scale injection,
Digest J. Nanomaterials Biostructures, 2010, 5, 1, 101-106. [all data]
Mirjalili, Salehi, et al., 2010
Mirjalili, M.H.; Salehi, P.; Sonboli, A.; HAdian, J.; Ebrahimi, S.N.; Yousefzadi, M.,
The composition and antibacterial activity of the essential oil of Levisticum officinale Koch flowers and fruits at different developmental stages,
J. Serb. Chem. Soc., 2010, 75, 12, 1661-1669, https://doi.org/10.2298/JSC100524126M
. [all data]
Mishra, Chaudhary, et al., 2010
Mishra, R.K.; Chaudhary, S.; Pandey, R.; Gupta, S.; Mallavarapu, G.R.; Kumar, S.,
Analysis of linalool content in the inflorescence (flower) essential oil and leaf oil of Lippia alba cultivar Kavach,
J. Essen. Oil Res., 2010, 22, 1, 3-7, https://doi.org/10.1080/10412905.2010.9700253
. [all data]
Miyazawa, Kawauchi, et al., 2010
Miyazawa, M.; Kawauchi, Y.; Utsumi, Y.; Takahashi, T.,
Character impact odorants of wild edible plant - Cacalia hastata L. var. orientalis - used in Japanese traditional food,
J. Oleo Sci., 2010, 59, 10, 527-533, https://doi.org/10.5650/jos.59.527
. [all data]
Monsef-Esfahani, Miri, et al., 2010
Monsef-Esfahani, H.R.; Miri, A.; Amini, M.; Amanzadeh, Y.; Hadjiakhoondi, A.; Hajiaghaee, R.; Ajani, Y.,
Seasonal variations in the chemical composition, antioxidant activity and total phenolic content of Teucrium persicum Boiss. essential oils,
Res. J. Biol. Sci., 2010, 5, 7, 492-498, https://doi.org/10.3923/rjbsci.2010.492.498
. [all data]
Neves, Rosa, et al., 2010
Neves, A.; Rosa, S.; Goncalves, J.; Rufino, A.; Judas, F.; Salgueiro, L.; Lopes, M.C.; Cavaleiro, C.; Mendes, A.F.,
Screening of five essential oils for identification of potential inhibitors of IL-1-unduced Nf-kB activation and NO production in human clondrocytes: characterization of the inhibitory activity of alpha-pinene,
Plante Med., 2010, 76, 03, 303-308, https://doi.org/10.1055/s-0029-1186085
. [all data]
Ogunwande, Flamini, et al., 2010
Ogunwande, I.A.; Flamini, G.; Cioni, P.L.; Omikorede, O.; Azeez, R.A.; Ayodele, A.A.; Kamil, Y.O.,
Aromatic plants growing in Nigeria: essential oil constituents of Cassia alata (Linn.) Roxb. and Helianthus annuus L.,
Rec. Nat. Prod., 2010, 4, 4, 211-217. [all data]
Pino, Marquez, et al., 2010
Pino, J.A.; Marquez, E.; Quijano, C.E.; Castro, D.,
Volatile compounds in noni (Morinda citrifolia L.) at two ripening stages,
Ciencia e Technologia de Alimentos, 2010, 30, 1, 183-187, https://doi.org/10.1590/S0101-20612010000100028
. [all data]
Pripdeevech, Chumpolsri, et al., 2010
Pripdeevech, P.; Chumpolsri, W.; Suttiarporn, P.; Wongpornchai, S.,
The chemical composition and antioxidant activities of Basil from Thailand using retention indices and comprehensive two-dimensional gas chromatography,
J. Seb. Chem. Soc., 2010, 75, 11, 1503-1513, https://doi.org/10.2298/JSC100203125P
. [all data]
Radulovic, Dordevic, et al., 2010
Radulovic, N.S.; Dordevic, N.D.; Palic, R.M.,
Volatiles of Pleurospermum austriacum (L.) Hoffm. (Apiaceae),
J. Serbian Chem. Soc., 2010, 75, 12, 1-11, https://doi.org/10.2298/JSC100323127R
. [all data]
Radulovic, Dordevic, et al., 2010, 2
Radulovic, N.; Dordevic, N.; Markovic, M.; Palic, R.,
Volatile constituents of Glechoma Hirsuta Waldst. Kit. and G. Hederacea L. (Lamiaceae),
Bull. Chem. Soc. Ethiop., 2010, 24, 1, 67-76, https://doi.org/10.4314/bcse.v24i1.52962
. [all data]
Safaei-Ghomi and Batooli, 2010
Safaei-Ghomi, J.; Batooli, H.,
Determination of bioactive molecules from flowers, leaves, stems and roots of Perovskia abrotanoides Karel growing in central Iran by nano scale injection,
Digest J. Nanomaterials Biostructures, 2010, 5, 2, 551-556. [all data]
Safaei-Ghomi, Meshkatalsadat, et al., 2010
Safaei-Ghomi, J.; Meshkatalsadat, M.H.; Asadi, M.,
Analysis of the essential oil of Salvia brachycalyx Boiss. by nano scale injection and antioxidative activity of methanol extract of this plant,
Digest J. Nanomaterials and Biostructures, 2010, 5, 2, 545-549. [all data]
Scandinaro, Tranchida, et al., 2010
Scandinaro, M.; Tranchida, P.Q.; Costa, R.; Dugo, P.; Mondello, L.,
Rapid Quality Control of Flavours and Fragrances using Fast GC-MS and Multi-MS Library Search Procedures,
LCGC Europe, 2010, 23, 9, 456-464. [all data]
de Souza, Lopes, et al., 2010
de Souza, A.; Lopes, E.M.C.; da Silva, M.C.; Cordeiro, I.; Young, M.C.M.; Sobral, M.E.G.; Moreno, P.R.H.,
Chemical composition and acetylcholinesterase inhibitory activity of essential oils of Myrceugenia myrciolides (Cambess.) O. Berg and Eugenia riedelliana O. Berg, Myrtaceae,
Braz. J. Pharmacognosy, 2010, 20, 2, 175-179. [all data]
Takeoka, Hobbs, et al., 2010
Takeoka, G.R.; Hobbs, C.; Byeoung-Soo, P.,
Volatile constituents of the aerial parts of Salvia apiana Jepson,
J. Essential Oil. Res., 2010, 22, 3, 241-244, https://doi.org/10.1080/10412905.2010.9700314
. [all data]
Usman, Zubair, et al., 2010
Usman, L.A.; Zubair, M.F.; Adabayo, S.A.; Oladosu, I.A.; Muhammad, N.O.; Akolade, J.O.,
Chemical composition of leaf and fruit essential oils of Hoslundia opposita Vahl grown in Nigeria,
Americal-Eurasian J. Agric. Environ. Sci., 2010, 8, 1, 40-43. [all data]
Vahirua-Lechat, Mitermite, et al., 2010
Vahirua-Lechat, I.; Mitermite, Y.; Menut, C.,
Aromatic plants of French Polynesia. IV. Composition and chemical variations of the essential oils of leaves of Etlingera cevuga (seeman) R.E. Smith,
J. Essen. Oil Res., 2010, 22, 5, 407-409, https://doi.org/10.1080/10412905.2010.9700357
. [all data]
Xu, Tang, et al., 2010
Xu, X.; Tang, Z.; Liang, Y.,
Comparative analysis of plant essential oils by GC-MS coupled with integrated chemometric resolution methods,
Anal. Methods, 2010, 2, 4, 359-367, https://doi.org/10.1039/b9ay00213h
. [all data]
Yang, Zhang, et al., 2010
Yang, X.; Zhang, H.; Zhang, Y.; Zhao, H.; Dong, A.; Xu, L.; Yang, L.; Ma, Y.; Wang, J.,
Analysis if the essential oils of pine cones of Pinus koraiensis Steb. et Zucc. and P. sylvestris L. from China,
J. Essen. Oil Res., 2010, 22, 5, 446-448, https://doi.org/10.1080/10412905.2010.9700368
. [all data]
Zouari, Zouari, et al., 2010
Zouari, S.; Zouari, N.; Fakhfakh, N.; Bougatel, A.; Ayadi, M.A.; Neffati, M.,
Chemical composition and biological activities of a new essential oil chemotype of Tunisian Artemisia herba alba Asso,
J. Medicinal Plants Res., 2010, 4, 10, 871-880. [all data]
Alim, Goze, et al., 2009
Alim, A.; Goze, I.; Cetin, A.; Atas, A.; Vural, N.; Donmez, E.,
Antimicrobial activity of the essential oil of Cyclotrichimun niveum (Boiss.) Manden. Et Scheng,
African J. Microbiol. Res., 2009, 3, 8, 422-425. [all data]
Benites, Moiteiro, et al., 2009
Benites, J.; Moiteiro, C.; Miguel, G.; Rojo, L.; Lopez, J.; Venancio, F.; Ramalho, L.; Feio, S.; Dandlen, S.; Casanova, H.; Torres, I.,
Composition and biological activity of the essential oil of Peruvial Lantana camara,
J. Chilean Chem. Soc., 2009, 54, 4, 379-384, https://doi.org/10.4067/S0717-97072009000400012
. [all data]
Dayisoylu and Alma, 2009
Dayisoylu, K.S.; Alma, M.H.,
Chemical analysis of essential oils from cone's rosin of Cilician fir (Abies cilicica subsp. cilicica),
Afr. J. Biotechnol., 2009, 8, 15, 3502-3505. [all data]
El-Massry, El-Ghorab, et al., 2009
El-Massry, K.F.; El-Ghorab, A.H.; Shaaban, H.A.; Shibamoto, T.,
Chemical compositions and antioxidant/antimicrobial activities of various samples prepared from Schinus terebinthifolius leaves cultivated in Egipt,
J. Agric. Food Chem., 2009, 57, 12, 5265-5270, https://doi.org/10.1021/jf900638c
. [all data]
Farhat, Ginies, et al., 2009
Farhat, A.; Ginies, C.; Romdhane, M.; Chemat, F.,
Eco-friendly and cleaner process for isolation of essential oil usung microwave energy. Experimantal and theoretical study.,
J. Chromatogr. A., 2009, 1216, 26, 5077-5085, https://doi.org/10.1016/j.chroma.2009.04.084
. [all data]
Gauvin-Bialecki and Marodon, 2009
Gauvin-Bialecki, A.; Marodon, C.,
Essential oil of Ayapana triplinervis from Reunion island: a good natural source of thymohydroquinone dimethyl ether,
Biochem. Systematics Ecol., 2009, 36, 11, 853-858, https://doi.org/10.1016/j.bse.2008.09.006
. [all data]
Gilani, Shah, et al., 2009
Gilani, A.H.; Shah, A.J.; Zubair, A.; Khalid, S.; Kiani, J.; Ahmed, A.; Rasheed, M.; Ahmad, V.U.,
Chemical composition and mechanisms underlying the spasmolytic and bronchodilatory properties of the essential oil of Nepeta cataria L.,
J. Ethnopharmacology, 2009, 121, 3, 405-411, https://doi.org/10.1016/j.jep.2008.11.004
. [all data]
Ho, Wang, et al., 2009
Ho, C.-L.; Wang, E.I.-C.; Su, Y.-C.,
Essential oil compositions and bioactivities of the various parts of Cinnamomum camphora Sieb. var. linallolifera Fujuta,
Journal title only in Chinese, 2009, 31, 2, 77-96. [all data]
Jaimand, Rezaee, et al., 2009
Jaimand, K.; Rezaee, M.B.; Nadery Hajee Bagher Kandy M.,
Volatile oil constituents of the Eucalyptus viridis R.T. Baker and Eucalyptus oleosa F. Muell. leaves from Iran,
J. of Medicinal Plants, 2009, 8, Suppl. # 5, 105-108. [all data]
Karlsson, Birgersson, et al., 2009
Karlsson, M.F.; Birgersson, G.; Prado, A.M.C.; Bosa, F.; Bengtsson, M.; Witzgall, P.,
Plant Odor Analysis of Potato: Responce of Guatemalan Moth to Above- and Background Potato Volatiles,
J. Agric. Food Chem., 2009, 57, 13, 5903-5909, https://doi.org/10.1021/jf803730h
. [all data]
Kazemi and Akhavani, 2009
Kazemi, M.; Akhavani, S.,
Constituents of Artemisia tournefortiana Rchb. essential oil from Iran,
J. Appl. Chem. Res., 2009, 3, 10, 1-5. [all data]
Kim and Chung, 2009
Kim, J.-S.; Chung, H.Y.,
GC-MS analysis of the volatile components in dried boxthorn (Lycium chimensis) Fruit,
J. Korean Soc. Appl. Biol. Chem., 2009, 52, 5, 516-524, https://doi.org/10.3839/jksabc.2009.088
. [all data]
Lawal and Oyedelji, 2009
Lawal, O.A.; Oyedelji, A.O.,
Chemical composition of the essential oils of Cyperus rotundus L. from South Africa,
Molecules, 2009, 14, 8, 2909-2917, https://doi.org/10.3390/molecules14082909
. [all data]
Li and Zhao, 2009
Li, L.; Zhao, J.,
Determination of the volatile composition of Rhodobryum giganteum (Schwaegr.) Par. (Bryaceae) using solid-phase microextraction and gas chromatography / mass spectrometry (GC/MS),
Molecules, 2009, 14, 6, 2195-2201, https://doi.org/10.3390/molecules14062195
. [all data]
Males, Plazibat, et al., 2009
Males, Z.; Plazibat, M.; Bucar, F.,
Essential oil of Portanschlagiella ramosissima from Croatia, a rich source of myristicin,
Croat. Chem. Acta, 2009, 82, 4, 725-728. [all data]
Marchesini, Prada, et al., 2009
Marchesini, A.M.; Prada, G.G.; Messiano, G.B.; Machado, M.B.; Lopes, L.M.X.,
Chemical constituents of Aristolochia giberti,
J. Braz. Chem. Soc., 2009, 20, 9, 1598-1608, https://doi.org/10.1590/S0103-50532009000900006
. [all data]
Museli, Pau, et al., 2009
Museli, A.; Pau, M.; Desjobert, J.-M.; Foddai, M.; Usai, M.; Costa, J.,
Volatile constituents of Achllea ligustica All. by HS-SPME/GC/GC-MS. Comparison with essential oils obtained by hydrodistillation from Corsica and Sardinia,
Chromatographia, 2009, 69, 5/6, 575-585, https://doi.org/10.1365/s10337-008-0939-1
. [all data]
Porto, Decorti, et al., 2009
Porto, C.Da.; Decorti, D.; Kikic, I.,
Flavour compounds of Lavandula angustifolia L. to use in food manufacturing: comparison of three different extraction methods,
Food Chem., 2009, 112, 4, 1072-1078, https://doi.org/10.1016/j.foodchem.2008.07.015
. [all data]
Rahmi-Nasrabadi, Gholivand, et al., 2009
Rahmi-Nasrabadi, M.; Gholivand, M.B.; Batooli, H.,
Chemical composition of the essential oil from leaves and flowering aerial parts of Haplophyllum robustum Bge. (Rutaceae),
Digest J. Nanomaterials Biostructures, 2009, 4, 4, 819-822. [all data]
Rahimi-Nasrabadi, Gholivand, et al., 2009
Rahimi-Nasrabadi, M.; Gholivand, M.B.; Batooli, H.; Vatanara, A.,
Chemical composition of the essential oil from leaves and flowering aerial parts of Psammogeton canscens (DC). Vake from Iran,
J. Medicinal Plants, 2009, 8, 31, 82-86. [all data]
Retta, Gattuso, et al., 2009
Retta, D.; Gattuso, M.; Gattuso, S.; Lira, P. Di Leo; van Baren, C.; Ferraro, G.; Bandoni A.,
Essential oil composition of Achyrocline flaccida (Weinm.) DC. (Asteraceae) from different locations of Argentina,
Biochem. Systematics Ecol., 2009, 36, 12, 877-881, https://doi.org/10.1016/j.bse.2008.11.001
. [all data]
Scrivanti, Anton, et al., 2009
Scrivanti, L.R.; Anton, A.M.; Zygadlo, J.A.,
Essential oil conposition of Bothriochloa Kuntze (Poaceae) from South America and their chemotaxonomy,
Biochem. Systematics Ecol., 2009, 37, 3, 206-213, https://doi.org/10.1016/j.bse.2009.03.009
. [all data]
Seo, Kim, et al., 2009
Seo, S.-M.; Kim, J.; Lee, S.-G.; Shin, C.-H.; Shin, S.-C.; Park, I.-K.,
Fumigant antitermitic activity of plant essential oils and components from Aiowan (Trachyspermum ammi), Allspice (Pimenta dioica), Caraway (Carum carvi), Dill (Anethum graveolens), Geranium (Pelargonium graveolens), and Litsea (Litsea cubeba( oils against Japanese termite (Reticulitermes speratus Kolbe),
J. Agric. Food Chem., 2009, 57, 15, 6596-6602. [all data]
Shafaghat and Sadeghi, 2009
Shafaghat, A.; Sadeghi, H.,
Composition and antibacterial activity of essentia; oils from leaf, stem and root of Chrysanthemum parthenium (L.) Bernh. from Iran,
Electronic J. of Environ., Agriculture and Food Chem. (EJEAFChe), 2009, 8, 9, 766-771. [all data]
Shimizu, Imayoshi, et al., 2009
Shimizu, Y.; Imayoshi, Y.; Kato, M.; Maeda, K.; Iwabuchi, H.; Shimomura, K.,
Volatiles from leaves of field-grown plants and shoot cultures of Gynura bicolor DC,
Flavour Fragr. J., 2009, 24, 5, 251-258, https://doi.org/10.1002/ffj.1938
. [all data]
Sivadier, Ratel, et al., 2009
Sivadier, G.; Ratel, J.; Engel, E.,
Latency and persistence of diet volatile biomarkers in lamb fats,
J. Agric. Food Chem., 2009, 57, 2, 645-652, https://doi.org/10.1021/jf802467q
. [all data]
de Souza, Lopes, et al., 2009
de Souza, A.; Lopes, E.M.C.; da Silva, M.C.; Cordeiro, I.; Young, M.C.M.; Sobral, M.E.G.; Moreno, P.R.H.,
Chemical composition and acetylcholinesterase inhibitory activity of essential oils of Myrceugenia myrcioides (Chambess.) O. Berg and Eugenia riedeliana O. Berg, Myrtaceae,
Braz. J. Pharmacognosy, 2009, 20, 2, 175-179. [all data]
Su, Wang, et al., 2009
Su, Y.; Wang, C.; Yinlong, G.,
Analysis of volatile compounds from Mentha hapioealyx Briq. by GC-MS based on accurate mass measurements and retention indices,
Acta Chem. Sinica, 2009, 67, 6, 546-554. [all data]
Wannes, Mhamdi, et al., 2009
Wannes, W.A.; Mhamdi, B.; Marzouk, B.,
GC comparative analysis of least essential oils from two Myrtle varieties at different phenological stages,
Chromatographia, 2009, 69, 1/2, 145-150, https://doi.org/10.1365/s10337-008-0818-9
. [all data]
Zaibunnisa, Norashikin, et al., 2009
Zaibunnisa, A.H.; Norashikin, S.; Mamot, S.; Osman, H.,
An experimental design approach for the extraction of volatile compounds from turmeric leaves (Curcuma domestica) using pressurised liquid extraction (PLE),
LWT-Food Sci. Technol., 2009, 42, 1, 233-238, https://doi.org/10.1016/j.lwt.2008.03.015
. [all data]
Zhannan, Shiqiong, et al., 2009
Zhannan, Y.; Shiqiong, L.; Quancai, P.; Chao, Z.; Zhengwen, Y.,
GC-MS analysis of the essential oil of Coral Ginger (Zingiber corallinum Hance) rhizome obtained by supercritical fluid extraction and steam distillation extraction,
Chromatographia, 2009, 69, 7/8, 785-790, https://doi.org/10.1365/s10337-009-0971-9
. [all data]
Zhao, Zeng, et al., 2009
Zhao, C.; Zeng, Y.; Wan, M.; Li, R.; Liang, Y.; Li, C.; Zeng, Z.; Chau, F.-T.,
Comparative analysis of essential oils from eight herbal medicines with pungent flavor and cool nature by GC-MS and chemometric resolution methods,
J. Sep. Sci., 2009, 32, 4, 660-670, https://doi.org/10.1002/jssc.200800484
. [all data]
Aicha, Ines, et al., 2008
Aicha, N.; Ines, S.; Mohamed, B.S.; Ines, B.; Soumaya, K.; Kamel, G.; Mohamed, N.; Imed, C.; Mohamed, H.; Leila, C.-G.,
Chemical composition, mutagenic and antimutagenic activities of essential oils from (Tunisian) Artemisia campestris and Artemisia herba-alba,
J. Ess. Oil Res., 2008, 20, 5, 471-477. [all data]
Bastos, Ishimoto, et al., 2008
Bastos, D.H.M.; Ishimoto, E.Y.; Marques, O.M.; Ferri, A.F.; Torres, E.A.F.S.,
Essential Oil and Antioxidant Activity of Green Mate and Mate Tea (Ilex paraguariensis) Infusions, 2008, retrieved from http://www.aseanfood.info/Articles/11016488.pdf. [all data]
Baziou, Couladis, et al., 2008
Baziou, P.; Couladis, M.; Petrakis, P.V.; Verykokidou, E.; Harvala, C.,
Composition and antioxidant activity of the essential oil of Hypericum perfoliatum from Greece, 2008, retrieved from http://www.amapseec.org/cmapseec.1/Papers/papp065.htm. [all data]
Blazevic and Mastelic, 2008
Blazevic, I.; Mastelic, J.,
Free and bounded volatiles of rocket (Eruca sativa Mill.),
Fravour Fragr. J., 2008, 23, 4, 278-285, https://doi.org/10.1002/ffj.1883
. [all data]
Byun and Shin, 2008
Byun, Y.; Shin, S.,
Analysis of compounds and activity of essential oil from Chrysanthemum zawadskii var. latilobum and C. indicum agaunst antibiotic-resistant pathogenic bacteria,
Nat. Prod. Sci., 2008, 14, 2, 138-142. [all data]
Flamini, Tebano, et al., 2008
Flamini, G.; Tebano, M.; Cioni, P.L.,
Composition of the essential oils from leafy parts of the shoots, flowers and fruits of Eryngium amethystinum from Amiata Mount (Tuscany, Italy),
Food Chem., 2008, 107, 2, 671-674, https://doi.org/10.1016/j.foodchem.2007.08.064
. [all data]
Forero, Quijano, et al., 2008
Forero, M.D.; Quijano, C.E.; Pino, J.A.,
Volatile compounds of Chile pepper (Capsicum annuum L. var. glabriusculum) at two ripening stages,
Flavour Fragr. J., 2008, 24, 1, 25-30, https://doi.org/10.1002/ffj.1913
. [all data]
Isidorov, Lech, et al., 2008
Isidorov, V.A.; Lech, P.; Zolciak, A.; Rusak, N.; Szczepaniak, L.,
Gas Chromatographic - nass spectrometric investigation of metabolites from the needles and roots of pine seedlings at early stages of pathogenic fungi Armillaria ostoyae attack,
Trees, 2008, 22, 4, 531-542, https://doi.org/10.1007/s00468-008-0213-z
. [all data]
Kowalski, 2008
Kowalski, R.,
Antimicrobial activity of essential oils and extracts of rosinweed (Silphoum trifoliatum and Silphium integrifolium) plants used by the American Indians,
Flav. Fragr. J., 2008, 23, 6, 426-433, https://doi.org/10.1002/ffj.1901
. [all data]
Lago, Romoff, et al., 2008
Lago, J.H.G.; Romoff, P.; Favero, O.A.; Souza, F.O.; Soares, M.G.; Baraldi, P.T.; Correa, A.G.,
Chemical composition of male and female Baccharis trimera (Less.) DC. (Asteraceae) essential oils,
Biochem. Systematics Ecol., 2008, 36, 9, 737-740, https://doi.org/10.1016/j.bse.2008.05.009
. [all data]
Lo Presti, Sciarrone, et al., 2008
Lo Presti, M.; Sciarrone, D.; Crupi, M.C.; Costa, R.; Ragusa, S.; Dugo, G.; Mondello, L.,
Evaliation of the volatile and chiral composition in Pistacia lentiscus L. essential oil,
Flavour Fragr. J., 2008, 23, 4, 249-257, https://doi.org/10.1002/ffj.1878
. [all data]
Mierendorff, Stahl-Biskup, et al., 2008
Mierendorff, H.-G.; Stahl-Biskup, E.; Posthumus, M.A.; van Beek, T.A.,
Composition of commercial Cape chamomile oil (Eriocephalus punctuatus / Eriocephalus tenuifolius), 2008, retrieved from http://www.chemische-analysen-hamburg.de/Publikationen?CapeChamomileOil/. [all data]
Mosayebi, Amin, et al., 2008
Mosayebi, M.; Amin, G.; Arzani, H.; Azarnivand, H.; Maleki, M.; Shafaghat, A.,
Effect of habitat on essential oil of Achillea filipendula L. in Iran,
Asian J. Plant Sci., 2008, 7, 8, 779-781, https://doi.org/10.3923/ajps.2008.779.781
. [all data]
Noudogbessi, Yedomonhan, et al., 2008
Noudogbessi, J.-P.; Yedomonhan, P.; Sohounhloue, D.C.K.; Chalchat, J.-C.; Figueredo, G.,
Chemical composition of essential oil of syzygium guineense (Willd.) DC. var. guineense (Myrtaceae) from Benin,
Rec. Nat. Prod., 2008, 33-38. [all data]
Raj, Baby, et al., 2008
Raj, G.; Baby, S.; Dan, M.; Thaha, A.R.M.; Sethuraman, M.G.; George, V.,
Volatile constituents from the rhisomes of Curcuma haritha Mangaly and Sabu from Sauthern India,
Flavour Fragr. J., 2008, 23, 5, 348-352, https://doi.org/10.1002/ffj.1891
. [all data]
Sahraoui, Vian, et al., 2008
Sahraoui, N.; Vian, M.A.; Bornard, I.; Boutekedjiret, C.; Chemat, F.,
Improved microwave steam distillation apparatus for isolation of essential oils. Comparison with conventional steam distillation,
J. Chromatogr. A., 2008, 1210, 2, 229-233, https://doi.org/10.1016/j.chroma.2008.09.078
. [all data]
Shellie, 2008
Shellie, R.A.,
Comprehensive 2D GC-QPMS with differential flow modulation,
LV-GC, 2008, 11, 7-18. [all data]
Skalicka-Wozniak, Los, et al., 2008
Skalicka-Wozniak, K.; Los, R.; Glowniak, K.; Malm, A.,
Variation of the volatile content of the fruits of Peucedanum alsaticum L.,
Acta Chromatographica, 2008, 20, 1, 119-133, https://doi.org/10.1556/AChrom.20.2008.1.10
. [all data]
Verdian-rizi, 2008
Verdian-rizi, M.,
Phenological variations of Laurus nobilis L. essential oil from Iran,
Electronic J. Environ. Agricultural Food Chem., 2008, 7, 11, 3321-3325. [all data]
Wang, Yi, et al., 2008
Wang, Y.; Yi, L.; Liang, Y.; Li, H.; Yuan, D.; Gao, H.; Zeng, M.,
Comparative analysis of essential oil components in Pericarpium Citri Reticulatae Viride and Pericarpium Citri Reticulatae by GC-MS combined with chemometric resolution method,
J. Pharmaceutical and Biomedical Anal., 2008, 46, 1, 66-74, https://doi.org/10.1016/j.jpba.2007.08.030
. [all data]
Yassa and Akhani, 2008
Yassa, N.; Akhani, H.,
The essential oils composition in two species of the genus Eriocycla Lindl. (Apiaceae) from Iran, 2008, retrieved from http://biology.ut.ac.ir/members/akhani/PdfReprintNumber/27.pdf. [all data]
Adams, Beauchamp, et al., 2007
Adams, R.P.; Beauchamp, P.S.; Dev, V.; Dutz, S.M.,
New Natural Products Isolated from One-Seeded Juniperus of the Southwestern United States: Isolation and Occurence of 2-Ethenyl-3-methyl Phanol and Its Derivatives,
J. Essent. Oil Res., 2007, 19, 2, 146-152, https://doi.org/10.1080/10412905.2007.9699247
. [all data]
Alma, Ertas, et al., 2007
Alma, M.H.; Ertas, M.; Nitz, S.; Kollmannsberger, H.,
Chemical composition and content of essential oil from the bud of cultivated Turkish clove (Syzygium aromaticum L.),
BioResources, 2007, 2, 2, 265-269. [all data]
Amiri, 2007
Amiri, H.,
Quantative and qualative changes of essential oil of Salvia bracteata BAnk et Sol. in different growth stages,
DARU, 2007, 15, 2, 79-82. [all data]
Andrade, Oliveira, et al., 2007
Andrade, E.H.A.; Oliveira, J.; Zoghbi, M.G.B.,
Volatiles of Anaxagorea dolichocarpa Spreng. Sandw. and Annona densicoma Mart. Growing Wild in the State of Pará, Brazil,
Flavour Fragr. J., 2007, 22, 2, 158-160, https://doi.org/10.1002/ffj.1776
. [all data]
Araque, Rojas, et al., 2007
Araque, M.; Rojas, L.B.; Usubillaga, A.,
Antibacterial activity of essential oil of Foeniculum vulgare miller againts multiresistant gram-negative bacilli from nosocomial infections,
Ciencia, 2007, 15, 3, 366-370. [all data]
Asekun, Olusegun, et al., 2007
Asekun, O.T.; Olusegun, E.; Adebola, O.,
The volatile constituents of the leaves and flowers of Kigelia africana Benth.,
Flavour Fragr. J., 2007, 22, 1, 21-23, https://doi.org/10.1002/ffj.1723
. [all data]
Baran, von Reuss, et al., 2007
Baran, S.; von Reuss, S.H.; König, W.A.; Kalemba, D.,
Composition of the essential oil of Abies koreana Wils.,
Flavour Fragr. J., 2007, 22, 1, 78-83, https://doi.org/10.1002/ffj.1762
. [all data]
Basta, Pavlovic, et al., 2007
Basta, A.; Pavlovic, M.; Couladis, M.; Tzakou, O.,
Essential oil composition of the flowerheads of Chrysanthemum coronarium L. from Greece,
Flavour Fragr. J., 2007, 22, 3, 197-200, https://doi.org/10.1002/ffj.1781
. [all data]
Basta, Tzakou, et al., 2007
Basta, A.; Tzakou, O.; Couladis, M.; Yannitsaros, A.,
Essential oil composition of Prasium majus L. from Greece,
Flavour Fragr. J., 2007, 22, 5, 347-349, https://doi.org/10.1002/ffj.1802
. [all data]
Bicchi, Cordero, et al., 2007
Bicchi, C.; Cordero, C.; Liberto, E.; Rubiolo, P.; Sgorbini, B.; Sandra, P.,
Sorptive tape extraction in the analysis of the volatile fraction emitted from biological solid matrices,
J. Chromatogr. A, 2007, 1148, 2, 137-144, https://doi.org/10.1016/j.chroma.2007.03.007
. [all data]
Bos, Woerdenbag, et al., 2007
Bos, R.; Woerdenbag, H.J.; Kayser, O.; Quax, W.J.; Ruslan, K.; Elfami,
Essential oil constituents of Piper cubeba L. fils. from Indonesia,
J. Essent. Oil Res., 2007, 19, 1, 14-17, https://doi.org/10.1080/10412905.2007.9699217
. [all data]
Bozin B., Mlmica-Dukic N., et al., 2007
Bozin B.; Mlmica-Dukic N.; Samojlik I.; Jovin E.,
Antimicrobial and antioxidant properties of rosemary and sage (Rosmarinus officinalis L. and Salvia officinalis L., lamiaceae) essential oils,
J. Agric. Food Chem., 2007, 55, 19, 7879-7885, https://doi.org/10.1021/jf0715323
. [all data]
Capetanos, Saroglou, et al., 2007
Capetanos, C.; Saroglou, V.; Marin, P.D.; Simic, A.; Skaltsa, H.D.,
Essential oil snalysis of two endemic Eringium species from Serbia,
J. Serb. Chem. Soc., 2007, 72, 10, 961-965, https://doi.org/10.2298/JSC0710961C
. [all data]
Cheraif, Ben Jannet, et al., 2007
Cheraif, I.; Ben Jannet, H.; Hammami, M.; Khouja, M.L.; Mighri, Z.,
Chemical composition and antimicrobial activity of essential oils of Cupressus arizonica Greene,
Biochem. Syst. Ecol., 2007, 35, 12, 813-820, https://doi.org/10.1016/j.bse.2007.05.009
. [all data]
Chyau, Tsai, et al., 2007
Chyau, C.-C.; Tsai, S.-Y.; Yang, J.-H.; Weng, C.-C.; Han, C.-M.; Shih, C.-C.; Mau, J.-L.,
The essential oil of Glossogyne tenuifolia,
Food Chem., 2007, 100, 2, 808-812, https://doi.org/10.1016/j.foodchem.2005.10.044
. [all data]
Coelho, Grosso, et al., 2007
Coelho, J.A.; Grosso, C.; Pereira, A.P.; Burillo, J.; Urieta, J.S.; Figueiredo, A.C.; Barroso, J.G.; Mendes, R.L.; Palavra, A.M.F.,
Supercritical carbon dioxide extraction of volatiles from Satureja fruticosa Béguinot,
Flavour Fragr. J., 2007, 22, 5, 438-442, https://doi.org/10.1002/ffj.1819
. [all data]
Da Silva J.K.R., Sousa P.J.C., et al., 2007
Da Silva J.K.R.; Sousa P.J.C.; Andrade E.H.A.; Maia JGS,
Antioxidant capacity and cytotoxicity of essential oil and methanol extract of Aniba canellia (HBK) Mez,
J. Agric. Food Chem., 2007, 55, 23, 9422-9426, https://doi.org/10.1021/jf071928e
. [all data]
Dongmo, Tatsadjieu, et al., 2007
Dongmo, P.M.J.; Tatsadjieu, L.N.; Tchoumbougnang, F.; Sameza, M.L.; Dongmo, B.N.; Zollo, P.H.A.; Menut, C.,
Chemical composition, antiradical and antifungal activities os eeesntioal oil af the leaves of Cinnamomum zeylanicum Blume from Cameroon,
Natural Product Communications, 2007, 2, 12, 1287-1290. [all data]
Elfami, Bos, et al., 2007
Elfami; Bos, R.; Ruslan, K.; Woerdenbag, H.J.; Kayser, P.; Quax, W.J.,
Essential Oil Constituents of Piper cubeba from Indonesia, 2007, 53-60. [all data]
El-Ghorab A., El-Massry K.F., et al., 2007
El-Ghorab A.; El-Massry K.F.; Shibamoto T.,
Chemical composition of the volatile extract and antioxidant activities of the volatile and nonvolatile extracts of Egyptian corn silk (Zea mays L.),
J. Agric. Food Chem., 2007, 55, 22, 9124-9127, https://doi.org/10.1021/jf071646e
. [all data]
Farsam, Amanlou, et al., 2007
Farsam, H.; Amanlou, M.; Taghi-Cheetsaz, N.; Amin, G.R.; Saledi-Sormaghi, M.H.,
Essential Oil of Chimonanthus fragrans flowers Population of Tehran,
DARU, 2007, 15, 3, 129-131. [all data]
Ferhat, Meklati, et al., 2007
Ferhat, M.A.; Meklati, B.Y.; Chemat, F.,
Comparison of different isolation methods of essential oil from Citrus fruits: cold pressing, hydrodistillation and microwave dry distillation,
Flavour Fragr. J., 2007, 22, 6, 494-504, https://doi.org/10.1002/ffj.1829
. [all data]
Füssel, Dötterl, et al., 2007
Füssel, U.; Dötterl, S.; Jürgens, A.; Aas, G.,
Inter- and intraspecific variation in floral scent in the genus Salix and its implication for pollination,
J. Chem. Ecol., 2007, 33, 4, 749-765, https://doi.org/10.1007/s10886-007-9257-6
. [all data]
Ghasempour, Shirinpour, et al., 2007
Ghasempour, H.R.; Shirinpour, E.; Heidari, H.,
The constituents of essential oils of Ferulago angulata (Schlecht.) Boiss at two different habitats, Nevakoh and Shahoo, Agross mountain, Western Iran,
Iranian J. Sci. Technol., 2007, 31, A3, 309-312. [all data]
Ghasemi, Yamini, et al., 2007
Ghasemi, E.; Yamini, Y.; Bahramifar, N.; Sefidkon, F.,
Comparative analysis of the oil and supercritical CO2 extract of Artemisia sieberi,
J. Food Eng., 2007, 79, 1, 306-311, https://doi.org/10.1016/j.jfoodeng.2006.01.059
. [all data]
Gil A., Van Baren C.M., et al., 2007
Gil A.; Van Baren C.M.; Lira P.M.D.L.; Bandoni A.L.,
Identification of the genotype from the content and composition of the essential oil of lemon verbena (Aloysia citriodora Palau),
J. Agric. Food Chem., 2007, 55, 21, 8664-8669, https://doi.org/10.1021/jf0708387
. [all data]
Gogus, Ozel, et al., 2007
Gogus, F.; Ozel, M.Z.; Lewis, A.C.,
The Effect of Various Drying Techniques on Apricot Volatiles Analysed Using Direct Desorption-GC-TOF/MS,
Talanta, 2007, 73, 2, 321-325, https://doi.org/10.1016/j.talanta.2007.03.048
. [all data]
Gudaityte and Venskutonis R.P., 2007
Gudaityte, O.; Venskutonis R.P.,
Chemotypes of Achillea millefolium transferred from 14 different locations in Lithuania to the controlled environment,
Biochem. Syst. Ecol., 2007, 35, 9, 582-592, https://doi.org/10.1016/j.bse.2007.03.016
. [all data]
Hachicha, Skanji, et al., 2007
Hachicha, S.F.; Skanji, T.; Barrek, S.; Ghrabi, Z.G.; Zarrouk, H.,
Composition of the essential oil of Teucrium ramosissimum Desf. (Lamiaceae) from Tunisia,
Flavour Fragr. J., 2007, 22, 2, 101-104, https://doi.org/10.1002/ffj.1764
. [all data]
Heravi and Sereshti, 2007
Heravi, M.J.; Sereshti, H.,
Determination of Essential Oil Components of Artemisia haussknechtii Boiss. using Simultaneous Hydrodistillation-Static Headspace Liquid Phase Microextraction - Gas Chromatography Mass Spectrometry,
J. Chromatogr. A, 2007, 1160, 1-2, 81-89, https://doi.org/10.1016/j.chroma.2007.05.096
. [all data]
Hudaib and Aburjai, 2007
Hudaib, M.; Aburjai, T.,
Volatile components of Thymus vulgaris L. from wild-growing and cultivated plants in Jordan,
Flavour Fragr. J., 2007, 22, 4, 322-327, https://doi.org/10.1002/ffj.1800
. [all data]
Kiran, Devi, et al., 2007
Kiran, S.R.; Devi, P.S.; Reddy, K.J.,
Bioactivity of essential oils and sesquiterpenes of Chloroxylon swietenia DC against Helicoverpa armigera,
Current Science, 2007, 93, 4, 544-548. [all data]
Limberger, Scopel, et al., 2007
Limberger, R.P.; Scopel, M.; Sobral, M.; Henriques, A.T.,
Comparative analysis of volatiles from Drimys brasiliensis Miers and D. angustifolia Miers (Winteraceae) from Southern Brazil,
Biochem. Syst. Ecol., 2007, 35, 3, 130-137, https://doi.org/10.1016/j.bse.2006.09.007
. [all data]
Loizzo, Tundis, et al., 2007
Loizzo, M.R.; Tundis, R.; Conforti, F.; Saab, A.M.; Statti, G.A.; Menichini, F.,
Comparative chemical composition, antioxidant and hypoglycaemic activities of Juniperus oxycedrus ssp. oxycedrus L. berry and wood oils from Lebanon,
Food Chem., 2007, 105, 2, 572-578, https://doi.org/10.1016/j.foodchem.2007.04.015
. [all data]
Marongiu B., Piras A., et al., 2007
Marongiu B.; Piras A.; Porcedda S.; Tuveri E.; Sanjust E.; Meli M.; Sollai F.; Zucca P.; Rescigno A.,
Supercritical CO2 extract of Cinnamomum zeylanicum: Chemical characterization and antityrosinase activity,
J. Agric. Food Chem., 2007, 55, 24, 10022-10027, https://doi.org/10.1021/jf071938f
. [all data]
Matasyoh, Matasyoh, et al., 2007
Matasyoh, L.G.; Matasyoh, J.C.; Wachira, F.N.; Kinyua, M.G.; Muigai, A.W.T.; Mukiama, T.K.,
Chemical composition and antimicrobial activity of the essential oil of Ocimum gratissimum L. growing in Eastern Kenya,
Afr. J. Biotechnol., 2007, 6, 760-765. [all data]
Meccia, Rojas, et al., 2007
Meccia, G.; Rojas, L.B.; Velasco, J.; Diaz, T.; Usubillaga, A.,
Composition and antibacterial screening of the essential oils of leaves and roots of Espeletiopsis angustifolia Cuetrec,
Natural Product Communications, 2007, 2, 12, 1221-1224. [all data]
Mohottalage, Tabacchi, et al., 2007
Mohottalage, S.; Tabacchi, R.; Guerin, P.M.,
Components from Sri Lankan Piper betle L. leaf oil and their analogues showing toxicity against the housefly, Musca domestica,
Flavour Fragr. J., 2007, 22, 2, 130-138, https://doi.org/10.1002/ffj.1770
. [all data]
Monser-Esfahani, Karamkhani, et al., 2007
Monser-Esfahani, H.R.; Karamkhani, F.; Nickavar, B.; Abdi, K.; Faramarzi, M.A.,
The Volatile Constituents of Dracocephalum kotschyi Oils,
Chem. Nat. Comp., 2007, 43, 1, 40-43, https://doi.org/10.1007/s10600-007-0027-z
. [all data]
Moreno, Lima, et al., 2007
Moreno, P.R.H.; Lima, M.E.L.; Sobral, M.; Young, M.C.M.; Cordeiro, I.; Apel, M.A.A.; Limberger, R.P.; Henriques, A.T.,
Essential oil composition of fruit colour varieties of Eugenia brasiliensis Lam.,
Sci. Agr.; (Piracicaba Praz.), 2007, 64, 4, 428-432. [all data]
Morteza-Semnani, Saeedi, et al., 2007
Morteza-Semnani, K.; Saeedi, M.; Akbarzadeh, M.,
Essential oil composition of Teucrium scordium L.,
Acta Pharm., 2007, 57, 4, 499-504, https://doi.org/10.2478/v10007-007-0040-6
. [all data]
Nori-Shargh, Raftari, et al., 2007
Nori-Shargh, D.; Raftari, S.; Deyhimi, F.,
Analysis of the essential oil of Grammosciadium scabridum Boiss. from Iran,
Flavour Fragr. J., 2007, 22, 5, 350-351, https://doi.org/10.1002/ffj.1803
. [all data]
Oliveira, Leitão, et al., 2007
Oliveira, D.R.; Leitão, G.G.; Bizzo, H.R.; Lopes, D.; Alviano, D.S.; Alviano, C.S.; Leitão, S.G.,
Chemical and antimicrobial analyses of essential oil of Lippia origanoides H.B.K,
Food Chem., 2007, 101, 1, 236-240, https://doi.org/10.1016/j.foodchem.2006.01.022
. [all data]
Ozcan and Chalchat, 2007
Ozcan, M.M.; Chalchat, J.C.,
Chemical Composition od Carrot Seeds (Daucus carota L.) Cultivated in Turkey: Characterization of the Seed Oil and Essential Oil,
Grasas y Aceites, 2007, 58, 4, 359-365. [all data]
Pala-Paul, Brophy, et al., 2007
Pala-Paul, J.; Brophy, J.J.; Perez-Alonso, M.J.; Usano, J.; Soria, S.C.,
Essential oil composition of the different parts of Eryngium corniculatum Lam. (Apiaceae) from Spain,
J. Chromatogr. A, 2007, 1175, 2, 289-293, https://doi.org/10.1016/j.chroma.2007.10.061
. [all data]
Pinto, Salgueiro, et al., 2007
Pinto, E.; Salgueiro, L.R.; Cavaleiro, C.; Palmeira, A.; Goncalves, M.J.,
In vitro susceptibility of some species of yeasts and filamentous fungi to essential oils of Salvia of?cinalis,
Ind. Crops Prod., 2007, 26, 2, 135-141, https://doi.org/10.1016/j.indcrop.2007.02.004
. [all data]
Pontes, de Olivera, et al., 2007
Pontes, W.J.T.; de Olivera, J.C.G.; da Camara, C.A.G.; Lopes, A.C.H.R.; Gondim Jr.; de Olivera, J.V.; Barros, R.; Schwartz, M.O.E.,
Chemical composition and acaridical activity of the leaf and fruit essential oils of Protium heptaphyllum (Aubl.) Marchand (Burseraceae),
Acta Amazonica, 2007, 37, 1, 103-110, https://doi.org/10.1590/S0044-59672007000100012
. [all data]
Raal, Orav, et al., 2007
Raal, A.; Orav, A.; Arak, E.; Kailas, T.; Müürisepp, M.,
Variation in the composition of the essential oil of Valeriana officinalis L. roots from Estonia,
Proc. Est. Acad. Sci. Chem., 2007, 56, 2, 67-74. [all data]
Rali, Wossa, et al., 2007
Rali, T.; Wossa, S.W.; Leach, D.N.,
Comparative Chemical Analysis of the Essential Oil Constituents in the Bark, Heartwood and Fruits of Cryptocarya massoy (Oken) Kosterm. (Lauraceae) from Papua New Guinea,
Molecules, 2007, 12, 149-154. [all data]
Rali, Wossa, et al., 2007, 2
Rali, T.; Wossa, S.W.; Leach, D.N.; Waterman, P.G.,
Volatile chemical constituents of Piper aduncum L and Piper gibbilimbum C. DC (Piperaceae) from Papua New Guinea,
Molecules, 2007, 12, 3, 389-394, https://doi.org/10.3390/12030389
. [all data]
Ramirez R. and Cava R., 2007
Ramirez R.; Cava R.,
Volatile profiles of dry-cured meat products from three different Iberian x Duroc genotypes,
J. Agric. Food Chem., 2007, 55, 5, 1923-1931, https://doi.org/10.1021/jf062810l
. [all data]
Reza, Ebrahim, et al., 2007
Reza, G.H.; Ebrahim, S.; Hossein, H.,
Analysis by gas chromatography - mass spectrometry of essential oil from seeds and aerial parts of Ferulago angulata (Schlecht.) Boiss gatheres in Nevakoh and Shahoo, Zagross mountain, west of Iran,
Pakistan J. Biol. Sci., 2007, 10, 5, 814-817, https://doi.org/10.3923/pjbs.2007.814.817
. [all data]
Ristic, Krivokuca-Dokic, et al., 2007
Ristic, M.; Krivokuca-Dokic, D.; Radanovic, D.; Nastovski, T.,
Etarsko ulje Arnica montata i Arnica chamissonis,
Hem. Ind., 2007, 61, 5, 272-277, https://doi.org/10.2298/HEMIND0704272R
. [all data]
Rojas, Velasco, et al., 2007
Rojas, J.; Velasco, J.; Rojas, L.B.; Carmona, J.; Morales, A.,
Chemical composition and antimicrobial activity of the essential oil of Baacharis latifolia Pers. and B. prunifolia H.B.K. (Asteraceae),
Natural Product Communications, 2007, 2, 12, 1245-1248. [all data]
Safaei-Ghomi, Bamoniri, et al., 2007
Safaei-Ghomi, J.; Bamoniri, A.; Hatami, A.; Batooli, H.,
Composition of the Essential Oil of Stachys acerosa Growing in Central Iran,
Chem. Nat. Comp., 2007, 43, 1, 37-39, https://doi.org/10.1007/s10600-007-0026-0
. [all data]
Salehi, Asghari, et al., 2007
Salehi, P.; Asghari, B.; Mohammadi, F.,
Hydrodistillation-Headspace Solvent Microextraction: An Efficient Method for Analysis of the Essential Oil from the Seeds of Foeniculum vulgare Mill.,
Chromatographia, 2007, 65, 1-2, 119-122, https://doi.org/10.1365/s10337-006-0102-9
. [all data]
Salehi, Fakhari, et al., 2007
Salehi, P.; Fakhari, A.R.; Ebrahimi, S.N.; Heydari, R.,
Rapid essential oil screening of Rosmarinus officinalis L. by hydrodistillation-headspace solvent microextraction,
Flavour Fragr. J., 2007, 22, 4, 280-285, https://doi.org/10.1002/ffj.1793
. [all data]
Sefidkon, Abbasi, et al., 2007
Sefidkon, F.; Abbasi, K.; Jamzad, Z.; Ahmadi, S.,
The effect of distillation methods and stage of plant growth on the essential oil content and composition of Satureja rechingeri Jamzad,
Food Chem., 2007, 100, 3, 1054-1058, https://doi.org/10.1016/j.foodchem.2005.11.016
. [all data]
Sereshti and Samadi, 2007
Sereshti, H.; Samadi, S.,
Comparison of hydrodistillation-headspace liquid phase microextraction techniques with hydrodistillation in determination of essential oils in Artemisia Haussknechtii Boiss,
JSUT, 2007, 33, 2, 7-17. [all data]
Smelcerovic, Spiteller, et al., 2007
Smelcerovic, A.; Spiteller, M.; Ligon, A.P.; Smelcerovic, Z.; Raabe, N.,
Essential oil composition of Hypericum L. species from Southeastern Serbia and their chemotaxonomy,
Biochem. Syst. Ecol., 2007, 35, 2, 99-113, https://doi.org/10.1016/j.bse.2006.09.012
. [all data]
Sonboli, Kanani, et al., 2007
Sonboli, A.; Kanani, M.R.; Yousefzadi, M.; Mojarrad, M.,
Biological activity and composition of the essential oil of Tetrataenium nephrophyllum (Apiaceae) from Iran,
Natural Product Communications, 2007, 2, 12, 1249-1252. [all data]
Sylvestre, Longtin, et al., 2007
Sylvestre, M.; Longtin, A.P.A.; Legault, J.,
Volatile leaf condtituents and anticancer activity of Bursera simaruba (L.) Sarg. essential oil,
Natural Product Communications, 2007, 2, 12, 1273-1276. [all data]
Sylvestre, Pichette, et al., 2007
Sylvestre, M.; Pichette, A.; Longtin, A.; Martin, M.-A.C.; Bercion, S.R.; Legault, J.,
Chemical composition of leaf essential oil of Hedyosmum arborescens and evaluation of its anticancer activity,
Natural Product Communications, 2007, 2, 12, 1269-1272. [all data]
Tapia, Perich, et al., 2007
Tapia, T.; Perich, F.; Pardo, F.; Palma, G.; Quiroz, A.,
Identification of volatiles from differently aged red clover (Trifolium pratense) root extracts and behavioural responses of clover root borer (Hylastinus obscurus) (Marsham) (Coleoptera: Scolytidae) to them,
Biochem. Syst. Ecol., 2007, 35, 2, 61-67, https://doi.org/10.1016/j.bse.2006.05.020
. [all data]
Tava, Pecetti, et al., 2007
Tava, A.; Pecetti, L.; Ricci, M.; Pagnotta, M.A.; Russi, L.,
Volatile compounds from leaves and flowers of Bituminaria bituminosa (L.) Stirt. (Fabaceae) from Italy,
Flavour Fragr. J., 2007, 22, 5, 363-370, https://doi.org/10.1002/ffj.1806
. [all data]
Tiwary, Nail, et al., 2007
Tiwary, M.; Nail, S.N.; Tewary, D.K.; Mittal, P.K.; Yadav, S.,
Chemical composition and larvicidal activities of the essential oil of Zanthoxylum armatum DC (Rutaceae) against three mosquito vectors,
J. Vect. Borne Dis., 2007, 44, 9, 198-204. [all data]
Tsokou, Georgopoulos, et al., 2007
Tsokou, A.; Georgopoulos, K.; Melliou, E.; Magiatis, P.; Tsitsa, E.,
Composition and enantiomeric analusis of the essential oil of the fruits and the leaves of Pistacia vera from Greece,
Molecules, 2007, 12, 6, 1233-1239, https://doi.org/10.3390/12061233
. [all data]
Tzakou, Bazos, et al., 2007
Tzakou, O.; Bazos, I.; Yannitsaros, A.,
Volatile metabolites of Pistacia atlantica Desf. from Greece,
Flavour Fragr. J., 2007, 22, 5, 358-362, https://doi.org/10.1002/ffj.1805
. [all data]
Vagionas, Graikou, et al., 2007
Vagionas, K.; Graikou, K.; Ngassapa, O.; Runyoro, D.; Chinou, I.,
Composition and antimicrobial activity of the essential oils of three Satureja species growing in Tansania,
Food Chem., 2007, 103, 2, 319-324, https://doi.org/10.1016/j.foodchem.2006.07.051
. [all data]
Vasta, Ratel, et al., 2007
Vasta, V.; Ratel, J.; Engel, E.,
Mass Spectrometry Analysis of Volatile Compounds in Raw Meat for the Authentication of the Feeding Background of Farm Animals,
J. Agric. Food Chem., 2007, 55, 12, 4630-4639, https://doi.org/10.1021/jf063432n
. [all data]
Vichi, Riu-Aumatell, et al., 2007
Vichi, S.; Riu-Aumatell, M.; Mora-Pons, M.; Guadayol, J.M.; Buxaderas, S.; López-Tamames, E.,
Analytical, Nutritional and Clinical Methods. HS-SPME coupled to GC/MS for quality control of Juniperus communis L. berries used for gin aromatization,
Food Chem., 2007, 105, 4, 1748-1754, https://doi.org/10.1016/j.foodchem.2007.03.026
. [all data]
Yassa and Akhani, 2007
Yassa, N.; Akhani, H.,
The essential oils composition in two species of the genus Eriocycla Lindl. (Apiaceae) from Iran, 2007, retrieved from http://biology.ut.ac.ir/members/akhani/PdfReprintNumber/27.pdf. [all data]
Zeller and Rychlik, 2007
Zeller, A.; Rychlik, M.,
Impact of estragole and other odorants on the flavour of anise and tarragon,
Flavour Fragr. J., 2007, 22, 2, 105-113, https://doi.org/10.1002/ffj.1765
. [all data]
Abdelwahed, Hayder, et al., 2006
Abdelwahed, A.; Hayder, N.; Kilani, S.; Mahmoud, A.; Chibani, J.; Hammami, M.; Chekir-Ghedira, L.; Ghedira, K.,
Chemical composition and antimicrobial activity of essential oils from Tunisian Pituranthos tortuosus (Coss.) Maire,
Flavour Fragr. J., 2006, 21, 1, 129-133, https://doi.org/10.1002/ffj.1542
. [all data]
Apel, Sobral, et al., 2006
Apel, M.A.; Sobral, M.; Zuanazzi, J.A.S.; Henriques, A.T.,
Essential oil composition of four Plinia species (Myrtaceae),
Flavour Fragr. J., 2006, 21, 3, 565-567, https://doi.org/10.1002/ffj.1638
. [all data]
Apel, Sobral, et al., 2006, 2
Apel, M.A.; Sobral, M.; Zuanazzi, J.A.S.; Henriques, A.T.,
Essential oil composition of Calycorectes australis and Calycorectes psidiiflorus (Myrtaceae),
Flavour Fragr. J., 2006, 21, 4, 656-658, https://doi.org/10.1002/ffj.1640
. [all data]
Ayoub, Al-Azizi, et al., 2006
Ayoub, N.; Al-Azizi, M.; König, W.; Kubeczka, K.-H.,
Essential oils and a novel polyacetylene from Eryngium yuccifolium Michaux. (Apiaceae),
Flavour Fragr. J., 2006, 21, 6, 864-868, https://doi.org/10.1002/ffj.1631
. [all data]
Bazargani, Almasirad, et al., 2006
Bazargani, Y.T.; Almasirad, A.; Amin, G.; Shafiee, A.,
Chemical composition of the essential oils of Astrodaucus persicus (Boiss.) Drude root, stem/leaves and flowers/fruits,
Flavour Fragr. J., 2006, 21, 2, 294-296, https://doi.org/10.1002/ffj.1589
. [all data]
Berlioz, Cordella, et al., 2006
Berlioz, B.; Cordella, C.; Cavalli, J.-F.; Lizzani-Cuvelier, L.; Loiseau, A.-M.; Fernandez, X.,
Comparison of the amounts of volatile compounds in French protected designation of origin virgin olive oils,
J. Agric. Food Chem., 2006, 54, 26, 10092-10101, https://doi.org/10.1021/jf061796+
. [all data]
Biondi, Sari, et al., 2006
Biondi, D.M.; Sari, M.i.; Ghani, Z.A.l.; Ruberto, G.,
Essential oil of Algerian Saccocalyx satureioides Coss. et Durieu,
Flavour Fragr. J., 2006, 21, 3, 546-548, https://doi.org/10.1002/ffj.1661
. [all data]
Borges, Rojas, et al., 2006
Borges, R.; Rojas, L.B.; Cegarra, J.A.; Usubillaga, A.,
Study of the essential oils from the leaves and flowers of Lepechinia conferta (Benth) Epl.,
Flavour Fragr. J., 2006, 21, 1, 155-157, https://doi.org/10.1002/ffj.1550
. [all data]
Boti, Yao, et al., 2006
Boti, J.B.; Yao, P.A.; Koukoua, G.; N'Guessan, T.Y.; Casanova, J.,
Components and chemical variability of Isolona campanulata Engler Diels leaf oil,
Flavour Fragr. J., 2006, 21, 1, 166-170, https://doi.org/10.1002/ffj.1555
. [all data]
Bozin, Mimicá-Dukic, et al., 2006
Bozin, B.; Mimicá-Dukic, N.; Simin, N.; Anackov, G.,
Characterization of the volatile composition of essential oils of some lamiaceae spices and the antimicrobial and antioxidant activities of the entire oils,
J. Agric. Food Chem., 2006, 54, 5, 1822-1828, https://doi.org/10.1021/jf051922u
. [all data]
Castel, Fernandez, et al., 2006
Castel, C.; Fernandez, X.; Lizzani-Cuvelier, L.; Loiseau, A.-M.; Perichet, C.; Delbecque, C.; Arnaudo, J.-F.,
Volatile constituents of benzoin gums: Siam and Sumatra, part 2. Study of headspace sampling methods,
Flavour Fragr. J., 2006, 21, 1, 59-67, https://doi.org/10.1002/ffj.1502
. [all data]
Cavaleiro, Pinto, et al., 2006
Cavaleiro, C.; Pinto, E.; Gonsales, M.J.; Salguero, L.,
Antifungal activity of Juniperus essential oils agains dermatophyte, Asrgillus and Candida strains,
J. Appl. Microbiol., 2006, 100, 6, 1333-1338, https://doi.org/10.1111/j.1365-2672.2006.02862.x
. [all data]
Chen, Sheu, et al., 2006
Chen, H.-C.; Sheu, M.-J.; Wu, C.-M.,
Characterization of Volatiles in Guava (Psidium guajava L. cv. Chung-Shan-Yueh-Pa) Fruit from Taiwan,
J. Food Drug. Anal., 2006, 14, 4, 398-402. [all data]
Choi, 2006
Choi, H.-S.,
Headspace analyses of fresh leaves and stems of Angelica gigas Nakai, a Korean medicinal herb,
Flavour Fragr. J., 2006, 21, 4, 604-608, https://doi.org/10.1002/ffj.1602
. [all data]
Coronel, Cerda-Garcia-Rojas, et al., 2006
Coronel, A. del.C.; Cerda-Garcia-Rojas, C.M.; Joseph-Nathan, P.; Catalán, C.A.N.,
Chemical composition, seasonal variation and a new sesquiterpene alcohol from the essential oil of Lippia integrifolia,
Flavour Fragr. J., 2006, 21, 5, 839-847, https://doi.org/10.1002/ffj.1736
. [all data]
Damjanovic, Skala, et al., 2006
Damjanovic, B.; Skala, D.; Baras, J.; Petrovic-Djakov, D.,
Isolation of essential oil and supercritical carbon dioxide extract of Juniperus communis L. fruits from Montenegro,
Flavour Fragr. J., 2006, 21, 6, 875-880, https://doi.org/10.1002/ffj.1711
. [all data]
Ebrahim Sajjadi and Mehregan, 2006
Ebrahim Sajjadi, S.; Mehregan, I.,
Volatile constituents of flowers and leaves of Anthemis hyalina,
Chem. Nat. Compd. (Engl. Transl.), 2006, 42, 5, 531-533, https://doi.org/10.1007/s10600-006-0207-2
. [all data]
Elfami, Komar, et al., 2006
Elfami, R.B.; Komar, R.; Woerdenbag, H.J.; Kayser, P.; Quax, W.J.,
Essential oil constituents of Piper cubeba from Indonesia, 2006, retrieved from http://dissertations.ub.rug.nl/FILES/facultiew/science/2006/elfahmi/05c5.pdf. [all data]
Fanciullino, Tomi, et al., 2006
Fanciullino, A.-L.; Tomi, F.; Luro, F.; Desjobert, J.M.; Casanova, J.,
Chemical variability of peel and leaf oils of mandarins,
Flavour Fragr. J., 2006, 21, 2, 359-367, https://doi.org/10.1002/ffj.1658
. [all data]
Farah, Afifi, et al., 2006
Farah, A.; Afifi, A.; Fechtal, M.; Chhen, A.; Satrani, B.; Talbi, M.; Chaouch, A.,
Fractional distillation effect on the chemical composition of Moroccan myrtle (Myrtus communis L.) essential oils,
Flavour Fragr. J., 2006, 21, 2, 351-354, https://doi.org/10.1002/ffj.1651
. [all data]
Fernandez, Pintaric, et al., 2006
Fernandez, X.; Pintaric, C.; Lizzani-Cuvelier, L.; Loiseau, A.-M.; Morello, A.; Pellerin, P.,
Chemical composition of absolute and supercritical carbon dioxide extract of Aframomum melegueta,
Flavour Fragr. J., 2006, 21, 1, 162-165, https://doi.org/10.1002/ffj.1554
. [all data]
Figuérédo, Cabassu, et al., 2006
Figuérédo, G.; Cabassu, P.; Chalchat, J.-C.; Pasquier, B.,
Studies of Mediterranean oregano populations. VIII. Chemical composition of essential oils of oreganos of various origins,
Flavour Fragr. J., 2006, 21, 1, 134-139, https://doi.org/10.1002/ffj.1543
. [all data]
Filippi, Lanfranchi, et al., 2006
Filippi, J.-J.; Lanfranchi, D.-A.; Prado, S.; Baldovini, N.; Meierhenrich, U.J.,
Composition, Enantiomeric Distribution, and Antibacterial Activity of the Essential Oil of Achillea ligustica All. from Corsica,
J. Agric. Food Chem., 2006, 54, 17, 6308-6313, https://doi.org/10.1021/jf060752y
. [all data]
Garneau F.X., Collin G., et al., 2006
Garneau F.X.; Collin G.; Gagnon H.; Jean F.I.; Strobl H.; Pichette A.,
The essential oil composition of Devil's Club, Oplopanax horridus J. E. Smith Miq.,
Flavour Fragr. J., 2006, 21, 5, 792-794, https://doi.org/10.1002/ffj.1716
. [all data]
Gohari, Hadjiakhoondi, et al., 2006
Gohari, A.R.; Hadjiakhoondi, A.; Sadat-Ebrahimi, E.; Saeidnia, S.; Shafiee, A.,
Composition of the volatile oils of Satureja spicigera C. Koch Boiss. and S. macrantha C. A. Mey from Iran,
Flavour Fragr. J., 2006, 21, 2, 348-350, https://doi.org/10.1002/ffj.1642
. [all data]
Gohari A.R., Hadjiakhoondi A., et al., 2006
Gohari A.R.; Hadjiakhoondi A.; Sadat-Ebrahimi E.; Saeidnia S.; Shafiee A.,
Composition of the volatile oils of Satureja spicigera C. Koch Boiss. and S-macrantha C. A. Mey from Iran,
Flavour Fragr. J., 2006, 21, 3, 510-512, https://doi.org/10.1002/ffj.1613
. [all data]
Havlik, Kokoska, et al., 2006
Havlik, J.; Kokoska, L.; Vasickova, S.; Valterova, I.,
Chemical composition of essential oil from the seeds of Nigella arvensis L. and assessment of its actimicrobial activity,
Flavour Fragr. J., 2006, 21, 4, 713-717, https://doi.org/10.1002/ffj.1713
. [all data]
Hymete, Rohloff, et al., 2006
Hymete, A.; Rohloff, J.; Iversen, T.-H.,
Essential oil from seeds and husks of Aframomum corrorima from Ethiopia,
Flavour Fragr. J., 2006, 21, 4, 642-644, https://doi.org/10.1002/ffj.1634
. [all data]
Ibañez and Usubillaga, 2006
Ibañez, J.; Usubillaga, A.,
The essential oil of Espeletia schultzii of different altitudinal populations,
Flavour Fragr. J., 2006, 21, 2, 286-289, https://doi.org/10.1002/ffj.1586
. [all data]
Ibanez and Usubillaga, 2006
Ibanez, J.; Usubillaga, A.,
Analysis of the essential oil of two different altitudinal populations of Coespeletia moritziana (Sch. Bip.ex Wedd) Cuatrec,
Flavour Fragr. J., 2006, 21, 5, 760-763, https://doi.org/10.1002/ffj.1655
. [all data]
Javidnia, Miri, et al., 2006, 3
Javidnia, K.; Miri, R.; Kamalinejad, M.; Mehdipour, A.R.,
Composition of the essential oil of Diplotaenia cachrydifolia Boiss. from Iran,
J. Ess. Oil Res., 2006, 18, 1, 86-87, https://doi.org/10.1080/10412905.2006.9699393
. [all data]
Kim, Abd El-Aty, et al., 2006
Kim, M.R.; Abd El-Aty, A.M.; Kim, I.S.; Shim, J.H.,
Determination of volatile flavor components in danggui cultivars by solvent free injection and hydrodistillation followed by gas chromatographic-mass spectrometric analysis,
J. Chromatogr. A, 2006, 1116, 1-2, 259-264, https://doi.org/10.1016/j.chroma.2006.03.060
. [all data]
Kim, El-Aty, et al., 2006
Kim, M.R.; El-Aty, A.M.A.; Choi, J.-H.; Lee, K.B.; Shim, J.H.,
Identification of volatile components in Angelica species using supercritical-CO2 fluid extraction and solid phase microextraction coupled to gas chromatography-mass spectrometry,
Biomedical Chromatography, 2006, 20, 11, 1267-1273, https://doi.org/10.1002/bmc.696
. [all data]
Kiran, Bhavani, et al., 2006
Kiran, S.R.; Bhavani, K.; Devi, P.S.; Rao, B.R.R.; Reddy, K.J.,
Composition and alrvicidal activity of leaves and stem essential oils of Chloroxylon swietenia DC against Aedes aegypti and Anopheles stephensi,
Biores. Technol., 2006, 97, 18, 2481-2484, https://doi.org/10.1016/j.biortech.2005.10.003
. [all data]
Kitchlu, Bakshi, et al., 2006
Kitchlu, S.; Bakshi, S.K.; Kaul, M.K.; Bhan, M.K.; Thapa, R.K.; Agarwal, S.G.,
Tanacetum gracile Hook. f T. A new source of lavandulol from Ladakh Himalaya (India),
Flavour Fragr. J., 2006, 21, 4, 690-692, https://doi.org/10.1002/ffj.1674
. [all data]
Kucuk, Gulec, et al., 2006
Kucuk, M.; Gulec, C.; Yasar, A.; Ucuncu, O.; Yayh, N.; Coskuncelebi, K.; Terzioglu, S.; Yayh, N.,
Chemical composition and antimicrobial activities of the essential oils of Teucrium chamaedrys subsp. chamaedrys, T. orientale var. puberulens, and T. chamaedrys subsp. lydium,
Pharm. Biol., 2006, 44, 8, 592-599, https://doi.org/10.1080/13880200600896868
. [all data]
Kula, Izydorczyk, et al., 2006
Kula, J.; Izydorczyk, K.; Czajkowska, A.; Bonikowski, R.,
Chemical composition of carrot umbel oils from Daucus carota L. ssp. sativus cultivated in Poland,
Flavour Fragr. J., 2006, 21, 4, 667-669, https://doi.org/10.1002/ffj.1646
. [all data]
Kurowska and Galazka, 2006
Kurowska, A.; Galazka, I.,
Essential oil composition of the parsley seed of cultivars marketed in Poland,
Flavour Fragr. J., 2006, 21, 1, 143-147, https://doi.org/10.1002/ffj.1548
. [all data]
Lan Phi N.T., Nishiyama C., et al., 2006
Lan Phi N.T.; Nishiyama C.; Choi H.-S.; Sawamura M.,
Evaluation of aroma characteristic compounds of Citrus natsudaidai Hayata (Natsudaidai) cold-pressed peel oil,
Biosci. Biotechnol. Biochem., 2006, 70, 8, 1832-1838, https://doi.org/10.1271/bbb.50705
. [all data]
Li, Lee, et al., 2006
Li, Z.-G.; Lee, M.-R.; Shen, D.-L.,
Analysis of volatile compounds emitted from fresh Syringa oblata flowers in different florescence by headspace solid-phase microextraction-gas chromatography-mass spectrometry,
Anal. Chim. Acta., 2006, 576, 1, 43-49, https://doi.org/10.1016/j.aca.2006.01.074
. [all data]
Lis and Milczarek, 2006
Lis, A.; Milczarek, J.,
Chemical composition of the essential oils from fruits, leaves and flowers of Phellodendron sachalinense (Fr. Schmidt) Sarg.,
Flavour Fragr. J., 2006, 21, 4, 683-686, https://doi.org/10.1002/ffj.1662
. [all data]
Martin, Joseph, et al., 2006
Martin, M.A.C.K.; Joseph, H.; Bercion, S.; Menut, C.,
Chemical composition of essential oils from aerial parts of Aframomum exscapum (Sims) Hepper collected in Guadeloupe, French West Indies,
Flavour Fragr. J., 2006, 21, 6, 902-905, https://doi.org/10.1002/ffj.1741
. [all data]
Marzouk, Mansour, et al., 2006
Marzouk, Z.; Mansour, H.B.; Chraief, I.; Mosrati, R.; Cheriaa, J.; Neffati, A.; Marzouk, B.; Sfari, M.; Boukef, K.; Barillies, D.; Ghedira, L.C.,
Chemical composition, antibacterial and antimutagenic activities of four populations of Rosmarinus officinalis L. oils from Tunisia,
J. Food Agriculture Environment, 2006, 4, 2, 89-94. [all data]
Marzouk, Neffati, et al., 2006
Marzouk, Z.; Neffati, A.; Marzouk, B.; Chraief, I.; Fathia, K.; Ghedira, L.C.; Boukef, K.,
Chemical composition and antibacterial and antimutagenic activity of Tunisian Rosmarinus officinalis L. oil from Kasrine,
Journal of Food, Agriculture Environment, 2006, 4, 34, 61-65. [all data]
Maronigiu, Piras, et al., 2006
Maronigiu, B.; Piras, A.; Porcedda, S.; Tuveri, E.,
Extraction of Santalum album and Boswellia carterii Birdw. volatile oil by supercritical carbon dioxide: influence of some process parameters,
Flavour Fragr. J., 2006, 21, 4, 718-724, https://doi.org/10.1002/ffj.1718
. [all data]
Marongiu, Piras, et al., 2006
Marongiu, B.; Piras, A.; Porcedda, S.; Tuveri, E.; Maxia, A.,
Isolation of Seseli bocconi Guss. volatile oil by supercritical carbon dioxide extraction,
Natural Product Research, 2006, 20, 9, 820-826, https://doi.org/10.1080/14786410500364684
. [all data]
Mastelic, Jerkovic, et al., 2006
Mastelic, J.; Jerkovic, I.; Mesic, M.,
Volatile constituents from flowers, leaves, bark and wood of Prunus mahaleb L.,
Flavour Fragr. J., 2006, 21, 2, 306-313, https://doi.org/10.1002/ffj.1596
. [all data]
Mirza, Navaei, et al., 2006
Mirza, M.; Navaei, M.N.; Dini, M.,
Volatile constituents of essential oils isolated from flowers and leaves of Eupatorium cannabinum L. from Iran,
Iranian J. Pharmaceutical Res., 2006, 2, 149-152. [all data]
Moody, Gundidza, et al., 2006
Moody, J.O.; Gundidza, M.; Wyllie, G.,
Essential oil composition of Leucas milanjiana Guerke,
Flavour Fragr. J., 2006, 21, 6, 872-874, https://doi.org/10.1002/ffj.1669
. [all data]
Morteza-Semnani, Akbarzadeh, et al., 2006
Morteza-Semnani, K.; Akbarzadeh, M.; Changizi, S.,
Essential oils composition of Stachys byzantina, S. inflata, S. lavandulifolia and S. laxa from Iran,
Flavour Fragr. J., 2006, 21, 2, 300-303, https://doi.org/10.1002/ffj.1594
. [all data]
Morteza-Semnani K., Akbarzadeh M., et al., 2006
Morteza-Semnani K.; Akbarzadeh M.; Moshiri K.,
The essential oil composition of Eupatorium cannabinum L. from Iran,
Flavour Fragr. J., 2006, 21, 3, 521-523, https://doi.org/10.1002/ffj.1687
. [all data]
Morteza-Semnani K., Saeedi M., et al., 2006
Morteza-Semnani K.; Saeedi M.; Changizi S.,
The essential oil composition of Hypericum scabrum L. from Iran,
Flavour Fragr. J., 2006, 21, 3, 513-515, https://doi.org/10.1002/ffj.1614
. [all data]
Najafpour Navaei, Mirza, et al., 2006
Najafpour Navaei, M.; Mirza, M.; Dini, M.,
Chemical composition of the essential oils of Rubia tinctorum L. aerial parts from Iran,
Flavour Fragr. J., 2006, 21, 3, 519-520, https://doi.org/10.1002/ffj.1667
. [all data]
Olawore, Usman, et al., 2006
Olawore, N.O.; Usman, L.A.; Ogunwande, I.A.; Adeleke, K.A.,
Constituents of rhizome essential oils of two types of Cyperus articulatus L. grown in Nigeria,
J. Essent Oil Res., 2006, 18, 6, 604-606, https://doi.org/10.1080/10412905.2006.9699179
. [all data]
Orav, Raal, et al., 2006
Orav, A.; Raal, A.; Arak, E.; Müürisepp, M.; Kailas, T.,
Composition of the essential oil of Artemisia absinthium L. of different geographical origin,
Proc. Est. Acad. Sci. Chem., 2006, 55, 3, 155-165. [all data]
Ouamba, Ouabonzi, et al., 2006
Ouamba, J.-M.; Ouabonzi, A.; Ekouya, A.; Bessière, J.-M.; Menut, C.; Abena, A.A.; Banzouzi, J.-T.,
Volatile constituents of the essential oil leaf of Lantana salvifolia Jacq. (Verbenaceae),
Flavour Fragr. J., 2006, 21, 1, 158-161, https://doi.org/10.1002/ffj.1553
. [all data]
Ozcan, Chalchat, et al., 2006
Ozcan, M.M.; Chalchat, J.-C.; Arslan, D.; Ates, A.; Unver, A.,
Comparative Essential Oil Composition and Antifungal Effect of Bitter Fennel (Foeniculum vulgare ssp. piperitum) Fruit Oils Obtained During Different Vegetation,
J. Medicinal Food, 2006, 9, 4, 552-561, https://doi.org/10.1089/jmf.2006.9.552
. [all data]
Ozel, Gogus, et al., 2006
Ozel, M.Z.; Gogus, F.; Lewis, A.C.,
Comparison of direct thermal desorption with water distillation and superheated water extraction for the analysis of volatile components of Rosa damascena Mill. using GCxGC-TOF/MS,
Anal. Chim. Acta., 2006, 566, 2, 172-177, https://doi.org/10.1016/j.aca.2006.03.014
. [all data]
Pala-Paul J., Perez-Alonso M.J., et al., 2006
Pala-Paul J.; Perez-Alonso M.J.; Velasco-Negueruela A.; Ballesteros M.T.; Sanz J.,
Essential oil composition of Sideritis hirsuta L. from Guadalajara Province, Spain,
Flavour Fragr. J., 2006, 21, 3, 410-415, https://doi.org/10.1002/ffj.1727
. [all data]
Petrovic, Ristic, et al., 2006
Petrovic, S.; Ristic, M.; Milenkovic, M.; Kukic, J.; Antic-Stankovic, J.; Niketic, M.,
Composition and antimicrobial activity of essential oil of Stachys plumosa Griseb.,
Flavour Fragr. J., 2006, 21, 2, 250-252, https://doi.org/10.1002/ffj.1570
. [all data]
Pintore G., Chessa M., et al., 2006
Pintore G.; Chessa M.; Manconi P.; Zanetti S.; Deriu A.; Tirillini B.,
Chemical composition and antimicrobial activities of essential oil of stachys glutinosa L. from Sardinia,
Natural Product Communications, 2006, 1, 12, 1133-1136. [all data]
Pino, Marbot, et al., 2006
Pino, J.A.; Marbot, R.; Payo, A.; Chao, D.; Herrera, P.,
Aromatic Plants from Western Cuba VII. Composition of the Leaf Oil of Psidium wrightii KRug et Urb., Lantana involucrata L., Cinnamonum montanum (Sw.) Berchtold et J. Persl. and Caesalpinia violacea (Mill.) Standley,
J. Essent. Oil. Res., 2006, 18, 2, 170-174, https://doi.org/10.1080/10412905.2006.9699058
. [all data]
Pino, Sauri-Duch, et al., 2006
Pino, J.; Sauri-Duch, E.; Marbot, R.,
Changes in volatile compounds of Habanero chile pepper (Capsicum chinense Jack. cv. Habanero) at two ripening stages,
Food Chem., 2006, 94, 3, 394-398, https://doi.org/10.1016/j.foodchem.2004.11.040
. [all data]
Pitarokili, Tzakou, et al., 2006
Pitarokili, D.; Tzakou, O.; Loukis, A.,
Essential oil composition of Salvia verticillata, S. verbenaca, S. glutinosa and S. candidissima growing wild in Greece,
Flavour Fragr. J., 2006, 21, 4, 670-673, https://doi.org/10.1002/ffj.1647
. [all data]
Potzernheim, Bizzo, et al., 2006
Potzernheim, M.C.L.; Bizzo, H.R.; Vieira, R.F.,
Analysis of the essential oil of three species of Piper collected in the region of the Distrito Federal (Cerrado - Brazilian Savannah) and comparison with oils of plants from region of Paraty, State of Rio de Janeiro (Atlantic Rain Forest),
Brazilian Journal of Pharmacognosy, 2006, 16, 2, 246-251. [all data]
Robinson, 2006
Robinson, C.J.,
A new essential oil - Agonis fragrans, A report for the Rural Industries Research and Development Corporation, RIRDC Publication No. 06/090, Rural Industries Research and Development Corporation, Barton, ACT, 2006, 12. [all data]
Rout, Naik, et al., 2006
Rout, P.K.; Naik, S.N.; Rao, Y.R.,
Composition of the concrete, absolute, headspace and essential oil of the flowers of Michelia champaca Linn.,
Flavour Fragr. J., 2006, 21, 6, 906-911, https://doi.org/10.1002/ffj.1742
. [all data]
Sabulal, Dan, et al., 2006
Sabulal, B.; Dan, M.; Anil, J.J.; Kurup, R.; Pradeep, N.S.; Valsamma, R.K.; George, V.,
Caryophyllene-rich rhizome oil of Zingiber nimmonii from South India: Chemical characterization and antimicrobial activity,
Phytochemistry, 2006, 67, 22, 2469-2473, https://doi.org/10.1016/j.phytochem.2006.08.003
. [all data]
Sari M., Biondi D.M., et al., 2006
Sari M.; Biondi D.M.; Kaabeche M.; Mandalari G.; D'Arrigo M.; Bisignano G.; Saija A.; Daquino C.; Ruberto G.,
Chemical composition, antimicrobial and antioxidant activities of the essential oil of several populations of Algerian Origanum glandulosum Desf.,
Flavour Fragr. J., 2006, 21, 6, 890-898, https://doi.org/10.1002/ffj.1738
. [all data]
Sawamura, Onishi, et al., 2006
Sawamura, M.; Onishi, Y.; Ikemoto, J.; Tu, N.T.M.; Phi, N.T.L.,
Characteristic odour components of bergamot (Citrus bergamia Risso) essential oil,
Flavour Fragr. J., 2006, 21, 4, 609-615, https://doi.org/10.1002/ffj.1604
. [all data]
Schlumpberger B.O., Clery R.A., et al., 2006
Schlumpberger B.O.; Clery R.A.; Barthlott W.,
A unique cactus with scented and possibly bat-dispersed fruits: Rhipsalis juengeri,
Plant Biology, 2006, 8, 2, 265-270, https://doi.org/10.1055/s-2005-873045
. [all data]
Schmidt, Jirovetz, et al., 2006
Schmidt, E.; Jirovetz, L.; Buchbauer, G.; Eller, G.A.; Stoilova, I.; Krastanov, A.; Stoyanova, A.; Geisseler, M.,
Composition and antioxidant activities of the essential oil of cinnamon (Cinnamomum zeylanicum Blume) leaves from Sri Lanka,
Jeobp, 2006, 9, 2, 170-182. [all data]
Sefidkon, Abbasi, et al., 2006
Sefidkon, F.; Abbasi, K.; Bakhshi Khaniki, G.,
Influence of drying and extraction methods on yield and chemical composition of the essential oil of Satureja hortensis,
Food Chem., 2006, 99, 1, 19-23, https://doi.org/10.1016/j.foodchem.2005.07.026
. [all data]
Sefidkon and Jamzad, 2006
Sefidkon, F.; Jamzad, Z.,
Chemical composition of the essential oil of Gontscharovia popovii from Iran,
Flavour Fragr. J., 2006, 21, 4, 619-621, https://doi.org/10.1002/ffj.1628
. [all data]
Sefidkon, Jamzad, et al., 2006
Sefidkon, F.; Jamzad, Z.; Mirza, M.,
Chemical composition of the essential oil of five Iranian Nepeta species (N. crispa, N. mahanensis, N. ispahanica, N. eremophila and N. rivularis),
Flavour Fragr. J., 2006, 21, 5, 764-767, https://doi.org/10.1002/ffj.1668
. [all data]
Shafi, Jose, et al., 2006
Shafi, P.M.; Jose, B.; Radhamani, K.T.; Clery, R.A.,
Influence of pH on essential oil composition of Zanthoxylum rhetsa seeds obtained by steam distillation,
Flavour Fragr. J., 2006, 21, 2, 317-318, https://doi.org/10.1002/ffj.1598
. [all data]
Sonboli, Mirjalili, et al., 2006
Sonboli, A.; Mirjalili, M.H.; Yousefzadi, M.,
Antimicrobial activity and composition of the essential oil of Cymbopogon Olivieri (Boiss.) Bor from Iran,
Iranian J. Pharm. Res., 2006, 1, 65-68. [all data]
Tesso, König, et al., 2006
Tesso, H.; König, W.A.; Son, P.T.; Giang, P.M.,
Composition of the essential oil of flowers of Chloranthus spicatus (Thunb.) Makino,
Flavour Fragr. J., 2006, 21, 4, 592-597, https://doi.org/10.1002/ffj.1528
. [all data]
Tesso, Kubeczka, et al., 2006
Tesso, H.; Kubeczka, K.-H.; König, W.A.,
A new phthalide from the essential oil of Meum athamanticum,
Flavour Fragr. J., 2006, 21, 4, 622-625, https://doi.org/10.1002/ffj.1629
. [all data]
Tigrine-Kordiani, Meklati, et al., 2006
Tigrine-Kordiani, N.; Meklati, B.Y.; Chemat, F.,
Abalysis by gas chromatography - mass spectrometry of the essential oil of Zygophyllum album L., an aromatic and medicinal plant growing in Algeria,
Int. J. Aromatherapy, 2006, 16, 3-4, 187-191, https://doi.org/10.1016/j.ijat.2006.09.008
. [all data]
Tonzibo, Coffy, et al., 2006
Tonzibo, Z.F.; Coffy, A.A.; Chalachat, J.C.; N'guessan, Y.T.,
Chemical composition of essential oils of Hoslundia opposita Vahl. from Ivory Coast.,
Flavour Fragr. J., 2006, 21, 5, 789-791, https://doi.org/10.1002/ffj.1715
. [all data]
Tornambe, Cornu, et al., 2006
Tornambe, G.; Cornu, A.; Pradel, P.; Kondjoyan, N.; Carnat, A.P.; Petit, M.; Martin, B.,
Changes in Terpene Content in Milk from Pasture-Fed Cows,
J. Dairy Sci., 2006, 89, 6, 2309-2319, https://doi.org/10.3168/jds.S0022-0302(06)72302-5
. [all data]
Trilles, Bombarda, et al., 2006
Trilles, B.L.; Bombarda, I.; Bouraïma-Madjebi, S.; Raharivelomanana, P.; Bianchini, J.-P.; Gaydou, E.M.,
Occurrence of various chemotypes in niaouli [Melaleuca quinquenervia (Cav.) S. T. Blake] essential oil from New Caledonia,
Flavour Fragr. J., 2006, 21, 4, 677-682, https://doi.org/10.1002/ffj.1649
. [all data]
Velasco-Negueruela, Pérez-Alonso, et al., 2006
Velasco-Negueruela, A.; Pérez-Alonso, M.J.; Pérez de Paz, P.L.; Palá-Paúl, J.; Sanz, J.,
Analysis by gas chromatography?mass spectrometry of the volatiles from the fruits of Ammodaucus leucotrichus subsp. leucotrichus and subsp. nanocarpus grown in North Africa and the Canary Islands, respectively,
J. Chromatogr. A, 2006, 1108, 2, 273-275, https://doi.org/10.1016/j.chroma.2006.01.031
. [all data]
Wang, Kong, et al., 2006
Wang, P.; Kong, C.H.; Zhang, C.X.,
Chemical Composition and Antimicrobial Activity of the Essential Oil from Ambrosia trifida L.,
Molecules, 2006, 11, 7, 549-555, https://doi.org/10.3390/11070549
. [all data]
Wong, Lim, et al., 2006
Wong, K.C.; Lim, T.B.; Ali, D.M.H.,
Essential oil of Homalomena sagittifolia Jungh.,
Flavour Fragr. J., 2006, 21, 5, 786-788, https://doi.org/10.1002/ffj.1714
. [all data]
Wong, Sivasothy, et al., 2006
Wong, K.C.; Sivasothy, Y.; Boey, P.L.,
Essential oil of Elettariopsis elan C.K. Lim,
Flavour Fragr. J., 2006, 21, 3, 562-564, https://doi.org/10.1002/ffj.1654
. [all data]
Yadegarinia, Gachkar, et al., 2006
Yadegarinia, D.; Gachkar, L.; Rezaei, M.B.; Taghizadeh, M.; Astaneh, S.A.; Rasooli, I.,
Biochemical activities of Iranian Mentha piperita L. and Myrtus communis L. essential oils,
Phytochemistry, 2006, 67, 12, 1249-1255, https://doi.org/10.1016/j.phytochem.2006.04.025
. [all data]
Ahuja, Bakshi, et al., 2005
Ahuja, A.; Bakshi, S.K.; Sharma, S.K.; Thappa, R.K.; Agarwal, S.G.; Kichlu, S.K.; Paul, R.; Kaul, M.K.,
Production of volatile terpenes by proliferating shoots and micropropagated plants of Santolina chamaecyparissus L. (cotton lavender),
Flavour Fragr. J., 2005, 20, 4, 403-406, https://doi.org/10.1002/ffj.1440
. [all data]
Askari and Sefidkon, 2005
Askari, F.; Sefidkon, F.,
Volatile components of Pimpinella tragium Vill. from Iran,
Iran. J. Pharm. Res., 2005, 2, 117-120. [all data]
Basta, Tzakou, et al., 2005
Basta, A.; Tzakou, O.; Couladis, M.,
Composition of the leaves essential oil of Melissa officinalis s. l. from Greece,
Flavour Fragr. J., 2005, 20, 6, 642-644, https://doi.org/10.1002/ffj.1518
. [all data]
Bendimerad and Bendiab, 2005
Bendimerad, N.; Bendiab, S.A.T.,
Composition and antibacterial activity of Pseudocytisus integrifolius (Salisb.) essential oil from Algeria,
J. Agric. Food Chem., 2005, 53, 8, 2947-2952, https://doi.org/10.1021/jf047937u
. [all data]
Bos, Stojanova, et al., 2005
Bos, R.; Stojanova, A.; Woerdenbag, H.J.; Koulman, A.; Quax, W.J.,
Volatile components of the aerial parts of Artemisia pontica L. grown in Bulgaria,
Flavour Fragr. J., 2005, 20, 2, 145-148, https://doi.org/10.1002/ffj.1399
. [all data]
Busman, Zoghbi, et al., 2005
Busman, D.V.; Zoghbi, M.G.B.; Potiguara, R.C.V.; Andrade, E.H.A.,
Volatiles from different organs of Unxia camphorata L. f. growing wild in the Amazon,
Biochem. Syst. Ecol., 2005, 33, 12, 1269-1273, https://doi.org/10.1016/j.bse.2005.07.001
. [all data]
Cégiéla-Carlioz, Bessière, et al., 2005
Cégiéla-Carlioz, P.; Bessière, J.-M.; David, B.; Mariotte, A.-M.; Gibbons, S.; Dijoux-Franca, M.-G.,
Modulation of multi-drug resistance (MDR) in Staphylococcus aureus by Osha (Ligusticum porteri L., Apiaceae) essential oil compounds,
Flavour Fragr. J., 2005, 20, 6, 671-675, https://doi.org/10.1002/ffj.1584
. [all data]
Chagonda and Chalchat, 2005
Chagonda, L.S.; Chalchat, J.-C.,
The essential oil of wild and cultivated Hoslundia opposita Vahl. from Zimbabwe,
Flavour Fragr. J., 2005, 20, 2, 193-195, https://doi.org/10.1002/ffj.1402
. [all data]
Chaverri and Cicció, 2005
Chaverri, C.; Cicció, J.F.,
Essential oil of trees of the genus Ocotea (Lauraceae) in Costa Rica. I. Ocotea brenesii,
Rev. Biol. Trop., 2005, 53, 3-4, 431-436, https://doi.org/10.15517/rbt.v53i3-4.14611
. [all data]
Chalchat and Özcan, 2005
Chalchat, J.-C.; Özcan, M.,
Constituents of the essential oil of Sideritis erythantha Boiss. Heldr. Var. erythrantha,
Gen. Appl. Plant Physiology, 2005, 31, 1-2, 65-70. [all data]
Cornu, Kondjoyan, et al., 2005
Cornu, A.; Kondjoyan, N.; Martin, B.; Verdier-Metz, I.; Pradel, P.; Berdague, J.-L.; Coulon, J.-B.,
Terpene profiles in Cantal and Saint-Nectairetype cheese made from raw or pasteurised milk,
J. Sci. Food Agric., 2005, 85, 12, 2040-2046, https://doi.org/10.1002/jsfa.2214
. [all data]
Dohou, Yamni, et al., 2005
Dohou, N.; Yamni, K.; Badoc, A.; Tahrouch, S.; Idrissi Hassani, L.M.; Bessière, J.-M.,
Composés volatils de Thymelaea lythroides, endémique, ibéro-marocaine,
Bull. Soc. Pharm. Bordeaux, 2005, 144, 63-70. [all data]
Dötterl, Wolfe, et al., 2005
Dötterl, S.; Wolfe, L.M.; Jürgens, A.,
Qualitative and quantitative analyses of flower scent in Silene latifolia,
Phytochemistry, 2005, 66, 2, 203-213, https://doi.org/10.1016/j.phytochem.2004.12.002
. [all data]
Duarte, Figueira, et al., 2005
Duarte, M.C.T.; Figueira, G.M.; Sartoratto, A.; Rehder, V.L.G.; Delarmelina, C.,
Anti-Candida activity of Brazilian medicinal plants,
J. Ethnopharmacol., 2005, 97, 2, 305-311, https://doi.org/10.1016/j.jep.2004.11.016
. [all data]
Facundo, Pinto, et al., 2005
Facundo, V.A.; Pinto, A.C.; Rezende, C.M.,
Aroma compounds and volatile chemical composition of Ruellia menthoides (Nees) Hiern,
Flavour Fragr. J., 2005, 20, 1, 93-95, https://doi.org/10.1002/ffj.1380
. [all data]
Fakhari, Salehi, et al., 2005
Fakhari, A.R.; Salehi, P.; Heydari, R.; Ebrahimi, S.N.; Haddad, P.R.,
Hydrodistillation-headspace solvent microextraction, a new method for analysis of the essential oil components of Lavandula angustifolia Mill.,
J. Chromatogr. A, 2005, 1098, 1-2, 14-18, https://doi.org/10.1016/j.chroma.2005.08.054
. [all data]
Fakhari A.R., Sonboli A., et al., 2005
Fakhari A.R.; Sonboli A.; Heydari R.,
Composition of the essential oil of Rhabdosciadium strausii from Iran,
Chem. Nat. Compd. (Engl. Transl.), 2005, 41, 4, 413-414, https://doi.org/10.1007/s10600-005-0164-1
. [all data]
Ferraz, Limberger, et al., 2005
Ferraz, A.B.F.; Limberger, R.P.; Bordignon, S.A.L.; von Poser, G.L.; Henriques, A.T.,
Essential oil composition of six Hypericum species from southern Brazil,
Flavour Fragr. J., 2005, 20, 3, 335-339, https://doi.org/10.1002/ffj.1435
. [all data]
Fernandez, Lizzani-Cuvelier, et al., 2005
Fernandez, X.; Lizzani-Cuvelier, L.; Loiseau, A.-M.; Perichet, C.; Delbecque, C.; Arnaudo, J.-F.,
Chemical composition of the essential oils from Turkish and Honduras Styrax,
Flavour Fragr. J., 2005, 20, 1, 70-73, https://doi.org/10.1002/ffj.1370
. [all data]
Ferretti, Maggi, et al., 2005
Ferretti, G.; Maggi, F.; Tirillini, B.,
Essential oil composition of Hypericum richeri Vill. from Italy,
Flavour Fragr. J., 2005, 20, 3, 295-298, https://doi.org/10.1002/ffj.1412
. [all data]
Figuérédo, Cabassu, et al., 2005
Figuérédo, G.; Cabassu, P.; Chalchat, J.-C.; Pasquier, B.,
Studies of Mediterranean oregano populations- V. Chemical composition of essential oils of oregano: Origanum syriacum L. var. bevanii (Holmes) Ietswaart, O. syriacum L. var. sinaicum (Boiss.) Ietswaart, and O. syriacum L. var. syriacum from Lebanon and Israel,
Flavour Fragr. J., 2005, 20, 164-168. [all data]
Ghasemi Y., Faridi P., et al., 2005
Ghasemi Y.; Faridi P.; Mehregan I.; Mohagheghzadeh A.,
Ferula gummosa fruits: An aromatic antimicrobial agent,
Chem. Nat. Compd. (Engl. Transl.), 2005, 41, 3, 311-314, https://doi.org/10.1007/s10600-005-0138-3
. [all data]
Jassbi, Mehrdad, et al., 2005
Jassbi, A.R.; Mehrdad, M.; Soleimani, M.; Mirzaeian, M.; Sonboli, A.,
Chemical composition of the essential oils of Bunium elegans and Bunium caroides,
Chem. Nat. Compd. (Engl. Transl.), 2005, 41, 4, 415-417, https://doi.org/10.1007/s10600-005-0165-0
. [all data]
Jirovetz, Buchbauer, et al., 2005
Jirovetz, L.; Buchbauer, G.; Stoyanova, A.; Georgiev, E.V.; Damianova, S.T.,
Composition, quality control and antimicrobial activity of the essential oil of cumin (Cuminum cyminumL.) seeds from Bulgaria that had been stored for up to 36 years,
Int. J. Food Sci. Technol., 2005, 40, 3, 305-310, https://doi.org/10.1111/j.1365-2621.2004.00915.x
. [all data]
Khanavi, Ghasemian, et al., 2005
Khanavi, M.; Ghasemian, L.; Motlagh, E.H.; Hadjiakhoondi, A.; Shafiee, A.,
Chemical composition of the essential oils of Marrubium parviflorum Fisch. C.A. Mey. and Marrubium vulgare L. from Iran,
Flavour Fragr. J., 2005, 20, 3, 324-326, https://doi.org/10.1002/ffj.1425
. [all data]
Khalighi-Sigaroodi, Hadijiakhoondi, et al., 2005
Khalighi-Sigaroodi, F.; Hadijiakhoondi, A.; Shahverdi, A.R.; Mozaffarian, V.-A.; Shafiee, A.,
Chemical composition and antimicrobial activity of the essential oil of Ferulago Bernardii Tomk. and M.Pimen.,
DARU, 2005, 13, 3, 100-104. [all data]
Khayyat and Karimi, 2005
Khayyat, M.H.; Karimi, H.,
Composition of the volatile oils of three different species of Artemisia,
Iranian Journal of Pharmaceutical Sciences, 2005, 1, 1, 29-32. [all data]
Khajeh, Yamini, et al., 2005
Khajeh, M.; Yamini, Y.; Bahramifar, N.; Sefidkon, F.; Reza Pirmoradei, M.,
Comparison of essential oils compositions of Ferula assa-foetida obtained by supercritical carbon dioxide extraction and hydrodistillation methods,
Food Chem., 2005, 91, 4, 639-644, https://doi.org/10.1016/j.foodchem.2004.06.033
. [all data]
Kowalski and Wolski, 2005
Kowalski, R.; Wolski, T.,
The chemical composition of essential oils of Silphium perfoliatum L.,
Flavour Fragr. J., 2005, 20, 3, 306-310, https://doi.org/10.1002/ffj.1418
. [all data]
Kowalski, 2005
Kowalski, R.,
Analysis of lipophylic fraction from leaves, inflorescences and rhizomes of Siphium perfoliatum L.,
Acta Soc. Botanicorum Poloniae, 2005, 74, 1, 5-10, https://doi.org/10.5586/asbp.2005.001
. [all data]
Krist, Stuebiger, et al., 2005
Krist, S.; Stuebiger, G.; Unterweger, H.; Bandion, F.; Buchbauer, G.,
Analysis of volatile compounds and triglycerides of seed oils extracted from different poppy varieties (Papaver somniferum L.),
J. Agric. Food Chem., 2005, 53, 21, 8310-8316, https://doi.org/10.1021/jf0580869
. [all data]
Leffingwell and Alford, 2005
Leffingwell, J.C.; Alford, E.D.,
Volatile constituents of Perique tobacco,
Electron. J. Environ. Agric. Food Chem., 2005, 4, 2, 899-915. [all data]
Marongiu, Piras, et al., 2005
Marongiu, B.; Piras, A.; Porcedda, S.; Scorciapino, A.,
Chemical composition of the essential oil and supercritical CO2 extract of Commiphora myrrha (Nees) Engl. and of Acorus calamus L.,
J. Agric. Food Chem., 2005, 53, 20, 7939-7943, https://doi.org/10.1021/jf051100x
. [all data]
Morteza-Semnani, Akbarzadeh, et al., 2005
Morteza-Semnani, K.; Akbarzadeh, M.; Moshiri, K.,
Essential oil composition of Artemisia fragrans Willd. from Iran,
Flavour Fragr. J., 2005, 20, 3, 330-331, https://doi.org/10.1002/ffj.1431
. [all data]
Morteza-Semnani, Akbarzadeh, et al., 2005, 2
Morteza-Semnani, K.; Akbarzadeh, M.; Rostami, B.,
The essential oil composition of Teucrium chamaedrys L. from Iran,
Flavour Fragr. J., 2005, 20, 5, 544-546, https://doi.org/10.1002/ffj.1479
. [all data]
Morteza-Semnani and Saeedi, 2005
Morteza-Semnani, K.; Saeedi, M.,
The essential oil composition of Phlomis bruguieri Desf. from Iran,
Flavour Fragr. J., 2005, 20, 3, 344-346, https://doi.org/10.1002/ffj.1459
. [all data]
Najafpour Navaei, Mirza, et al., 2005
Najafpour Navaei, M.; Mirza, M.; Dini, M.,
Chemical composition of the essential oil of Plumbago europaea L. roots from Iran,
Flavour Fragr. J., 2005, 20, 2, 213-214, https://doi.org/10.1002/ffj.1384
. [all data]
Ogunwande, Olawore, et al., 2005
Ogunwande, I.A.; Olawore, N.O.; Adeleke, K.A.; Ekundayo, O.,
Volatile constituents from the leaves of Eucalyptus cloeziana F. Muell and E. propinqua Deane Maiden from Nigeria,
Flavour Fragr. J., 2005, 20, 6, 637-639, https://doi.org/10.1002/ffj.1516
. [all data]
Olawore, Ogunwande, et al., 2005
Olawore, N.O.; Ogunwande, I.A.; Ekundayo, O.; Adeleke, K.A.,
Chemical composition of the leaf and fruit essential oils of Murraya paniculata (L.) Jack. (Syn. Murraya exotica Linn.),
Flavour Fragr. J., 2005, 20, 1, 54-56, https://doi.org/10.1002/ffj.1365
. [all data]
de Oliveira, Dias, et al., 2005
de Oliveira, R.N.; Dias, I.J.M.; Câmara, C.A.G.,
Estudo comparativo do óleo essencial de Eugenia punicifolia (HBK) DC. de diferentes localidades de Pernambuco,
Rev. Bras. Farmacogn., 2005, 15, 1, 39-43, https://doi.org/10.1590/S0102-695X2005000100009
. [all data]
Özel, Gögüs, et al., 2005
Özel, M.Z.; Gögüs, F.; Hamilton, J.F.; Lewis, A.C.,
Analysis of volatile components from Ziziphora taurica subsp. taurica by steam distillation, superheated-water extraction, and direct thermal desorption with GC×GC-TOFMS,
Anal. Bioanal. Chem., 2005, 382, 1, 115-119, https://doi.org/10.1007/s00216-005-3156-x
. [all data]
Palá-Paúl, Pérez-Alonso, et al., 2005
Palá-Paúl, J.; Pérez-Alonso, M.; Velasco-Negueruela, A.; Vadaré, J.; Villa, A.M.; Sanz, J.; Brophy, J.J.,
Analysis of the essential oil composition from the different parts of Eryngium glaciale Boiss. from Spain,
J. Chromatogr. A, 2005, 1094, 1-2, 179-182, https://doi.org/10.1016/j.chroma.2005.09.029
. [all data]
Pala-Paul, Perez-Alonso, et al., 2005
Pala-Paul, J.; Perez-Alonso, M.J.; Velasco-Negueruela, A.; Vadare, J.; Villa, A.M.; Sanz, J.; Brophy, J.J.,
Essential oil composition of the different parts of Eryngium bourgatii Gouan from Spain,
J. Chromatogr. A, 2005, 1074, 1-2, 235-239, https://doi.org/10.1016/j.chroma.2005.03.036
. [all data]
Petrakis, Roussis, et al., 2005
Petrakis, P.V.; Roussis, V.; Papadimitriou, D.; Vagias, C.; Tsitsimpikou, C.,
The effect of terpenoid extracts from 15 pine species on the feeding behavioural sequence of the late instars of the pine processionary caterpillar Thaumetopoea pityocampa,
Behav. Processes, 2005, 69, 3, 303-322, https://doi.org/10.1016/j.beproc.2004.12.008
. [all data]
Pino, Marbot, et al., 2005
Pino, J.A.; Marbot, R.; Rosado, A.; Vázquez, C.,
Volatile constituents of genipap (Genipa americana L.) fruit from Cuba,
Flavour Fragr. J., 2005, 20, 6, 583-586, https://doi.org/10.1002/ffj.1491
. [all data]
Pourmortazavi, Ghadiri, et al., 2005
Pourmortazavi, S.M.; Ghadiri, M.; Hajimirsadeghi, S.S.,
Supercritical fluid extraction of volatile components from Bunium persicum Boiss. (black cumin) and Mespilus germanica L. (medlar) seeds,
J. Food Comp. Anal., 2005, 18, 5, 439-446, https://doi.org/10.1016/j.jfca.2004.01.003
. [all data]
Rasooli and Owlia, 2005
Rasooli, I.; Owlia, P.,
Chemoprevention by thyme oils of Aspergillus parasiticus growth and aflatoxin production,
Phytochemistry, 2005, 66, 24, 2851-2856, https://doi.org/10.1016/j.phytochem.2005.09.029
. [all data]
Rohloff and Bones, 2005
Rohloff, J.; Bones, A.M.,
Volatile profiling of Arabidopsis thaliana - Putative olfactory compounds in plant communication,
Phytochemistry, 2005, 66, 16, 1941-1955, https://doi.org/10.1016/j.phytochem.2005.06.021
. [all data]
Saeidnia, Gohari, et al., 2005
Saeidnia, S.; Gohari, A.R.; Yassa, N.; Shafiee, A.,
Composition of the volatile oil of Achillea conferta DC. from Iran,
DARU, 2005, 13, 1, 34-36. [all data]
Safaei-Ghomi, Bamoniri, et al., 2005
Safaei-Ghomi, J.; Bamoniri, A.; Sarafraz, M.B.; Batooli, H.,
Volatile components from Artemisia scoparia Waldst et Kit growing in central Iran,
Flavour Fragr. J., 2005, 20, 6, 650-652, https://doi.org/10.1002/ffj.1520
. [all data]
Sajjadi S.E. and Eskandari B., 2005
Sajjadi S.E.; Eskandari B.,
Chemical constituents of the essential oil of Nepeta oxyodonta,
Chem. Nat. Compd. (Engl. Transl.), 2005, 41, 2, 175-177, https://doi.org/10.1007/s10600-005-0106-y
. [all data]
Sajjadi and Ghannadi, 2005
Sajjadi, S.-E.; Ghannadi, A.,
Essential oil of the Persian sage, Salvia rhytidea Benth.,
Acta Pharm. Sin., 2005, 55, 321-326. [all data]
Sajjadi, 2005
Sajjadi, S.E.,
Analysis of the essential oil of Nepeta sintenisii Bornm. from Iran,
DARU, 2005, 13, 2, 61-64. [all data]
Salehi, Sefidkon, et al., 2005
Salehi, P.; Sefidkon, F.; Bazzaz Tolami, L.; Sonboli, A.,
Essential oil composition of Salvia palaestina Benth. from Iran,
Flavour Fragr. J., 2005, 20, 5, 525-527, https://doi.org/10.1002/ffj.1448
. [all data]
Salehi, Sonboli, et al., 2005
Salehi, P.; Sonboli, A.; Eftekhar, F.; Nejad-Ebrahimi, S.; Yousefzadi, M.,
Essential Oil Composition, Antibacterial and Antioxidant Activity of the Oil and Various Extracts of Ziziphora clinopodioides subsp. rigida (BOISS.) RECH. f. from Iran,
Biol. Pharm. Bull., 2005, 28, 10, 1892-1896, https://doi.org/10.1248/bpb.28.1892
. [all data]
Sarkhail, Amin, et al., 2005
Sarkhail, P.; Amin, G.; Surmaghi, M.H.S.; Shafiee, A.,
Composition of the volatile oils of Phlomis lanceolata Boiss. Hohen., Phlomis anisodonta Boiss. and Phlomis bruguieri Desf. from Iran,
Flavour Fragr. J., 2005, 20, 3, 327-329, https://doi.org/10.1002/ffj.1427
. [all data]
Sefidkon and Jamzad, 2005
Sefidkon, F.; Jamzad, Z.,
Chemical composition of the essential oil of three Iranian Satureja species (S. mutica, S. macrantha and S. intermedia),
Food Chem., 2005, 91, 1, 1-4, https://doi.org/10.1016/j.foodchem.2004.01.027
. [all data]
Setzer, Noletto, et al., 2005
Setzer, W.N.; Noletto, J.A.; Lawton, R.O.; Haber, W.A.,
Leaf essential oil composition of five Zanthoxylum species from Monteverde, Costa Rica,
Molecular Diversity, 2005, 9, 1-3, 3-13, https://doi.org/10.1007/s11030-005-1298-6
. [all data]
da Silva, Andrade, et al., 2005
da Silva, M.H.L.; Andrade, E.H.A.; Mala, J.G.S.,
The essential oil of Pectis elongata Kunth occurring in north Brazil,
Flavour Fragr. J., 2005, 20, 5, 462-464, https://doi.org/10.1002/ffj.1546
. [all data]
Simoes-Pires C.A., Debenedetti S., et al., 2005
Simoes-Pires C.A.; Debenedetti S.; Spegazzini E.; Mentz L.A.; Matzenbacher N.I.; Limberger R.P.; Henriques A.T.,
Investigation of the essential oil from eight species of Baccharis belonging to sect. Caulopterae (Asteraceae, Astereae): a taxonomic approach,
Plant Systematics and Evolution, 2005, 253, 1-4, 23-32, https://doi.org/10.1007/s00606-005-0296-6
. [all data]
Skoula and Grayer, 2005
Skoula, M.; Grayer, R.J.,
Volatile oils of Coridothymus capitatus, Satureja thymbra, Satureja spinosa and Thymbra calostachya (Lamiaceae) from Crete,
Flavour Fragr. J., 2005, 20, 6, 573-576, https://doi.org/10.1002/ffj.1489
. [all data]
Slavkovska, Couladis, et al., 2005
Slavkovska, V.; Couladis, M.; Bojovic, S.; Tzakou, O.; Pavlovic, M.; Lakusic, B.; Jancic, R.,
Essential oil and its systematic significance in species of Micromeria Bentham from Serbia Montenegro,
Plant Systematics and Evolution, 2005, 255, 1-2, 1-15, https://doi.org/10.1007/s00606-005-0303-y
. [all data]
Sonboli A., Fakhari A.R., et al., 2005
Sonboli A.; Fakhari A.R.; Sefidkon F.,
Chemical composition of the essential oil of Salvia macilenta from Iran,
Chem. Nat. Compd. (Engl. Transl.), 2005, 41, 2, 168-170, https://doi.org/10.1007/s10600-005-0104-0
. [all data]
Sonboli, Salehi, et al., 2005
Sonboli, A.; Salehi, P.; Ebrahimi, S.N.,
Essential oil composition and antibacterial activity of the leaves of Stachys schtschegleevii from Iran,
Chem. Nat. Compd. (Engl. Transl.), 2005, 41, 2, 171-175, https://doi.org/10.1007/s10600-005-0105-z
. [all data]
Sonboli, Salehi, et al., 2005, 2
Sonboli, A.; Salehi, P.; Allahyari, L.,
Essential oil composition of Nepeta involucrata from Iran,
Chem. Nat. Compd. (Engl. Transl.), 2005, 41, 6, 683-685, https://doi.org/10.1007/s10600-006-0011-z
. [all data]
Srivastava, Srivastava, et al., 2005
Srivastava, A.K.; Srivastava, S.K.; Syamsundar, K.V.,
Bud and leaf essential oil composition of Syzygium aromaticum from India and Madagascar,
Flavour Fragr. J., 2005, 20, 1, 51-53, https://doi.org/10.1002/ffj.1364
. [all data]
Stevanovic, Garneau, et al., 2005
Stevanovic, T.; Garneau, F.-X.; Jean, F.-I.; Gagnon, H.; Vilotic, D.; Petrovic, S.; Ruzic, N.; Pichette, A.,
The essential oil composition of Pinus mugo Turra from Serbia,
Flavour Fragr. J., 2005, 20, 1, 96-97, https://doi.org/10.1002/ffj.1390
. [all data]
Tepe B., Sokmen M., et al., 2005
Tepe B.; Sokmen M.; Akpulat H.A.; Daferera D.; Polissiou M.; Sokmen A.,
Antioxidative activity of the essential oils of Thymus sipyleus subsp sipyleus var. sipyleus and Thymus sipyleus subsp sipyleus var. rosulans,
J. Food Eng., 2005, 66, 4, 447-454, https://doi.org/10.1016/j.jfoodeng.2004.04.015
. [all data]
Tesevic, Nikicevic, et al., 2005
Tesevic, V.; Nikicevic, N.; Jovanovic, A.; Djokovic, D.; Vujisic, L.; Vuckovic, I.; Bonic, M.,
Volatile components from old plum brandies,
Food Technol. Biotechnol., 2005, 43, 4, 367-372. [all data]
Topçu, Barla, et al., 2005
Topçu, G.; Barla, A.; Gören, A.C.; Bilsel, G.; Bilsel, M.; Tümen, G.,
Analysis of the essential oil composition of Sideritis albiflora using direct thermal desorption and headspace GC-MS techniques,
Turk. J. Chem., 2005, 29, 525-529. [all data]
Tzakou, Bazos, et al., 2005
Tzakou, O.; Bazos, I.; Yannitsaros, A.,
Essential oils of leaves, inflorescences and infructescences of spontaneous Cotinus coggygria Scop. from Greece,
Flavour Fragr. J., 2005, 20, 5, 531-533, https://doi.org/10.1002/ffj.1456
. [all data]
Urdampilleta, Amat, et al., 2005
Urdampilleta, J.D.; Amat, A.G.; Bidau, C.J.; Koslobsky, N.K.,
Biosystematic and chemosystematic studies in five South Americal species of Conyza (Asteraceae),
Bol. Soc. Argent. Bot., 2005, 40, 1-2, 101-107. [all data]
Velasco-Negueruela, Pérez-Alonso, et al., 2005
Velasco-Negueruela, A.; Pérez-Alonso, M.J.; Pérez de Paz, P.L.; Palá-Paúl, J.; Sanz, J.,
Analysis by gas chromatography-mass spectrometry of the essential oils from the aerial parts of Pimpinella anagodendron Bolle and Pimpinella rupicola Svent., two endemic species to the Canary Islands, Spain,
J. Chromatogr. A, 2005, 1095, 1-2, 180-184, https://doi.org/10.1016/j.chroma.2005.09.074
. [all data]
Velasco-Negueruela, Pérez-Alonso, et al., 2005, 2
Velasco-Negueruela, A.; Pérez-Alonso, M.J.; Palá-Paúl, J.; Iñigo, A.; López, G.,
The volatile oil composition of the berries of Juniperus macrocarpa Sibth. and Sm., gathered in Spain,
J. Essent. Oil Res., 2005, 17, 1, 61-63, https://doi.org/10.1080/10412905.2005.9698831
. [all data]
Vichi, Riu-Aumatell, et al., 2005
Vichi, S.; Riu-Aumatell, M.; Mora-Pons, M.; Buxaderas, S.; Lopez-Tamames, E.,
Characterization of Volatiles in Different Dry Gins,
J. Agric. Food Chem., 2005, 53, 26, 10154-10160, https://doi.org/10.1021/jf058121b
. [all data]
Wong, Lee, et al., 2005
Wong, K.C.; Lee, B.C.; Lam, N.F.; Ibrahim, P.,
Essential oils of the rhizomes of Alpinia conchigera Griff. and Alpinia latilabris Ridl.,
Flavour Fragr. J., 2005, 20, 4, 431-433, https://doi.org/10.1002/ffj.1458
. [all data]
Yayli, Yasar, et al., 2005
Yayli, N.; Yasar, A.; Gülec, C.; Usta, A.; Kolayli, S.; Coskuncelebi, K.; Karaoglu, S.,
Composition and antimicrobial activity of essential oils from Centaurea sessilis and Centaurea armena,
Phytochemistry, 2005, 66, 14, 1741-1745, https://doi.org/10.1016/j.phytochem.2005.04.006
. [all data]
Agnaniet, Menut, et al., 2004
Agnaniet, H.; Menut, C.; Bessière, J.-M.,
Aromatic plants of tropical central Africa. Part XLIX: chemical composition of essential oils of the leaf and rhizome of Aframomum giganteum K. Schum from Gabon,
Flavour Fragr. J., 2004, 19, 3, 205-209, https://doi.org/10.1002/ffj.1403
. [all data]
Agnihotri, Thappa, et al., 2004
Agnihotri, V.K.; Thappa, R.K.; Meena, B.; Kapahi, B.K.; Saxena, R.K.; Qazi, G.N.; Agarwal, S.G.,
Essential oil composition of aerial parts of Angelica glauca growing wild in North-West Himalaya (India),
Phytochemistry, 2004, 65, 16, 2411-2413, https://doi.org/10.1016/j.phytochem.2004.07.004
. [all data]
Blanc, Muselli, et al., 2004
Blanc, M.-C.; Muselli, A.; Bradesi, P.; Casanova, J.,
Chemical composition and variability of the essential oil of Inula graveolens from Corsica,
Flavour Fragr. J., 2004, 19, 4, 314-319, https://doi.org/10.1002/ffj.1304
. [all data]
Cakir, Kordali, et al., 2004
Cakir, A.; Kordali, S.; Zengin, H.; Izumi, S.; Hirata, T.,
Composition and antifungal activity of essential oils isolated from Hypericum hyssopifolium and Hypericum heterophyllum,
Flavour Fragr. J., 2004, 19, 1, 62-68, https://doi.org/10.1002/ffj.1279
. [all data]
Cavalli, Fernandez, et al., 2004
Cavalli, J.-F.; Fernandez, X.; Lizzani-Cievelier, L.; Loiseau, A.-M.,
Characterization of volatile compounds of French and Spanish virgin olive oil by HS-SPME: identification of quality-freshness markers,
Food Chem., 2004, 88, 1, 151-157, https://doi.org/10.1016/j.foodchem.2004.04.003
. [all data]
Choi, 2004
Choi, H.-S.,
Volatile constituents of satsuma mandarins growing in Korea,
Flavour Fragr. J., 2004, 19, 5, 406-412, https://doi.org/10.1002/ffj.1283
. [all data]
Cicció, 2004
Cicció, J.F.,
A source of almost pure methyl chavicol: volatile oil from the aerial parts of Tagetes lucida (Asteraceae) cultivated in Costa Rica,
Rev. Biol. Trop., 2004, 52, 4, 853-857, retrieved from http://www.tropiweb.com. [all data]
Gauvin, Ravaomanarivo, et al., 2004
Gauvin, A.; Ravaomanarivo, H.; Smadja, J.,
Comparative analysis by gas chromatography?mass spectrometry of the essential oils from bark and leaves of Cedrelopsis grevei Baill, an aromatic and medicinal plant from Madagascar,
J. Chromatogr. A, 2004, 1029, 1-2, 279-282, https://doi.org/10.1016/j.chroma.2003.12.012
. [all data]
Ghannadi, Sajjadi, et al., 2004
Ghannadi, A.; Sajjadi, S.E.; Kabouche, A.; Kabouche, Z.,
Thymus fontanesii Boiss. Reut. - A Potential Source of Thymol-Rich Essential Oil in North Africa,
Z. Naturforsch., 2004, 59c, 187-189. [all data]
Hajhashemi V., Ghannadi A., et al., 2004
Hajhashemi V.; Ghannadi A.; Jafarabadi H.,
Black cumin seed essential oil, as a potent analgesic and antiinflammatory drug,
Phytother. Res., 2004, 18, 3, 195-199, https://doi.org/10.1002/ptr.1390
. [all data]
bin Jantan, Ayop, et al., 2004
bin Jantan, I.; Ayop, N.; Mohd Ali, N.A.; Ahmad, A.S.; Yalvema, M.F.; Muhammad, K.; Azizi, A.R.,
The essential oils of Cinnamomum rhyncophyllum Miq. as natural sources of benzyl benzoate, safrole and methyl (E)-cinnamate,
Flavour Fragr. J., 2004, 19, 3, 260-262, https://doi.org/10.1002/ffj.1301
. [all data]
JAvidnia, Mojab, et al., 2004
JAvidnia, K.; Mojab, F.; Mojahedi, S.A.,
Chemical constituents of the essential oil of Stachys lavandulifolia Vahl from Iran,
Iranian J. Pharm. Res., 2004, 3, 61-63. [all data]
Jürgens and Dötterl, 2004
Jürgens, A.; Dötterl, S.,
Chemical composition of anther volatiles in Ranunculaceae: genera-specific profiles in Aemone, Aquilegia, Caltha, Pulsatilla, Ranunculus, and Trollius species,
American Journal of Botany, 2004, 91, 12, 1969-1980, https://doi.org/10.3732/ajb.91.12.1969
. [all data]
Kalvandi, Sefidkon, et al., 2004
Kalvandi, R.; Sefidkon, F.; Atri, M.; Mirza, M.,
Analysis of the essential oil of Thymus eriocalyx from Iran,
Flavour Fragr. J., 2004, 19, 4, 341-343, https://doi.org/10.1002/ffj.1312
. [all data]
Kalemba and Thiem, 2004
Kalemba, D.; Thiem, B.,
Constituents of the essential oils of four micropropagated Solidago species,
Flavour Fragr. J., 2004, 19, 1, 40-43, https://doi.org/10.1002/ffj.1271
. [all data]
Kilic, Hafizoglu, et al., 2004
Kilic, A.; Hafizoglu, H.; Kollmannsberger, H.; Nitz, S.,
Volatile constituents and key odorants in leaves, buds, flowers, and fruits of Laurus nobilis L.,
J. Agric. Food Chem., 2004, 52, 6, 1601-1606, https://doi.org/10.1021/jf0306237
. [all data]
Li and Jiang, 2004
Li, R.; Jiang, Z.-T.,
Chemical composition of the essential oil of Cuminum cyminum L. from China,
Flavour Fragr. J., 2004, 19, 4, 311-313, https://doi.org/10.1002/ffj.1302
. [all data]
paz Lima, Silva, et al., 2004
paz Lima, M.; Silva, T.M.D.; da Silva, J.D.; Zoghbi, M.G.B.; Andrade, E.H.A.,
Essential oil composition of leaf and fine stem of Aniba canelilla (Kunth) Mez from Manaus, Brazil.,
Acta Amazonica, 2004, 34, 2, 329-330, https://doi.org/10.1590/S0044-59672004000200019
. [all data]
Limberger, Sobral, et al., 2004
Limberger, R.P.; Sobral, M.; Henriques, A.T.; Menut, C.; Bessière, J.-M.,
Óleos voláteis de espécies de Myrcia nativas do rio grande do sul,
Quim. Nova, 2004, 27, 6, 916-919, https://doi.org/10.1590/S0100-40422004000600015
. [all data]
Lis, Boczek, et al., 2004
Lis, A.; Boczek, E.; Góra, J.,
Chemical composition of the essential oils from fruits, leaves and flowers of the Amur cork tree (Phellodendron amurense Rupr.),
Flavour Fragr. J., 2004, 19, 6, 549-553, https://doi.org/10.1002/ffj.1349
. [all data]
Lopez Arze, Collin, et al., 2004
Lopez Arze, J.B.; Collin, G.; Garneau, F.-X.; Jean, F.-I.; Gagnon, H.,
Essential oils from Bolivia. II. Asteraceae: Ophryosporus heptanthus (Wedd.) H. Rob. et King,
J. Essent. Oil Res., 2004, 16, 4, 374-376, https://doi.org/10.1080/10412905.2004.9698747
. [all data]
Malencic, Couladis, et al., 2004
Malencic, Dj.; Couladis, M.; Mimica-Dukic, N.; Popovic, M.; Boza, P.,
Essential oils of three Salvia species from the Pannonian part of Serbia,
Flavour Fragr. J., 2004, 19, 3, 225-228, https://doi.org/10.1002/ffj.1291
. [all data]
Marongiu, Piras, et al., 2004
Marongiu, B.; Piras, A.; Porcedda, S.,
Comparative analysis of the oil and supercritical CO2 extract of Elettaria cardamomum (L.) maton,
J. Agric. Food Chem., 2004, 52, 20, 6278-6282, https://doi.org/10.1021/jf034819i
. [all data]
Marongiu, Porcedda, et al., 2004
Marongiu, B.; Porcedda, A.P.S.; Casu, R.; Pierucci, P.,
Chemical composition of the oil and supercritical CO2 extract of Schinus molle L.,
Flavour Fragr. J., 2004, 19, 6, 554-558, https://doi.org/10.1002/ffj.1350
. [all data]
Mehrabani, Asadipour, et al., 2004
Mehrabani, M.; Asadipour, A.; Amoli, S.S.,
Chemical constituents of the essential oil of NEPETA DEPAUPERATA BENTH. from Iran,
DARu: Journal of Faculty of Pharmacy, 2004, 12, 98-100. [all data]
Mevy, Bessiere, et al., 2004
Mevy, J.P.; Bessiere, J.M.; Pelissier, Y.; Masotti, V.; Ruzzier, M.; Rabier, J.; Viano, J.,
Composition of the volatile constituents of the aerial parts of an endemic plant of Ivory Coast, Monanthotaxis capea (E.G. A. Camus) Verdc,
Flavour Fragr. J., 2004, 19, 6, 526-528, https://doi.org/10.1002/ffj.1329
. [all data]
Mimica-Dukic, Bozin, et al., 2004
Mimica-Dukic, N.; Bozin, B.; Sokovic, M.; Simin, N.,
Antimicrobial and antioxidant activities of Melissa officinalis L. (Lamiaceae) essential oil,
J. Agric. Food Chem., 2004, 52, 9, 2485-2489, https://doi.org/10.1021/jf030698a
. [all data]
Nik, Mirza, et al., 2004
Nik, Z.B.; Mirza, M.; Shahmir, F.,
Essential oil of Marrubium cuneatum Russell and its secretory elements,
Flavour Fragr. J., 2004, 19, 3, 233-235, https://doi.org/10.1002/ffj.1293
. [all data]
Orav, Stulova, et al., 2004
Orav, A.; Stulova, I.; Kailas, T.; Müürisepp, M.,
Effect of storage on the essential oil composition of piper nigrum L. fruits of different ripening states,
J. Agric. Food Chem., 2004, 52, 9, 2582-2586, https://doi.org/10.1021/jf030635s
. [all data]
Palá-Paúl, García-Jiménez, et al., 2004
Palá-Paúl, J.; García-Jiménez, R.; Pérez-Alonso, M.J.; Velasco-Negueruela, A.; Sanz, J.,
Essential oil composition of the leaves and stems of Meum athamanticum Jacq., from Spain,
J. Chromatogr. A, 2004, 1036, 2, 245-247, https://doi.org/10.1016/j.chroma.2004.02.064
. [all data]
Palá-Paúl, Velasco-Negueruela, et al., 2004
Palá-Paúl, J.; Velasco-Negueruela, A.; Pérez-Alonso, M.J.; Maqueda, J.; Sanz, J.,
Volatile oil constituents from different parts of Cachrys trifida L.,
J. Essent. Oil Res., 2004, 16, 4, 347-349, https://doi.org/10.1080/10412905.2004.9698738
. [all data]
Raal, Arak, et al., 2004
Raal, A.; Arak, E.; Orav, A.,
Chemical composition of coriander seed essential oil and their conformity with EP standards,
Agraarteadus, 2004, 15, 4, 234-239. [all data]
Raal, Paaver, et al., 2004
Raal, A.; Paaver, U.; Arak, E.; Orav, A.,
Content and composition of the essential oil of Thymus serpyllum L. growing wild in Estonia,
Medicina (Kaunas), 2004, 40, 8, 795-800. [all data]
Rasooli and Razzaghi Abyaneh, 2004
Rasooli, I.; Razzaghi Abyaneh, M.,
Inhibitory effects of Thyme oils on growth and aflatoxin production by Aspergillus parasiticus,
Food Control, 2004, 15, 6, 479-483, https://doi.org/10.1016/j.foodcont.2003.07.002
. [all data]
Rohloff, Mordal, et al., 2004
Rohloff, J.; Mordal, R.; Dragland, S.,
Chemotypical variation of tansy (Tanacetum vulgare L.) from 40 different locations in Norway,
J. Agric. Food Chem., 2004, 52, 6, 1742-1748, https://doi.org/10.1021/jf0352430
. [all data]
Rojas, Usubillaga, et al., 2004
Rojas, L.B.; Usubillaga, A.; Cegarra, J.A.; Borregales, E.; Carrero, Y.,
Composición Química y actividad antimicótica de el aceite Esenchial ede la Lepechinia schiedeane (Schlecht) vatke,
Rev. Fac. Farm., 2004, 46, 1, 27-30. [all data]
Royas, Usubillaga, et al., 2004
Royas, L.B.; Usubillaga, A.; Cegarra, J.A.; Borreagales, E.; Carrero, S.,
Composicion Quimica y Actividad Antimicotica de el Aceite Esensial de la Lepechinia schiedeana (Schlecht) Vatke,
Revista de la Facultad de Farmacia, 2004, 46, 1, 27-30. [all data]
Sadeghpour, Asghari, et al., 2004
Sadeghpour, O.; Asghari, G.; Ardekani, M.R.S.,
Composition of essential oil of Artemisia persica Boiss. from Iran,
Iran. J. Pharm. Res., 2004, 3, 65-67. [all data]
Sajjadi and Shahpiri, 2004
Sajjadi, S.E.; Shahpiri, Z.,
Chemical composition of the essential oil of Salvia limbata C.A.Mey,
DARU, 2004, 12, 3, 94-97. [all data]
Sarkhail, Amin, et al., 2004
Sarkhail, P.; Amin, G.; Shafiee, A.,
Composition of the essential oil of Phlomis persica Boiss and Phlomis chorassanica Bunge from Iran,
Flavour Fragr. J., 2004, 19, 6, 538-540, https://doi.org/10.1002/ffj.1338
. [all data]
Sawamura, Son, et al., 2004
Sawamura, M.; Son, U.-S.; Choi, H.-S.; Kim, M.-S.L.; Phi, N.T.L.; Fears, M.; Kumagai,
Compositional changes in commercial lemon essential oil for aromatherapy,
Int. J. Aromatherapy, 2004, 14, 1, 27-36, https://doi.org/10.1016/j.ijat.2004.02.001
. [all data]
Sawamura, Sou, et al., 2004
Sawamura, M.; Sou, U.-S.; Choi, H.-S.; Kim, M.-S.; Phi, N.T.L.; Fears, M.; Kumagai. C.,
Composition changes in commercial lemon essential oil for aromatherapy,
Int. J. Aromatherapy, 2004, 14, 1, 27-36, https://doi.org/10.1016/j.ijat.2004.02.001
. [all data]
Sefidkon, Jamzad, et al., 2004
Sefidkon, F.; Jamzad, Z.; Mirza, M.,
Chemical variation in the essential oil of Satureja sahendica from Iran,
Food Chem., 2004, 88, 3, 325-328, https://doi.org/10.1016/j.foodchem.2003.12.044
. [all data]
Sefidkon and Shaabani, 2004
Sefidkon, F.; Shaabani, A.,
Essential oil composition of Nepeta meyeri Benth. from Iran,
Flavour Fragr. J., 2004, 19, 3, 236-238, https://doi.org/10.1002/ffj.1294
. [all data]
Senatore, Napolitano, et al., 2004
Senatore, F.; Napolitano, F.; Mohamed, M.A.-H.; Harris, P.J.C.; MnKeni, P.N.S.; Henderson, J.,
Antibacterial activity of Tagetes minuta L. (Asteraceae) essential oil with different chemical composition,
Flavour Fragr. J., 2004, 19, 6, 574-578, https://doi.org/10.1002/ffj.1358
. [all data]
Senatore, Rigano, et al., 2004
Senatore, F.; Rigano, D.; de Fusco, R.; Bruno, M.,
Composition of the essential oil from flowerheads of Chrysanthemum coronarium L. (Asteraceae) growing wild in Southern Italy,
Flavour Fragr. J., 2004, 19, 2, 149-152, https://doi.org/10.1002/ffj.1285
. [all data]
Shafi, Nambiar, et al., 2004
Shafi, P.M.; Nambiar, M.K.G.; Clery, R.A.; Sarma, Y.R.; Veena, S.S.,
Composition and antifungal activity of the oil of Artemisia nilagirica (Clarke) Pamp,
J. Essent. Oil Res., 2004, 16, 4, 377-379, https://doi.org/10.1080/10412905.2004.9698748
. [all data]
Simic, Sokovic, et al., 2004
Simic, A.; Sokovic, M.D.; Ristic, M.; Grujic-Jovanovic, S.; Vukojevic, J.; Marin, P.D.,
The chemical composition of some Lauraceae essential oils and their antifungal activities,
Phytother. Res., 2004, 18, 9, 713-717, https://doi.org/10.1002/ptr.1516
. [all data]
Suyenaga, Apel, et al., 2004
Suyenaga, E.S.; Apel, M.A.; Chaves, C.G.; Zuanazzi, J.A.; Henriques, A.T.,
Essential oil composition of Heterothalamus psiadioides Less,
Biochem. Syst. Ecol., 2004, 32, 1, 83-86, https://doi.org/10.1016/S0305-1978(03)00190-X
. [all data]
Tellez, Khan, et al., 2004
Tellez, M.R.; Khan, I.A.; Schaneberg, B.T.; Crockett, S.L.; Rimando, A.M.; Kobaisy, M.,
Steam distillation-solid-phase microextraction for the detection of Ephedra sinica in herbal preparations,
J. Chromatogr. A, 2004, 1025, 1, 51-56, https://doi.org/10.1016/S0021-9673(03)01035-5
. [all data]
Thappa, Bakshi, et al., 2004
Thappa, R.K.; Bakshi, S.K.; Dhar, L.; Agarwal, S.G.; Kitchlu, S.; Kaul, M.K.; Suri, K.A.,
Significance of changed climatic factors on essential oil composition of Echinacea purpurea under subtropical conditions,
Flavour Fragr. J., 2004, 19, 5, 452-454, https://doi.org/10.1002/ffj.1352
. [all data]
Tirillini, Pellegrino, et al., 2004
Tirillini, B.; Pellegrino, R.; Bini, L.M.,
Essential oil composition of Stachys sylvatica L. from Italy,
Flavour Fragr. J., 2004, 19, 4, 330-332, https://doi.org/10.1002/ffj.1308
. [all data]
Vilaseca, Guy, et al., 2004
Vilaseca, A.; Guy, I.; Charles, B.; Guinaudeau, H.; de Arias, A.R.; Fournet, A.,
Chemical composition and insecticidal activity of Hedeoma mandoniana essential oils,
J. Essent. Oil Res., 2004, 16, 4, 380-383, https://doi.org/10.1080/10412905.2004.9698749
. [all data]
Wang, Guo, et al., 2004
Wang, H.; Guo, Y.; Zhang, Z.; An, D.,
Fast analysis of volatile compounds in natural essences by automatic Static-Headspace-GC-MS,
J. Instrum. Anal. (Chinese), 2004, 23, 1, 9-13. [all data]
Woerdenbag, Windono, et al., 2004
Woerdenbag, H.J.; Windono, T.; Bos, R.; Riswan, S.; Quax, W.J.,
Composition of the essential oils of Kaempferia rotunda L. and Kaempferia angustifolia Roscoe rhizomes from Indonesia,
Flavour Fragr. J., 2004, 19, 2, 145-148, https://doi.org/10.1002/ffj.1284
. [all data]
Yusufoglu, Celik, et al., 2004
Yusufoglu, A.; Celik, H.; Kirbaslar, G.,
Utilization of Lavandula angustifolia Miller extracts as natural repellents, pharmaceutical and industrial auxiliaries,
J. Serb. Chem. Soc., 2004, 69, 1, 1-7, https://doi.org/10.2298/JSC0401001Y
. [all data]
Afsharypuor and Jahromy, 2003
Afsharypuor, S.; Jahromy, M.M.,
Constituents of the essential oil from Tanacetum lingulatum (Boiss.) Bornm.,
J. Essent. Oil Res., 2003, 15, 2, 74-76, https://doi.org/10.1080/10412905.2003.9712069
. [all data]
Bertoli, Menichini, et al., 2003
Bertoli, A.; Menichini, F.; Mazzetti, M.; Spinelli, G.; Morelli, I.,
Volatile constituents of the leaves and flowers of Hypericum triquetrifolium Turra,
Flavour Fragr. J., 2003, 18, 2, 91-94, https://doi.org/10.1002/ffj.1161
. [all data]
Cabanillas, Lopez, et al., 2003
Cabanillas, C.M.; Lopez, M.L.; Daniele, G.; Zygadlo, J.A.,
Essential oil composition of Aloysia polystachya (Griseb.) Moldenke under rust disease,
Flavour Fragr. J., 2003, 18, 5, 446-448, https://doi.org/10.1002/ffj.1249
. [all data]
Choi, 2003, 2
Choi, H.-S.,
Characterization of citrus unshiu (C. unshiu Marcov. forma Miyagawa-wase) blossom aroma by solid-phase microextraction in conjunction with an electronic nose,
J. Agric. Food Chem., 2003, 51, 2, 418-423, https://doi.org/10.1021/jf0114280
. [all data]
Couladis, Özcan, et al., 2003
Couladis, M.; Özcan, M.; Tzakou, O.; Akgül, A.,
Comparative essential oil composition of various parts of the turpentine tree (Pistacia terebinthus L) growing wild in Turkey,
J. Sci. Food Agric., 2003, 83, 2, 136-138, https://doi.org/10.1002/jsfa.1295
. [all data]
Curini, Bianchi, et al., 2003
Curini, M.; Bianchi, A.; Epifano, F.; Bruni, R.; Torta, L.; Zambonelli, A.,
Composition and in vitro antifungal activity of essential oils of Erigeron canadensis and Myrtus communis from France,
Chem. Nat. Compd. (Engl. Transl.), 2003, 39, 2, 191-194, https://doi.org/10.1023/A:1024818015122
. [all data]
Dabiri and Sefidkon, 2003
Dabiri, M.; Sefidkon, F.,
Chemical composition of the essential oil of Nepeta racemosa Lam. from Iran,
Flavour Fragr. J., 2003, 18, 2, 157-158, https://doi.org/10.1002/ffj.1151
. [all data]
Dudai, Larkov, et al., 2003
Dudai, N.; Larkov, O.; Chaimovitsh, D.; Lewinsohn, E.; Freiman, L.; Ravid, U.,
Essential oil compounds of Origanum dayi Post,
Flavour Fragr. J., 2003, 18, 4, 334-337, https://doi.org/10.1002/ffj.1237
. [all data]
Ebrahimzadeh, Yamini, et al., 2003
Ebrahimzadeh, H.; Yamini, Y.; Sefidkon, F.; Chaloosi, M.; Pourmortazavi, S.M.,
Chemical composition of the essential oil and supercritical CO2 extracts of Zataria multiflora Boiss,
Food Chem., 2003, 83, 3, 357-361, https://doi.org/10.1016/S0308-8146(03)00096-7
. [all data]
Edris and Farrag, 2003
Edris, A.E.; Farrag, E.S.,
Antifungal activity of peppermint and sweet basil essential oils and their major aroma constituents on some plant pathogenic fungi from the vapor phase,
Nahrung/Food, 2003, 47, 2, 117-121, https://doi.org/10.1002/food.200390021
. [all data]
Edris, Shalaby, et al., 2003
Edris, A.E.; Shalaby, A.; Fadel, H.M.,
Effect of organic agriculture practices on the volatile aroma components of some essential oil plants growing in Egypt II: sweet Marjoram (Origanum marjorana L.) essential oil,
Flavour Fragr. J., 2003, 18, 4, 345-351, https://doi.org/10.1002/ffj.1235
. [all data]
Edris, Shalaby, et al., 2003, 2
Edris, A.E.; Shalaby, A.S.; Fadel, H.M.; Abdel-Wahab, M.A.,
Evaluation of a chemotype of spearmint (Mentha spicata L.) grown in Siwa Oasis, Egypt,
Eur. Food Res. Technol., 2003, 218, 1, 74-78, https://doi.org/10.1007/s00217-003-0802-4
. [all data]
Feizbaksh, Saber Tehrani, et al., 2003
Feizbaksh, A.; Saber Tehrani, M.; Rustaiyan, A.; Masoudi, S.,
Composition of the essential oil of Stachys lavandulifolia Vahl. from Iran,
J. Essent. Oil Res., 2003, 15, 2, 72-73, https://doi.org/10.1080/10412905.2003.9712068
. [all data]
Fekam Boyom, Amvam Zollo, et al., 2003
Fekam Boyom, F.; Amvam Zollo, P.H.; Agnaniet, H.; Menut, C.; Bessière, J.M.,
Aromatic plants of tropical central Africa. Part XLIII volatiles components from Uvariastrum pierreanum Engl. (Engl. Diels) growing in Cameroon,
Flavour Fragr. J., 2003, 18, 4, 296-298, https://doi.org/10.1002/ffj.1218
. [all data]
Fekam Boyom, Ngouana, et al., 2003
Fekam Boyom, F.; Ngouana, V.; Amvam Zollo, P.H.; Menut, C.; Bessiere, J.M.; Gut, J.; Rosenthal, P.J.,
Composition and anti-plasmodial activities of essential oils from some Cameroonian medicinal plants,
Phytochemistry, 2003, 64, 7, 1269-1275, https://doi.org/10.1016/j.phytochem.2003.08.004
. [all data]
Ghannadi, Aghazari, et al., 2003
Ghannadi, A.; Aghazari, F.; Mehrabani, M.; Mohagheghzadeh, A.; Mehregan, I.,
Quantity and composition of the SDE prepared essential oil of Nepeta macrosiphon Boiss,
Iran. J. Pharm. Res., 2003, 2, 103-105. [all data]
Ghasemi, Asghari, et al., 2003
Ghasemi, N.; Asghari, G.; Ardakani, M.S.; Siahpoush, A.,
Characterization of volatile constituents from aerial parts of varthemia persica DC (var. persica),
Iran. J. Pharm. Res., 2003, 2, 241-243. [all data]
Ghannadi and Zolfaghari, 2003
Ghannadi, A.; Zolfaghari, B.,
Compositional analysis of the essential oil of Lallemantia royleana (Benth. in Wall.) Benth. from Iran,
Flavour Fragr. J., 2003, 18, 3, 237-239, https://doi.org/10.1002/ffj.1215
. [all data]
Hajhashemi, Ghannadi, et al., 2003
Hajhashemi, V.; Ghannadi, A.; Sharif, B.,
Anti-inflammatory and analgesic properties of the leaf extracts and essential oil of Lavandula angustifolia Mill.,
J. Ethnopharmacol., 2003, 89, 1, 67-71, https://doi.org/10.1016/S0378-8741(03)00234-4
. [all data]
Jirovetz, Buchbauer, et al., 2003
Jirovetz, L.; Buchbauer, G.; Shafi, M.P.; Kaniampady, M.M.,
Chemotaxonomical analysis of the essential oil aroma compounds of four different Ocimumspecies from southern India,
Eur. Food Res. Technol., 2003, 217, 2, 120-124, https://doi.org/10.1007/s00217-003-0708-1
. [all data]
Jirovetz, Buchbauer, et al., 2003, 2
Jirovetz, L.; Buchbauer, G.; Stoyanova, A.S.; Georgiev, E.V.; Damianova, S.T.,
Composition, quality control, and antimicrobial activity of the essential oil of long-time stored dill (Anethum graveolens L.) seeds from Bulgaria,
J. Agric. Food Chem., 2003, 51, 13, 3854-3857, https://doi.org/10.1021/jf030004y
. [all data]
Jirovetz, Buchbauer, et al., 2003, 3
Jirovetz, L.; Buchbauer, G.; Shafi, M.P.; Leela, N.K.,
Analysis of the essential oils of the leaves, stems, rhizomes and roots of the medicinal plant Alpinia galanga from southern India,
Acta Pharm. Hung., 2003, 53, 73-81. [all data]
Juteau, Jerkovic, et al., 2003
Juteau, F.; Jerkovic, I.; Masotti, V.; Milos, M.; Mastelic, J.; Bessière, J.-M.; Viano, J.,
Composition and antimicrobial activity of the essential oil of Artemisia absinthium from Croatia and France,
Planta Medica, 2003, 69, 2, 158-161, https://doi.org/10.1055/s-2003-37714
. [all data]
Kambouche and El-Abed, 2003
Kambouche, N.; El-Abed, D.,
Composition of the volatile oil from the aerial parts of Trachyspermum ammi (L.) Sprague from Oran (Algeria),
J. Essent. Oil Res., 2003, 15, 1, 39-40, https://doi.org/10.1080/10412905.2003.9712259
. [all data]
Kanjilal, Kotoky, et al., 2003
Kanjilal, P.B.; Kotoky, R.; Singh, R.S.,
Chemical composition of the leaf oil of Altingia excelsa Nornha,
Flavour Fragr. J., 2003, 18, 5, 449-450, https://doi.org/10.1002/ffj.1250
. [all data]
Lago, de Ávila, et al., 2003
Lago, J.H.G.; de Ávila, P., Jr.; Moreno, P.R.H.; Limberger, R.P.; Apel, M.A.; Henriques, A.T.,
Analysis, comparison and variation on the chemical composition from the leaf volatile oil of Xylopia aromatica (Annonaceae),
Biochem. Syst. Ecol., 2003, 31, 6, 669-672, https://doi.org/10.1016/S0305-1978(02)00267-3
. [all data]
Limberger, Simões-Pires, et al., 2003
Limberger, R.P.; Simões-Pires, C.A.; Sobral, M.; Menut, C.; Bessiere, J.-M.; Henriques, A.T.,
Essential oils of six Gomidesia spp. from southern Brazil,
Flavour Fragr. J., 2003, 18, 2, 144-147, https://doi.org/10.1002/ffj.1122
. [all data]
Mahalwal and Ali, 2003
Mahalwal, V.S.; Ali, M.,
Volatile constituents of Cymbopogon nardus (Linn.) rendle,
Flavour Fragr. J., 2003, 18, 1, 73-76, https://doi.org/10.1002/ffj.1144
. [all data]
Maia, Taveira, et al., 2003
Maia, J.G.S.; Taveira, F.S.N.; Andrade, E.H.A.; da Silva, M.H.L.; Zoghbi, M.G.B.,
Essential oils of Lippia grandis Schau.,
Flavour Fragr. J., 2003, 18, 5, 417-420, https://doi.org/10.1002/ffj.1241
. [all data]
Marongiu, Porcedda, et al., 2003
Marongiu, B.; Porcedda, S.; Caredda, A.; de Gioannis, B.; Vargiu, L.; la Colla, P.,
Extraction of Juniperus oxycedrus ssp. Oxycedrus essential oil by supercritical carbon dioxide: influence of some process parameters and biological activity,
Flavour Fragr. J., 2003, 18, 5, 390-397, https://doi.org/10.1002/ffj.1224
. [all data]
Masotti, Juteau, et al., 2003
Masotti, V.; Juteau, F.; Bessière, J.M.; Viano, J.,
Seasonal and phenological variations of the essential oil from the narrow endemic species Artemisia molinieri and its biological activities,
J. Agric. Food Chem., 2003, 51, 24, 7115-7121, https://doi.org/10.1021/jf034621y
. [all data]
Mazloomifar, Saber-Tehrani, et al., 2003
Mazloomifar, H.; Saber-Tehrani, M.; Rustaiyan, A.; Masoudi, S.,
Chemical composition of the essential oil of Ajuga chamaecistus Ging. ssp. chamaecistus from Iran,
J. Essent. Oil Res., 2003, 15, 1, 17-18, https://doi.org/10.1080/10412905.2003.9712250
. [all data]
Mierendorff, Stahl-Biskup, et al., 2003
Mierendorff, H.-G.; Stahl-Biskup, E.; Posthumus, M.A.; van Beek, T.A.,
Composition of commercial Cape chamomile oil (Eriocephalus punctulatus),
Flavour Fragr. J., 2003, 18, 6, 510-514, https://doi.org/10.1002/ffj.1259
. [all data]
Mirza and Nik, 2003
Mirza, M.; Nik, Z.B.,
Volatile constituents of Phlomis olivieri Benth. from Iran,
Flavour Fragr. J., 2003, 18, 2, 131-132, https://doi.org/10.1002/ffj.1156
. [all data]
Mirza, Nik, et al., 2003
Mirza, M.; Nik, Z.B.; Dini, M.,
Chemical composition of the essential oils of astrodaucus orientalis (L.) Drude leaves and seeds,
Flavour Fragr. J., 2003, 18, 3, 205-206, https://doi.org/10.1002/ffj.1184
. [all data]
Mookdasanit, Tamura, et al., 2003
Mookdasanit, J.; Tamura, H.; Yoshizawa T.; Tokunaga T.; Nakanishi, K.,
Trace Volatile Compounds in Essential Oil of Citrus Sudachi by Means of Modified Solvent Extraction Method,
Food Sci Technol. Res., 2003, 9, 1, 54-61, https://doi.org/10.3136/fstr.9.54
. [all data]
Orav, Kailas, et al., 2003
Orav, A.; Kailas, T.; Jegorova, A.,
Composition of the essential oil of dill, celery, and parsley from Estonia,
Proc. Est. Acad. Sci. Chem., 2003, 52, 4, 147-154. [all data]
Oyedeji, Ekundayo, et al., 2003
Oyedeji, O.A.; Ekundayo, O.; König, W.A.,
Volatile leaf oil constituents of Lantana camara L. from Nigeria,
Flavour Fragr. J., 2003, 18, 5, 384-386, https://doi.org/10.1002/ffj.1206
. [all data]
Perez-Alonso, Velasco-Negueruela, et al., 2003
Perez-Alonso, M.J.; Velasco-Negueruela, A.; Palá-Paúl, J.; Sanz, J.,
Variations in the essential oil composition of Artemisia pedemontana gathered in Spain: chemotype camphor-1,8-cineole and chemotype davanone,
Biochem. Syst. Ecol., 2003, 31, 1, 77-84, https://doi.org/10.1016/S0305-1978(02)00082-0
. [all data]
Pino, Marbot, et al., 2003, 2
Pino, J.A.; Marbot, R.; Fuentes, V.,
Characterization of volatiles in Bullock's heart (Annona reticulata L.) fruit cultivars from Cuba,
J. Agric. Food Chem., 2003, 51, 13, 3836-3839, https://doi.org/10.1021/jf020733y
. [all data]
Pitarokili, Tzakou, et al., 2003
Pitarokili, D.; Tzakou, O.; Loukis, A.; Harvala, C.,
Volatile metabolites from Salvia fruticosa as antifungal agents in soilborne pathogens,
J. Agric. Food Chem., 2003, 51, 11, 3294-3301, https://doi.org/10.1021/jf0211534
. [all data]
Pourmortazavi, Sefidkon, et al., 2003
Pourmortazavi, S.M.; Sefidkon, F.; Hosseini, S.G.,
Supercritical carbon dioxide extraction of essential oils from Perovskia atriplicifolia Benth.,
J. Agric. Food Chem., 2003, 51, 18, 5414-5419, https://doi.org/10.1021/jf0341619
. [all data]
Priestap, van Baren, et al., 2003
Priestap, H.A.; van Baren, C.M.; Lira, P.D.L.; Coussio, J.D.; Bandoni, A.L.,
Volatile constituents of Aristolochia argentina,
Phytochemistry, 2003, 63, 2, 221-225, https://doi.org/10.1016/S0031-9422(02)00751-3
. [all data]
Raal, Arak, et al., 2003
Raal, A.; Arak, E.; Orav, A.; Ivask, K.,
Comparison of essential oil content of Matricaria recutita L. from different origins,
Ars Pharm., 2003, 44, 2, 159-165, retrieved from http://www.ugr.es/~ars/abstract/44-159-03.pdf. [all data]
Rasooli and Mirmostafa, 2003
Rasooli, I.; Mirmostafa, S.A.,
Bacterial susceptibility to and chemical composition of essential oils from Thymus kotschyanus and Thymus persicus,
J. Agric. Food Chem., 2003, 51, 8, 2200-2205, https://doi.org/10.1021/jf0261755
. [all data]
Rotman, Ahumada, et al., 2003
Rotman, A.; Ahumada, O.; Demo, M.S.; Oliva, M.M.; Turina, A.V.; López, M.L.; Zygadlo, J.A.,
Aromatic plants from Yungas. Part III. Composition and antimicrobial activity of Myrrhinium atropurpureum Schott var. octandrum Bentham essential oil,
Flavour Fragr. J., 2003, 18, 3, 211-214, https://doi.org/10.1002/ffj.1189
. [all data]
Sadraei, Ghannadi, et al., 2003
Sadraei, H.; Ghannadi, A.; Malekshahi, K.,
Composition of the essential oil of Asa-foetida and its spasmolytic action,
Saudi Pharmaceutical Journal, 2003, 11, 3, 136-140. [all data]
Sajjadi and Mehregan, 2003
Sajjadi, S.E.; Mehregan, I.,
Chemical composition of the essential oil of Prangos Asperula Boiss. subsp. haussknechtii (Boiss.) Hernst. et Heyn fruits, 2003, retrieved from http://www1.tums.ac.ir/daru/daru2%2020003/Dr%20Sajadi.PDF. [all data]
Sajjadi and Mehregan, 2003, 2
Sajjadi, S.E.; Mehregan, I.,
Composition of the essential oil of Stachys Iaxa Boiss. Buhse,
Iran. J. Pharm. Res., 2003, 57-58. [all data]
Santos and Cordeiro, 2003
Santos, J.G.S.; Cordeiro, M.S.C.,
Óleos essenciais da folha de Ambrosia artemisiifolia L., 2003, retrieved from http://www.sbq.org.br/ranteriores/23/resumos/0785-1. [all data]
Sebastian, Viallon-Fernandez, et al., 2003
Sebastian, I.; Viallon-Fernandez, C.; Berge, P.; Berdague, J.-L.,
Analysis of the volatile fraction of lamb fat tissue: influence of the type of feeding,
Sciences des Aliments, 2003, 23, 4, 497-511, https://doi.org/10.3166/sda.23.497-511
. [all data]
Sefidkon, Naderi Nik, et al., 2003
Sefidkon, F.; Naderi Nik, A.; Bagaii, P.; Javidtash, I.,
Analysis of the essential oil of Stachys ixodes Boiss. Hausskn. ex Boiss. from Iran,
Flavour Fragr. J., 2003, 18, 4, 301-302, https://doi.org/10.1002/ffj.1170
. [all data]
Shahmir, Ahmadi, et al., 2003
Shahmir, F.; Ahmadi, L.; Mirza, M.; Korori, S.A.A.,
Secretory elements of needles and berries of Juniperus communis L. ssp. communis and its volatile constituents,
Flavour Fragr. J., 2003, 18, 5, 425-428, https://doi.org/10.1002/ffj.1243
. [all data]
da Silva, Luz, et al., 2003
da Silva, J.D.; Luz, A.I.R.; da Silva, M.H.L.; Andrade, E.H.A.; Soghbi, M.G.B.; Maia, J.G.S.,
Essential oils of the leaves and stems of four Psidium spp.,
Flavour Fragr. J., 2003, 18, 3, 240-243, https://doi.org/10.1002/ffj.1219
. [all data]
Stashenko, Jaramillo, et al., 2003
Stashenko, E.E.; Jaramillo, B.E.; Martínez, J.R.,
Comparación de la composición química y de la actividad antioxidante in vitro de los metabolitos secundarios volátiles de plantas de la familia verbenaceae,
Rev. Acad. Colomb. Cienc. Exactas Fis. Nat., 2003, 27, 105, 579-597. [all data]
Taiwo and Bolanle, 2003
Taiwo, A.O.; Bolanle, A.A.,
The leaf essential oil of Costus afer Ker-Grawl from Nigeria,
Flavour Fragr. J., 2003, 18, 4, 309-311, https://doi.org/10.1002/ffj.1186
. [all data]
Taveira, de Lima, et al., 2003
Taveira, F.S.N.; de Lima, W.N.; Andrade, E.H.A.; Maia, J.G.S.,
Seasonal essential oil variation of Aniba canelilla,
Biochem. Syst. Ecol., 2003, 31, 1, 69-75, https://doi.org/10.1016/S0305-1978(02)00088-1
. [all data]
Tu, Onishi, et al., 2003
Tu, N.T.M.; Onishi, Y.; Son, U.S.; Ogawa, E.; Ukeda, H.; Sawamura, M.,
Characteristic odour components of Citrus inflata Hort. Ex Tanaka (Mochiyu) cold-pressed peel oil,
Flavour Fragr. J., 2003, 18, 5, 454-459, https://doi.org/10.1002/ffj.1252
. [all data]
Tu, Onishi, et al., 2003, 2
Tu, N.T.M.; Onishi, Y.; Choi, H.S.; Kondo, Y.; Ukeda, H.; Sawamura, M.,
Characteristic odour components of Citrus sp. (Kiyookadaidai) cold-pressed peel oil,
Flavour Fragr. J., 2003, 18, 6, 515-520, https://doi.org/10.1002/ffj.1260
. [all data]
Valette, Fernandez, et al., 2003
Valette, L.; Fernandez, X.; Poulain, S.; Loiseau, A.-M.; Lizzani-Cuvelier, L.; Levieil, R.; Restier, L.,
Volatile constituents from Romanesco cauliflower,
Food Chem., 2003, 80, 3, 353-358, https://doi.org/10.1016/S0308-8146(02)00272-8
. [all data]
Velasco-Negueruela, Pérez-Alonso, et al., 2003
Velasco-Negueruela, A.; Pérez-Alonso, M.J.; Pérez de Paz, P.L.; Palá-Paúl, J.; Sanz, J.,
Analysis by gas chromatography-mass spectrometry of the essential oils from the aerial parts of Rutheopsis herbanica (Bolle) Hans. Kunk., gathered in Fuerteventura (Canary Islands),
J. Chromatogr. A, 2003, 984, 1, 159-162, https://doi.org/10.1016/S0021-9673(02)01742-9
. [all data]
Velasco-Negueruela, Pérez-Alonso, et al., 2003, 2
Velasco-Negueruela, A.; Pérez-Alonso, M.J.; Pérez de Paz, P.L.; Palá-Paúl, J.; Sanz, J.,
Analysis by gas chromatography-mass spectrometry of the essential oil from the aerial parts of Pimpinella junoniae Ceb. Ort., gathered in La Gomera, Canary Islands, Spain,
J. Chromatogr. A, 2003, 1011, 1-2, 241-244, https://doi.org/10.1016/S0021-9673(03)01082-3
. [all data]
Velickovic, Randjelovic, et al., 2003
Velickovic, D.T.; Randjelovic, N.V.; Ristic, M.S.; Velickovic, A.S.; Smelcerovic, A.A.,
Chemical constituents and antimicrobial activity of the ethanol extracts obtained from the flower, leaf, and stem of Salvia officinalis L.,
J. Serb. Chem. Soc., 2003, 68, 1, 17-24, https://doi.org/10.2298/JSC0301017V
. [all data]
Velickovic, Ristic, et al., 2003
Velickovic, A.S.; Ristic, M.S.; Velickovic, D.T.; Ilic, S.; Mitic, N.D.,
The possibilities of the application of some species of sage (Salvia L.) as auxiliaries in the treatment of some diseases,
J. Serb. Chem. Soc., 2003, 68, 6, 435-445, https://doi.org/10.2298/JSC0306435V
. [all data]
Vichi, Castellote, et al., 2003
Vichi, S.; Castellote, A.I.; Pizzale, L.; Conte, L.S.; Buxaderas, S.; López-Tamames, E.,
Analysis of virgin olive oil volatile compounds by headspace solid-phase microextraction coupled to gas chromatography with mass spectrometric and flame ionization detection,
J. Chromatogr. A, 2003, 983, 1-2, 19-33, https://doi.org/10.1016/S0021-9673(02)01691-6
. [all data]
Vichi, Pizzale, et al., 2003
Vichi, S.; Pizzale, L.; Conte, L.S.; Buxaderas, S.; López-Tamames, E.,
Solid-phase microextraction in the analysis of virgin olive oil volatile fraction: characterization of virgin olive oils from two distinct geographical areas of Northern Italy,
J. Agric. Food Chem., 2003, 51, 22, 6572-6577, https://doi.org/10.1021/jf030269c
. [all data]
Yassa, Akhani, et al., 2003
Yassa, N.; Akhani, H.; Aqaahmadi, M.; Salimian, M.,
Essential oils from two endemic species of Apiaceae from Iran,
Z. Naturforsch. C:, 2003, 58, 459-463. [all data]
Zoghbi, Andrade, et al., 2003
Zoghbi, M.G.B.; Andrade, E.H.A.; da Silva, M.H.; Carreira, L.M.M.; Maia, J.G.S.,
Essential oils from three Myrcia species,
Flavour Fragr. J., 2003, 18, 5, 421-424, https://doi.org/10.1002/ffj.1242
. [all data]
Zrira, Elamrani, et al., 2003
Zrira, S.; Elamrani, A.; Benjilali, B.,
Chemical composition of the essential oil of Pistacia lentiscus L. from Morocco - a seasonal variation,
Flavour Fragr. J., 2003, 18, 6, 475-480, https://doi.org/10.1002/ffj.1221
. [all data]
Ahmadi, Mirza, et al., 2002
Ahmadi, L.; Mirza, M.; Shahmir, F.,
The volatile constituents of Artemisia marschaliana Sprengel and its secretory elements,
Flavour Fragr. J., 2002, 17, 2, 141-143, https://doi.org/10.1002/ffj.1055
. [all data]
Baher, Mirza, et al., 2002
Baher, Z.F.; Mirza, M.; Ghorbanli, M.; Rezaii, M.B.,
The influence of water stress on plant height, herbal and essential oil yield and composition in Satureja hortensis L.,
Flavour Fragr. J., 2002, 17, 4, 275-277, https://doi.org/10.1002/ffj.1097
. [all data]
Bos, Koulman, et al., 2002
Bos, R.; Koulman, A.; Woerdenbag, H.J.; Quax, W.J.; Pras, N.,
Volatile components from Anthriscus sylvestris (L.) Hoffm.,
J. Chromatogr. A, 2002, 966, 1-2, 233-238, https://doi.org/10.1016/S0021-9673(02)00704-5
. [all data]
Boyom, Keumedjio, et al., 2002
Boyom, F.F.; Keumedjio, F.; Dongmo, P.M.J.; Ngadjui, B.T.; Zollo, A.; Menut, C.; Bessiere, J.M.,
Essential oils from Croton zambesicus Muell. Arg. growing in Cameroon,
Flavour Fragr. J., 2002, 17, 3, 215-217, https://doi.org/10.1002/ffj.1081
. [all data]
Caredda, Marongiu, et al., 2002
Caredda, A.; Marongiu, B.; Porcedda, S.; Soro, C.,
Supercritical carbon dioxide extraction and characterization of Laurus nobilis essential oil,
J. Agric. Food Chem., 2002, 50, 6, 1492-1496, https://doi.org/10.1021/jf0108563
. [all data]
Cavaleiro, Salgueiro, et al., 2002, 2
Cavaleiro, C.; Salgueiro, L.; Barroso, J.G.; Figueiredo, A.C.; Pedro, L.G.; Fontinha, S.S.; Bighelli, A.; Casanova, J.; Looman, A.; Scheffer, J.J.C.,
Composition of the essential oil of Juniperus cedrus Webb and Berth. grown on Madeira,
Flavour Fragr. J., 2002, 17, 2, 111-114, https://doi.org/10.1002/ffj.1061
. [all data]
Cicció and Gómez-Laurito, 2002
Cicció, J.F.; Gómez-Laurito, J.,
Volatile constituents of the leaves of Siparuna thecaphora (Siparunaceae) from Turrialba, Costa Rica,
Rev. Biol. Trop., 2002, 50, 3/4, 963-967. [all data]
Cimanga, Apers, et al., 2002
Cimanga, K.; Apers, S.; de Bruyne, T.; van Miert, S.; Hermans, N.; Totté, J.; Pieters, L.; Vlietinck, A.J.,
Chemical composition and antifungal activity of essential oils of some aromatic medicinal plants growing in the democratic republic of Congo,
J. Essent. Oil Res., 2002, 14, 5, 382-387, https://doi.org/10.1080/10412905.2002.9699894
. [all data]
Congiu, Falconieri, et al., 2002
Congiu, R.; Falconieri, D.; Marongiu, B.; Piras, A.; Porcedda, S.,
Extraction and isolation of Pistacia lentiscus L. essential oil by supercritical CO2,
Flavour Fragr. J., 2002, 17, 4, 239-244, https://doi.org/10.1002/ffj.1095
. [all data]
Damon, Hernández, et al., 2002
Damon, A.A.; Hernández, A.S.; Rojas, J.C.,
Analysis of the fragrance produced by the epiphytic orchid Anathallis (Pleurothallis) racemiflora (orchidaceae) in the Soconusco region, Chiapas, Mexico,
Lindleyana, 2002, 17, 2, 93-97. [all data]
Das, Ram, et al., 2002
Das, M.; Ram, G.; Singh, A.; Mallavarapu, G.R.; Ramesh, S.; Ram, M.; Kumar, S.,
Volatile constituents of different plant parts of Chamomilla recutita L. Rausch grown in the Indo-Gangetic plains,
Flavour Fragr. J., 2002, 17, 1, 9-12, https://doi.org/10.1002/ffj.1035
. [all data]
Farah, Fechtal, et al., 2002
Farah, A.; Fechtal, M.; Chaouch, A.,
Effet de l'hybridation interspécifique sur la teneur et la composition chimique des huiles essentielles d'eucalyptus cultivés au Maroc,
Biotechnol. Agron. Soc. Environ., 2002, 6, 3, 163-169. [all data]
Farah, Fechtal. M., et al., 2002
Farah, A.; Fechtal. M.; Chaouch, A.; Zrira, S.,
The essential oils of Eucalyptus camaldulensis and its natural hybrid (clone 583) from Morocco,
Flavour Fragr. J., 2002, 17, 5, 395-397, https://doi.org/10.1002/ffj.1114
. [all data]
Flamini, Ertugrul, et al., 2002
Flamini, G.; Ertugrul, K.; Cioni, P.L.; Morelli, I.; Dural, H.; Bagci, Y.,
Volatile constituents of two endemic Centaurea species from Turkey: C. pseudoscabiosa subsp. pseudoscabiosa and C. hadimensis,
Biochem. Syst. Ecol., 2002, 30, 10, 953-959, https://doi.org/10.1016/S0305-1978(02)00043-1
. [all data]
Gancel, Ollé, et al., 2002
Gancel, A.-L.; Ollé, D.; Ollitrault, P.; Luro, F.; Brillouet, J.-M.,
Leaf and peel volatile compounds of an interspecific citrus somatic hybrid [Citrus aurantifolia (Christm.) Swing. + Citrus paradisi Macfayden],
Flavour Fragr. J., 2002, 17, 6, 416-424, https://doi.org/10.1002/ffj.1119
. [all data]
Ghannadi, Sajjadi, et al., 2002
Ghannadi, A.; Sajjadi, S.E.; Beigihasan, A.,
Composition of the essential oil of Ferula ovina (Boiss.) Boiss. from Iran,
DARU, 2002, 10, 4, 165-167, retrieved from http://www1.tums.ac.ir/daru/Daru4%202002/Ghannadi.PDF. [all data]
Hayes R.A., Richardson B.J., et al., 2002
Hayes R.A.; Richardson B.J.; Claus S.C.; Wyllie S.G.,
Semiochemicals and social signaling in the wild European rabbit in Australia: II. Variations in chemical composition of chin gland secretion across sampling sites,
J. Chem. Ecol., 2002, 28, 12, 2613-2625, https://doi.org/10.1023/A:1021452623055
. [all data]
Iñigo, Palá-Paúl, et al., 2002
Iñigo, A.; Palá-Paúl, J.; Pérez-Alonso, M.J.; Velasco-Negueruela, A.,
Essential oil composition from the aerial parts of Haplophyllum linifolium (L.) G. Don fil.,
Botanica Complutensis, 2002, 26, 79-83. [all data]
Isidorov and Jdanova, 2002
Isidorov, V.; Jdanova, M.,
Volatile organic compounds from leaves litter,
Chemosphere, 2002, 48, 9, 975-979, https://doi.org/10.1016/S0045-6535(02)00074-7
. [all data]
Jirovetz, Buchbauer, et al., 2002
Jirovetz, L.; Buchbauer, G.; Ngassoum, M.B.; Geissler, M.,
Aroma compound analysis of Piper nigrum and Piper guineense essential oils from Cameroon using solid-phase microextraction-gas chromatography, solid-phase microextraction-gas chromatography-mass spectrometry and olfactometry,
J. Chromatogr. A, 2002, 976, 1-2, 265-275, https://doi.org/10.1016/S0021-9673(02)00376-X
. [all data]
Jirovetz, Ngassoum, et al., 2002
Jirovetz, L.; Ngassoum, M.B.; Geissler, M.,
Analysis of the headspace aroma compounds of the seeds of the Cameroonian garlic plant Hua gabonii using SPME/GC/FID, SPME/GC/MS and olfactometry,
Eur. Food Res. Technol., 2002, 214, 3, 212-215, https://doi.org/10.1007/s00217-001-0481-y
. [all data]
Juteau, Masotti, et al., 2002
Juteau, F.; Masotti, V.; Bessière, J.-M.,
Compositional characteristics of the essential oil of Artemisia campestris var. glutinosa,
Biochem. Syst. Ecol., 2002, 30, 11, 1065-1070, https://doi.org/10.1016/S0305-1978(02)00052-2
. [all data]
Khallouki, Younos, et al., 2002
Khallouki, F.; Younos, C.; Soulimani, R.; Bessière, J.M.,
Chemical composition of the essential oils of Annona cuneata L. and Annona senegalensis Pers. stem barks,
Flavour Fragr. J., 2002, 17, 5, 398-400, https://doi.org/10.1002/ffj.1115
. [all data]
Kim and Lee, 2002
Kim, N.-S.; Lee, D.-S.,
Comparison of different extraction methods for the analysis of fragrances from Lavandula species by gas chromatography-mass spectrometry,
J. Chromatogr. A, 2002, 982, 1, 31-47, https://doi.org/10.1016/S0021-9673(02)01445-0
. [all data]
Kobaisy, Tellez, et al., 2002
Kobaisy, M.; Tellez, M.R.; Dayan, F.E.; Duke, S.O.,
Phytotoxicity and volatile constituents from leaves of Callicarpa japonica Thunb.,
Phytochemistry, 2002, 61, 1, 37-40, https://doi.org/10.1016/S0031-9422(02)00207-8
. [all data]
Krauze-Baranowska, Mardarowicz, et al., 2002
Krauze-Baranowska, M.; Mardarowicz, M.; Wiwart, M.; Poblocka, L.; Dynowska, M.,
Antifungal activity of the essential oils from some species of the genus Pinus,
Z. Naturforsch., 2002, 57c, 478-482. [all data]
Krauze-Baranowska, Mardarowicz, et al., 2002, 2
Krauze-Baranowska, M.; Mardarowicz, M.; Wiwart, M.,
The chemical composition of Microbiota decussata,
Z. Naturforsch. C:, 2002, 57c, 998-1003. [all data]
Kuiate, Bessière, et al., 2002
Kuiate, J.-R.; Bessière, J.-M.; Zollo, P.-H.A.,
Composition of the essential oils from three Laggera Spp. from Cameroon,
Flavour Fragr. J., 2002, 17, 2, 105-108, https://doi.org/10.1002/ffj.1057
. [all data]
Limberger, Simões-Pires, et al., 2002
Limberger, R.P.; Simões-Pires, C.; Sobral, M.; Menu, C.; Bessiere, J.-M.; Henriques, A.T.,
Essential oils from some Myrceugenia species (Myrtaceae),
Flavour Fragr. J., 2002, 17, 5, 341-344, https://doi.org/10.1002/ffj.1113
. [all data]
Lin, Rouseff, et al., 2002
Lin, J.; Rouseff, R.L.; Barros, S.; Naim, M.,
Aroma composition changes in early season grapefruit juice produced from thermal concentration,
J. Agric. Food Chem., 2002, 50, 4, 813-819, https://doi.org/10.1021/jf011154g
. [all data]
Lockwood, Asghari, et al., 2002
Lockwood, G.B.; Asghari, G.; Hakimi, B.,
Production of essential oil constituents by cultured cells of Carum copticum L.,
Flavour Fragr. J., 2002, 17, 6, 456-458, https://doi.org/10.1002/ffj.1129
. [all data]
Mahmout, Bessière, et al., 2002
Mahmout, Y.; Bessière, J.-M.; Dolmazon, R.,
Constituents of the essential oil of Cyperus maculatus Boëck,
J. Essent. Oil Res., 2002, 14, 4, 263-265, https://doi.org/10.1080/10412905.2002.9699848
. [all data]
Maia, da Silva, et al., 2002
Maia, J.G.S.; da Silva, M.H.L.; Andrade, E.H.A.; Zoghbi, M.G.B.; Carreira, L.M.M.,
Essential oils from Astronium urundeuva (Allemao) Engl. and A. fraxinifolium Schott ex Spreng.,
Flavour Fragr. J., 2002, 17, 1, 72-74, https://doi.org/10.1002/ffj.1046
. [all data]
Maia, Zoghbi, et al., 2002
Maia, J.G.S.; Zoghbi, M.G.B.; Andrade, E.H.A.; da Silva, M.H.L.; Luz, A.I.R.; da Silva, J.D.,
Essential oils composition of Eupatorium species growing wild in the Amazon,
Biochem. Syst. Ecol., 2002, 30, 11, 1071-1077, https://doi.org/10.1016/S0305-1978(02)00059-5
. [all data]
Menut, Bessière, et al., 2002
Menut, C.; Bessière, J.M.; Hassani, M.S.; Buchbauer, G.; Schopper, B.,
Chemical and biological studies of Ocotea comoriensis bark essential oil,
Flavour Fragr. J., 2002, 17, 6, 459-461, https://doi.org/10.1002/ffj.1130
. [all data]
Monfared, Davarani, et al., 2002
Monfared, A.; Davarani, S.S.H.; Rustaiyan, A.; Masoudi, S.,
Composition of the essential oil of Tanacetum balsamita L. ssp. balsamitoides (Schultz Bip.) Grierson from Iran,
J. Essent. Oil Res., 2002, 14, 1, 1-2, https://doi.org/10.1080/10412905.2002.9699741
. [all data]
Morteza-Semnani, Saeedi, et al., 2002
Morteza-Semnani, K.; Saeedi, M.; Vahedi, M.,
Volatile constituents of Iranian Hypericum perfloratum L.,
Oriental J. Chem., 2002, 18, 3, 443-444. [all data]
Norouzi-Arasi, Yavari, et al., 2002
Norouzi-Arasi, H.; Yavari, I.; Ghaffarzadeh, F.; Mortazavi, M.-S.,
Volatile constituents of Cymbopogon olivieri (Boiss.) Bor from Iran,
Flavour Fragr. J., 2002, 17, 4, 272-274, https://doi.org/10.1002/ffj.1096
. [all data]
Novak, Langbehn, et al., 2002
Novak, J.; Langbehn, J.; Pank, F.; Franz. C.M.,
Essential oil compounds in a historical sample of marjoram (Origanum majorana L., Lamiaceae),
Flavour Fragr. J., 2002, 17, 3, 175-180, https://doi.org/10.1002/ffj.1077
. [all data]
Orav, Kailas, et al., 2002
Orav, A.; Kailas, T.; Müürisepp, M.,
Composition of blackcurrant aroma isolated from leaves, buds, and berries of Ribes nigrum L.,
Proc. Est. Acad. Sci. Chem., 2002, 51, 4, 225-234. [all data]
Palá-Paúl, Pérez-Alonso, et al., 2002, 2
Palá-Paúl, J.; Pérez-Alonso, M.J.; Velasco-Negueruela, A.; Sanz, J.,
Analysis by gas chromatography-mass spectrometry of the volatile components of Ageratina adenophora Spreng., growing in the Canary Islands,
J. Chromatogr. A, 2002, 947, 2, 327-331, https://doi.org/10.1016/S0021-9673(02)00016-X
. [all data]
Phutdhawong, Korth, et al., 2002
Phutdhawong, W.; Korth, J.; Buddhasukh, D.; Pyne, S.G.,
Volatile components from Cephalotaxus griffithii growing in northern Thailand,
Flavour Fragr. J., 2002, 17, 2, 153-155, https://doi.org/10.1002/ffj.1064
. [all data]
Pino, Marbot, et al., 2002, 5
Pino, J.A.; Marbot, R.; Vazquez, C.,
Characterization of volatiles in Loquat fruit (Eriobotrya japonica Lindl.),
Revista CENIC Ciencias Quimicas, 2002, 33, 3, 115-119. [all data]
Priestap, van Baren, et al., 2002
Priestap, H.A.; van Baren, C.M.; Lira, P.D.L.; Prado, H.J.; Neugebauer, M.; Mayer, R.; Bandoni, A.L.,
Essential oils from aerial parts of Aristolochia gibertii Hook.,
Flavour Fragr. J., 2002, 17, 1, 69-71, https://doi.org/10.1002/ffj.1044
. [all data]
Ruberto, Biondi, et al., 2002
Ruberto, G.; Biondi, D.; Barbagallo, C.; Meli, R.; Savoca, F.,
Constituents of stem and flower oils of Helichrysum litoreum Guss.,
Flavour Fragr. J., 2002, 17, 1, 46-48, https://doi.org/10.1002/ffj.1037
. [all data]
Schwob, Bessière, et al., 2002
Schwob, I.; Bessière, J.-M.; Viano, J.,
Composition of the essential oils of Hypericum perforatum L. from southeastern France,
C.R. Acad. Sci. Ser. 3:, 2002, 325, 781-785. [all data]
Sefidkon, Dabiri, et al., 2002
Sefidkon, F.; Dabiri, M.; Alamshahi, A.,
Analysis of the essential oil of Nepeta fissa C.A. Mey from Iran,
Flavour Fragr. J., 2002, 17, 2, 89-90, https://doi.org/10.1002/ffj.1045
. [all data]
Sefidkon, Jalili, et al., 2002
Sefidkon, F.; Jalili, A.; Mirhaji, T.,
Essential oil composition of three Artemisia spp. from Iran,
Flavour Fragr. J., 2002, 17, 2, 150-152, https://doi.org/10.1002/ffj.1063
. [all data]
Sefidkon, 2002
Sefidkon, F.,
Essential oil of Lantana camara L. occurring in Iran,
Flavour Fragr. J., 2002, 17, 1, 78-80, https://doi.org/10.1002/ffj.1048
. [all data]
Velasco-Negueruela, Pérez-Alonso, et al., 2002
Velasco-Negueruela, A.; Pérez-Alonso, M.J.; de Paz, P.L.P.; Vallejo, C.G.; Palá-Paúl, J.; Iñigo, A.,
Chemical composition of the essential oils from the roots, fruits, leaves and stems of Pimpinella cumbrae link growing in the Canary Islands (Spain),
Flavour Fragr. J., 2002, 17, 6, 468-471, https://doi.org/10.1002/ffj.1131
. [all data]
Velasco-Negueruela, Pérez-Alonso, et al., 2002, 2
Velasco-Negueruela, A.; Pérez-Alonso, M.J.; Palá-Paúl, J.; Íñigo, A.; López, G.,
Leaf essential oils analysis of Juniperus navicularis Gandoger,
Botanica Complutensis, 2002, 26, 85-91. [all data]
Velickovic, Randjelovic, et al., 2002
Velickovic, D.T.; Randjelovic, N.V.; Ristic, M.S.; Smelcerovic, A.A.; Velickovic, A.S.,
Chemical composition and antimicrobial action of the ethanol extracts of Salvia pratensis L., Salvia glutinosa L. and Salvia aethiopis L.,
J. Serb. Chem. Soc., 2002, 67, 10, 639-646, https://doi.org/10.2298/JSC0210639V
. [all data]
Yamini, Sefidkon, et al., 2002
Yamini, Y.; Sefidkon, F.; Pourmortazavi, S.M.,
Comparison of essential oil composition of Iranian fennel (Foeniculum vulgare) obtained by supercritical carbon dioxide extraction and hydrodistillation methods,
Flavour Fragr. J., 2002, 17, 5, 345-348, https://doi.org/10.1002/ffj.1117
. [all data]
Zoghbi, Andrade, et al., 2002
Zoghbi, M.G.B.; Andrade, E.H.A.; da Silva, M.H.L.; Maia, J.G.S.,
Volatile constituents of Lippia lupulina Cham.,
Flavour Fragr. J., 2002, 17, 1, 29-31, https://doi.org/10.1002/ffj.1032
. [all data]
Zoghbi, Andrade, et al., 2002, 2
Zoghbi, M.G.B.; Andrade, E.H.A.; da Silva, M.H.; Maia, J.G.S.; Luz, A.I.R.; da Silva, J.D.,
Chemical variation in the essential oils of Hyptis crenata Pohl ex Benth.,
Flavour Fragr. J., 2002, 17, 1, 5-8, https://doi.org/10.1002/ffj.1031
. [all data]
Cherchi, Deidda, et al., 2001
Cherchi, G.; Deidda, D.; de Gioannis, B.; Marongiu, B.; Pompei, R.; Porcedda, S.,
Extraction of Santolina insularis essential oil by supercritical carbon dioxide: influence of some process parameters and biological activity,
Flavour Fragr. J., 2001, 16, 1, 35-43, https://doi.org/10.1002/1099-1026(200101/02)16:1<35::AID-FFJ942>3.0.CO;2-Y
. [all data]
Cornu, Carnat, et al., 2001
Cornu, A.; Carnat, A.-P.; Martin, B.; Coulon, J.-B.; Lamaison, J.-L.; Berdagué, J.-L.,
Solid-phase microextraction of volatile components from natural grassland plants,
J. Agric. Food Chem., 2001, 49, 1, 203-209, https://doi.org/10.1021/jf0008341
. [all data]
Dabiri and Sefidkon, 2001
Dabiri, M.; Sefidkon, F.,
Analysis of the essential oil from aerial parts of Perovskia atriplicifolia Benth. at different stages of plant growth,
Flavour Fragr. J., 2001, 16, 6, 435-438, https://doi.org/10.1002/ffj.988
. [all data]
Fernando and Grün, 2001
Fernando, L.N.; Grün, I.U.,
Headspace-SPME analysis of volatiles of the ridge gourd (Luffa acutangula) and bitter gourd (Momordica charantia) flowers,
Flavour Fragr. J., 2001, 16, 4, 289-293, https://doi.org/10.1002/ffj.999
. [all data]
Flamini, Cioni, et al., 2001
Flamini, G.; Cioni, P.L.; Morelli, I.; Maccioni, S.; Monti, G.,
Composition of the essential oil of Teucrium fruticans L. from the Maremma Regional Park (Tuscany, Italy),
Flavour Fragr. J., 2001, 16, 5, 367-369, https://doi.org/10.1002/ffj.1014
. [all data]
Friedrich, Acree, et al., 2001
Friedrich, J.E.; Acree, T.E.; Lavin, E.H.,
Selecting standards for gas chromatography - olfactometry,
Am. Chem. Soc. Symp. Ser., 2001, 782, 148-155. [all data]
Gallori, Bilia, et al., 2001
Gallori, S.; Bilia, A.R.; Mulinacci, N.; Bicchi, C.; Rubiolo, P.; Vincieri, F.F.,
Identification of volatile constituents of Tambourissa leptophylla,
Planta Medica, 2001, 67, 3, 290-292, https://doi.org/10.1055/s-2001-12001
. [all data]
Gallori, Flamini, et al., 2001
Gallori, S.; Flamini, G.; Bilia, A.R.; Morelli, I.; Landini, A.; Vincieri, F.F.,
Chemical composition of some traditional herbal drug preparations: essential oil and aromatic water of costmary (Balsamita suaveolens Pers.),
J. Agric. Food Chem., 2001, 49, 12, 5907-5910, https://doi.org/10.1021/jf0107656
. [all data]
Gupta, Mallavarapu, et al., 2001
Gupta, R.; Mallavarapu, G.R.; Banerjee, S.; Kumar, S.,
Characteristics of an isomenthone-rich somaclonal mutant isolated in a geraniol-rich rose-scented geranium accession of Pelargonium graveolens,
Flavour Fragr. J., 2001, 16, 5, 319-324, https://doi.org/10.1002/ffj.1002
. [all data]
Jacquemond-Collet, Bessière, et al., 2001
Jacquemond-Collet, I.; Bessière, J.-M.; Hannedouche, S.; Bertrand, C.; Fourasté, I.; Moulis, C.,
Identification of the alkaloids of Galipea officinalis by gas chromatography-mass spectrometry,
Phytochem. Anal., 2001, 12, 5, 312-319, https://doi.org/10.1002/pca.594
. [all data]
Jirovetz L., Buchbauer G., et al., 2001
Jirovetz L.; Buchbauer G.; Shafi P.M.; Rosamma M.K.; Geissler M.,
Analysis of the composition and aroma of the essential leaf oil of Syzygium travancoricum from South India by GC-FID, GC-MS, and olfactometry. Seasonal changes of composition,
Chromatographia Sup., 2001, 53, S1, s372-s374, https://doi.org/10.1007/BF02490359
. [all data]
Kalemba, Marschall, et al., 2001
Kalemba, D.; Marschall, H.; Bradesi, P.,
Constituents of the essential oil of Solidago gigantea Ait. (giant goldenrod),
Flavour Fragr. J., 2001, 16, 1, 19-26, https://doi.org/10.1002/1099-1026(200101/02)16:1<19::AID-FFJ940>3.0.CO;2-U
. [all data]
Kamath, Asha, et al., 2001
Kamath, A.; Asha, M.R.; Ravi, R.; Narasimhan, S.; Rajalakshmi, D.,
Comparative study of odour and GC-olfactometric profiles of selected essential oils,
Flavour Fragr. J., 2001, 16, 6, 401-407, https://doi.org/10.1002/ffj.1020
. [all data]
Kim and Lee, 2001
Kim, N.-S.; Lee, D.-S.,
Characterization of Rosemary fragrances by solid phase microextraction and GC-MS,
Analyt. Sci., 2001, 17, Supplement, a383-a386. [all data]
Lota, de Rocca Serra, et al., 2001
Lota, M.-L.; de Rocca Serra, D.; Tomi, F.; Casanova, J.,
Chemical variability of peel and leaf essential oils of 15 species of mandarins,
Biochem. Syst. Ecol., 2001, 29, 1, 77-104, https://doi.org/10.1016/S0305-1978(00)00029-6
. [all data]
Ly, Yamauchi, et al., 2001
Ly, T.N.; Yamauchi, R.; KAto, K.,
Volatile components of the essential oils in Galanga (Alpina officinarum Hance) from Vietnam,
Food Sci. Technol. Res., 2001, 7, 4, 303-306, https://doi.org/10.3136/fstr.7.303
. [all data]
Marongiu, Porcedda, et al., 2001
Marongiu, B.; Porcedda, S.; Porta, G.D.; Reverchon, E.,
Extraction and isolation of Salvia desoleana and Mentha spicata subsp. insularis essential oils by supercritical CO2,
Flavour Fragr. J., 2001, 16, 5, 384-388, https://doi.org/10.1002/ffj.1021
. [all data]
Mirza, Ahmadi, et al., 2001
Mirza, M.; Ahmadi, L.; Tayebi, M.,
Volatile constituents of Hymenocrater incanus Bunge, an Iranian endemic species,
Flavour Fragr. J., 2001, 16, 4, 239-240, https://doi.org/10.1002/ffj.983
. [all data]
Orav, Kailas, et al., 2001
Orav, A.; Kailas, T.; Ivask, K.,
Volatile constituents of Matricaria recutita L. from Estonia,
Proc. Est. Acad. Sci. Chem., 2001, 50, 39-45. [all data]
Orav and Kann, 2001
Orav, A.; Kann, J.,
Determination of peppermint and orange aroma compounds in food and beverages,
Proc. Est. Acad. Sci. Chem., 2001, 50, 4, 217-225. [all data]
Palá-Paúl, Pérez-Alonso, et al., 2001
Palá-Paúl, J.; Pérez-Alonso, M.J.; Velasco-Negueruela, A.; Palá-Paúl, R.; Sanz, J.; Conejero, Fco.,
Seasonal variation in chemical constituents of Santolina rosmarinifolia L. ssp. rosmarinifolia,
Biochem. Syst. Ecol., 2001, 29, 7, 663-672, https://doi.org/10.1016/S0305-1978(01)00032-1
. [all data]
Rousis, Papadogianni, et al., 2001
Rousis, V.; Papadogianni, K.; Vagias, C.; Harvala, C.; Petrakis, P.V.; Ortiz, A.,
Volatile constituents of three Pinus species grown in Greece,
J. Essent. Oil Res., 2001, 13, 2, 118-121, https://doi.org/10.1080/10412905.2001.9699632
. [all data]
Santos-Gomes and Fernandes-Ferreira, 2001
Santos-Gomes, P.C.; Fernandes-Ferreira, M.,
Organ- and season-dependent variation in the essential oil composition of Salvia officinalis L. cultivated at two different sites,
J. Agric. Food Chem., 2001, 49, 6, 2908-2916, https://doi.org/10.1021/jf001102b
. [all data]
Santos, Moreira, et al., 2001
Santos, P.R.; Moreira, D.L.; Guimaraes, E.F.; Kaplan, M.A.C.,
Essential oil analysis of 10 piperaceae species from the Brazilian Atlantic forest,
Phytochemistry, 2001, 58, 4, 547-551, https://doi.org/10.1016/S0031-9422(01)00290-4
. [all data]
Sayyah, Kamalinejad, et al., 2001
Sayyah, M.; Kamalinejad, M.; Hidage, R.B.; Rustaiyan, A.,
Antiepileptic potential and composition of the fruit essential oil of Ferula Gummosa boiss., 2001, retrieved from http://ibj.pasteur.ac.ir/ibj11/sayyah.htm. [all data]
Sayyah, Kamalinejad, et al., 2001, 2
Sayyah, M.; Kamalinejad, M.; Hidage, R.B.; Rustaiyan, A.,
Antiepileptic potential and composition of the fruit essential oil of Ferula Gummosa boiss,
Iranian Biomed J., 2001, 5, 2-3, 69-72. [all data]
Shang, Hu, et al., 2001
Shang, C.; Hu, Y.; Deng, C.; Hu, K.,
Rapid determination of volatile constituents of Michelia alba flowers by gas chromatography - mass spectrometry with solid-phase microextraction,
J. Chromatogr. A, 2001, 942, 1-2, 283-288, https://doi.org/10.1016/S0021-9673(01)01382-6
. [all data]
Tellez M., Estell R., et al., 2001
Tellez M.; Estell R.; Fredrickson E.; Powell J.; Wedge D.; Schrader K.; Kobaisy M.,
Extracts of Flourensia cernua (L): Volatile constituents and antifungal, antialgal, and antitermite bioactivities,
J. Chem. Ecol., 2001, 27, 11, 2263-2273, https://doi.org/10.1023/A:1012283005014
. [all data]
Vijayanand, Rao, et al., 2001
Vijayanand, P.; Rao, L.J.M.; Narasimham, P.,
Volatile flavour components of jamun fruit (Syzygium cumini L),
Flavour Fragr. J., 2001, 16, 1, 47-49, https://doi.org/10.1002/1099-1026(200101/02)16:1<47::AID-FFJ944>3.0.CO;2-L
. [all data]
Yang, 2001
Yang, R.,
Analysis of the volatile components in peel oil of Yuzu by gas chromatography/mass spectrometry,
Chin. J. Anal. Chem., 2001, 29, 3, 313-316. [all data]
Yang, 2001, 2
Yang, R.,
Volatile compounds in peel oil of Citrus sudachi,
Food Sci. (Beijing), 2001, 22, 3, 71-73. [all data]
Asekun and Ekundayo, 2000
Asekun, O.T.; Ekundayo, O.,
Essential oil constituents of Hyptis suaveolens (L.) Poit. (Bush tea) leaves from Nigeria,
J. Essent. Oil Res., 2000, 12, 227-230. [all data]
Bailac, Dellacasa, et al., 2000
Bailac, P.N.; Dellacasa, A.D.; Bernasconi, H.O.; Firpo, N.H.; Ponzi, M.I.,
Composicion del aceite esencial y actividad antimicrobiana de eupatorium patens,
Bol. Soc. Chil. Quim., 2000, 45, 207-211. [all data]
Baser, Özek, et al., 2000
Baser, K.H.C.; Özek, T.; Demirci, B.; Kürkcüoglu, M.; Aytac, Z.; Duman, H.,
Composition of the essential oils of Zosima absinthifolia (Vent.) Link and Ferula elaeochytris Korovin from Turkey,
Flavour Fragr. J., 2000, 15, 6, 371-372, https://doi.org/10.1002/1099-1026(200011/12)15:6<371::AID-FFJ919>3.0.CO;2-Z
. [all data]
Fraternale, Giamperi, et al., 2000
Fraternale, D.; Giamperi, L.; Ricci, D.; Manunta, A.,
Composition of the essential oil of Peucedanum verticillare,
Biochem. Syst. Ecol., 2000, 28, 2, 143-147, https://doi.org/10.1016/S0305-1978(99)00049-6
. [all data]
García, Martín, et al., 2000
García, C.; Martín, A.; Timón, M.L.; Córdoba, J.J.,
Microbial populations and volatile compounds in the 'bone taint' spoilage of dry cured ham,
Lett. Appl. Microbiol., 2000, 30, 1, 61-66, https://doi.org/10.1046/j.1472-765x.2000.00663.x
. [all data]
Health Safety Executive, 2000
Health Safety Executive,
MDHS 96 Volatile organic compounds in air - Laboratory method using pumed solid sorbent tubes, solvent desorption and gas chromatography
in Methods for the Determination of Hazardous Substances (MDHS) guidance, Crown, Colegate, Norwich, 2000, 1-24, retrieved from http://www.hse.gov.uk/pubns/mdhs/pdfs/mdhs96.pdf. [all data]
Jirovetz, Puschmann, et al., 2000
Jirovetz, L.; Puschmann, C.; Stojanova, A.; Metodiev, S.; Buchbauer, G.,
Analysis of the essential oil volatiles of Douglas fir (Pseudotsuga menziesii) from Bulgaria,
Flavour Fragr. J., 2000, 15, 6, 434-437, https://doi.org/10.1002/1099-1026(200011/12)15:6<434::AID-FFJ935>3.0.CO;2-0
. [all data]
Kim, Kim, et al., 2000
Kim, H.-J.; Kim, K.; Kim, N.-S.; Lee, D.-S.,
Determination of floral fragrances of Rosa hybrida using solid-phase trapping-solvent extraction and gas chromatography-mass spectrometry,
J. Chromatogr. A, 2000, 902, 2, 389-404, https://doi.org/10.1016/S0021-9673(00)00863-3
. [all data]
Lis-Balchin and Roth, 2000
Lis-Balchin, M.; Roth, G.,
Composition of the essential oils of Pelargonium odoratissimum, P. exstipulatum, and P. x fragrans (Geraniaceae) and their bioactivity,
Flavour Fragr. J., 2000, 15, 6, 391-394, https://doi.org/10.1002/1099-1026(200011/12)15:6<391::AID-FFJ929>3.0.CO;2-W
. [all data]
Maia, Zoghbi, et al., 2000
Maia, J.G.S.; Zoghbi, M.G.B.; Andrade, E.H.A.; da Silva, M.H.L.,
Essential oils from Conobea scoparioides (Cham. Schltdl.) Benth.,
Flavour Fragr. J., 2000, 15, 6, 413-414, https://doi.org/10.1002/1099-1026(200011/12)15:6<413::AID-FFJ931>3.0.CO;2-H
. [all data]
Mallavarapu, Rao, et al., 2000
Mallavarapu, G.R.; Rao, L.; Ramesh, S.,
Volatile constituents of the leaf and fruit oils of Murraya koenigii Spreng.,
L. Ess. Oil Res., 2000, 12, 6, 766-768, https://doi.org/10.1080/10412905.2000.9712211
. [all data]
Mitiku, Sawamura, et al., 2000
Mitiku, S.B.; Sawamura, M.; Itoh, T.; Ukeda, H.,
Volatile components of peel cold-pressed oils of two cultivars of sweet orange (Citrus sinensis (L.) Osbeck) from Ethiopia,
Flavour Fragr. J., 2000, 15, 4, 240-244, https://doi.org/10.1002/1099-1026(200007/08)15:4<240::AID-FFJ902>3.0.CO;2-F
. [all data]
Mohagheghzadeh, Shams-Ardakani, et al., 2000
Mohagheghzadeh, A.; Shams-Ardakani, M.; Ghannadi, A.,
Linalol-rich essential oil of Zataria multiflora Boiss. (Lamiaceae),
Flavour Fragr. J., 2000, 15, 2, 119-122, https://doi.org/10.1002/(SICI)1099-1026(200003/04)15:2<119::AID-FFJ878>3.0.CO;2-V
. [all data]
Mohagheghzadeh, Shams-Ardakani, et al., 2000, 2
Mohagheghzadeh, A.; Shams-Ardakani, M.; Ghannadi, A.,
Volatile constituents of callus and flower-bearing tops of Zataria multiflora Boiss. (Lamiaceae),
Flavour Fragr. J., 2000, 15, 6, 373-376, https://doi.org/10.1002/1099-1026(200011/12)15:6<373::AID-FFJ923>3.0.CO;2-9
. [all data]
Novak, Novak, et al., 2000
Novak, J.; Novak, S.; Bitsch, C.; Franz, C.M.,
Essential oil composition of underground parts of Valeriana celtica ssp. from Austria and Italy,
Flavour Fragr. J., 2000, 15, 1, 40-42, https://doi.org/10.1002/(SICI)1099-1026(200001/02)15:1<40::AID-FFJ863>3.0.CO;2-B
. [all data]
Senatore, Napolitano, et al., 2000
Senatore, F.; Napolitano, F.; Ozcan, M.,
Composition and antibacterial activity of the essential oil from Crithmum maritimum L. (Apiaceae) growing wild in Turkey,
Flavour Fragr. J., 2000, 15, 3, 186-189, https://doi.org/10.1002/1099-1026(200005/06)15:3<186::AID-FFJ889>3.0.CO;2-I
. [all data]
Tamura, Boonbumrung, et al., 2000
Tamura, H.; Boonbumrung, S.; Yoshizawa, T.; Varanyanond, W.,
Volatile components of the essential oil in the pulp of four yellow mangoes (Mangifera indica L.) in Thailand,
Food Sci. Technol. Res., 2000, 6, 1, 68-73, https://doi.org/10.3136/fstr.6.68
. [all data]
Tellez, Dayan, et al., 2000
Tellez, M.R.; Dayan, F.E.; Schrader, K.K.; Wedge, D.E.; Duke, S.O.,
Composition and some biological activities of the essential oils of Callicarpa Americana (L.),
J. Agric. Food Chem., 2000, 48, 7, 3008-3012, https://doi.org/10.1021/jf991026g
. [all data]
Ali N.A.M. and Jantan, 1999
Ali N.A.M.; Jantan, I.,
Essential oil of cinnamomum tahijanum kost. from sarawak,
ASEAN Review of BiodiversityEnvironment Conservation, 1999, November-December, 1-4. [all data]
Asekun and Ekundayo, 1999
Asekun, O.T.; Ekundayo, O.,
Constituents of the leaf essential oil of Cedrela odorata L. from Nigeria,
Flavour Fragr. J., 1999, 14, 6, 390-392, https://doi.org/10.1002/(SICI)1099-1026(199911/12)14:6<390::AID-FFJ850>3.0.CO;2-3
. [all data]
Ayedoun, Adéoti, et al., 1999
Ayedoun, M.A.; Adéoti, B.S.; Setondji, J.; Tchoumbougnang, F.; Kuiaté, J.R.; Zollo, P.H.A.; Menut, C.; Lamaty, G.; Bessière, J.M.,
Aromatic plants of tropical West Africa. XII. Essential oil of Hoslundia opposita Vahl. growing in Benin and Cameroon,
Flavour Fragr. J., 1999, 14, 5, 319-321, https://doi.org/10.1002/(SICI)1099-1026(199909/10)14:5<319::AID-FFJ836>3.0.CO;2-O
. [all data]
Baraldi, Rapparini, et al., 1999
Baraldi, R.; Rapparini, F.; Rossi, F.; Latella, A.; Ciccioli, P.,
Volatile organic compound emissions from flowers of the most occurring and economically important species of fruit trees,
Phys. Chem. Earth, 1999, 24, 6, 729-732, https://doi.org/10.1016/S1464-1909(99)00073-8
. [all data]
Bicchi, Binello, et al., 1999
Bicchi, C.; Binello, A.; D'Amato, A.; Rubiolo, P.,
Reliability of Van den Dool retention indices in the analysis of essential oils,
J. Chromatogr. Sci., 1999, 37, 8, 288-294, https://doi.org/10.1093/chromsci/37.8.288
. [all data]
Choo, Wong, et al., 1999
Choo, L.-C.; Wong, S.-M.; Liew, K.-Y.,
Essential oil of nutmeg pericarp,
J. Sci. Food Agric., 1999, 79, 13, 1954-1957, https://doi.org/10.1002/(SICI)1097-0010(199910)79:13<1954::AID-JSFA460>3.0.CO;2-I
. [all data]
Dzumayev, Tkachenko, et al., 1999
Dzumayev, Kh.K.; Tkachenko, K.G.; Tsibulskaya, I.A.,
Essential Oils of Origanum tytthanthum Gontsch. Produced from Plants Grown in Southern Uzbekistan,
J. Essent. Oil Res., 1999, 11, 11, 593-598, https://doi.org/10.1080/10412905.1999.9701220
. [all data]
Eikani, Goodarznia, et al., 1999
Eikani, M.H.; Goodarznia, I.; Mirza, M.,
Supercritical carbon dioxide extraction of cumin seeds (Cuminum cyminum L.),
Flavour Fragr. J., 1999, 14, 1, 29-31, https://doi.org/10.1002/(SICI)1099-1026(199901/02)14:1<29::AID-FFJ765>3.0.CO;2-G
. [all data]
Griffiths, Robertson, et al., 1999
Griffiths, D.W.; Robertson, G.W.; Shepherd, T.; Ramsay, G.,
Epicuticular waxes and volatiles from faba bean (Vicia faba ) flowers,
Phytochemistry, 1999, 52, 4, 607-612, https://doi.org/10.1016/S0031-9422(99)00298-8
. [all data]
Jassbi, Ahmad, et al., 1999
Jassbi, A.R.; Ahmad, V.U.; Tareen, R.B.,
Constituents of the essential oil of Perovskia atriplicifolia Benth.,
Flavour Fragr. J., 1999, 14, 1, 38-40, https://doi.org/10.1002/(SICI)1099-1026(199901/02)14:1<38::AID-FFJ778>3.0.CO;2-8
. [all data]
Kalemba, 1999
Kalemba, D.,
Constituents of the essential oil of Artemisia asiatica Nakai,
Flavour Fragr. J., 1999, 14, 3, 173-176, https://doi.org/10.1002/(SICI)1099-1026(199905/06)14:3<173::AID-FFJ805>3.0.CO;2-Q
. [all data]
Koulman, 1999
Koulman, A.,
Podophyllotoxin: a study of biosynthesis, evolution, function, and use of podophyllotoxin and related lignans, University Library Groningen, Nederlands, 1999, 188, retrieved from http://www.ub.rug.nl/eldoc/dis/science/a.koulman/. [all data]
Kuiate, Zollo, et al., 1999, 2
Kuiate, J.-R.; Zollo, P.-H.A.; Nguefa, E.H.; Bessière, J.-M.; Lamaty, G.; Menut, C.,
Composition of the essential oils from the leaves of Microglossa pyrifolia (Lam.) O. Kuntze and Helichrysum odoratissimum (L.) Less. growing in Cameroon,
Flavour Fragr. J., 1999, 14, 2, 82-84, https://doi.org/10.1002/(SICI)1099-1026(199903/04)14:2<82::AID-FFJ780>3.0.CO;2-Z
. [all data]
Labuckas, Zygadlo, et al., 1999
Labuckas, D.O.; Zygadlo, J.A.; Faillaci, S.M.; Espinar, L.A.,
Constituents of the volatile oil of Porophyllum obscurum (Spreng.) D.C.,
Flavour Fragr. J., 1999, 14, 2, 107-108, https://doi.org/10.1002/(SICI)1099-1026(199903/04)14:2<107::AID-FFJ799>3.0.CO;2-E
. [all data]
Meynier, Novelli, et al., 1999
Meynier, A.; Novelli, E.; Chissolinim, R.; Zanardi, E.; Gandemer, G.,
Volatile compounds of commercial Milano salami,
Meat Sci., 1999, 51, 2, 175-183, https://doi.org/10.1016/S0309-1740(98)00122-3
. [all data]
Mohd and Jantan, 1999
Mohd, N.A.; Jantan, I.,
Essential oil of cinnamomum tahijanum Kost. from Sarawak, 1999, retrieved from http://www.arbec.com.my/pdf/art5novdec99.pdf. [all data]
Nori-Shargh, Norouzi-Arasi, et al., 1999
Nori-Shargh, D.; Norouzi-Arasi, H.; Mirza, M.; Jaimand, K.; Mohammadi, S.,
Chemical composition of the essential oil fo Tanacetum polycephalum (Schultz Bip. ssp. heterophyllum),
Flavour Fragr. J., 1999, 14, 2, 105-106, https://doi.org/10.1002/(SICI)1099-1026(199903/04)14:2<105::AID-FFJ791>3.0.CO;2-7
. [all data]
Oberhofer, Nikiforov, et al., 1999
Oberhofer, B.; Nikiforov, A.; Buchbauer, G.; Jirovetz, L.; Bicchi, C.,
Investigation of the alteration of the composition of various essential oils used in aroma lamp applications,
Flavour Fragr. J., 1999, 14, 5, 293-299, https://doi.org/10.1002/(SICI)1099-1026(199909/10)14:5<293::AID-FFJ829>3.0.CO;2-T
. [all data]
Orav, Kailas, et al., 1999
Orav, A.; Kailas, T.; Muurisepp, M.; Kann, J.,
Composition of the oil from waste tires. 2. Fraction boiling at 160-180 0C,
Proc. Estonian Acad. Sci. Chem., 1999, 48, 3, 136-140. [all data]
Oyedeji, Olawore, et al., 1999
Oyedeji, A.O.; Olawore, O.N.; Ekundayo, O.; Koenig, W.A.,
Volatile leaf oil constituents of three Eucalyptus species from Nigeria,
Flavour Fragr. J., 1999, 14, 4, 241-244, https://doi.org/10.1002/(SICI)1099-1026(199907/08)14:4<241::AID-FFJ820>3.0.CO;2-Y
. [all data]
Palá-Paúl, Pérez-Alonso, et al., 1999
Palá-Paúl, J.; Pérez-Alonso, M.J.; Velasco-Negueruela, A.; Ramos-Vázquez, P.; Gómez-Contreras, F.; Sanz, J.,
Essential oil of Santolina rosmarinifolia L. ssp. rosmarinifolia: first isolation of capillene, a diacetylene derivative,
Flavour Fragr. J., 1999, 14, 2, 131-134, https://doi.org/10.1002/(SICI)1099-1026(199903/04)14:2<131::AID-FFJ794>3.0.CO;2-7
. [all data]
Pateira, Nogueira, et al., 1999
Pateira, L.; Nogueira, T.; Antunes, A.; Venancio, F.; Tavares, R.; Capelo, J.,
Two chemotypes of Crithmum maritimum L. from Portugal,
Flavour Fragr. J., 1999, 14, 5, 333-343, https://doi.org/10.1002/(SICI)1099-1026(199909/10)14:5<333::AID-FFJ839>3.0.CO;2-V
. [all data]
Prikhod'ko, Klyuev, et al., 1999
Prikhod'ko, A.B.; Klyuev, N.A.; Volkovich, S.V.; Emets, T.I.; Petrenko, V.V.; Dolya, E.V.,
Component composition od the essential oil of Thymus dimorphus,
Chem. Nat. Comp., 1999, 35, 1, 46-51, https://doi.org/10.1007/BF02238208
. [all data]
Quiroz, Fuentes-Contreras, et al., 1999
Quiroz, A.; Fuentes-Contreras, E.; Ramírez, C.C.; Russell, G.B.; Niemeyer, H.M.,
Host-plant chemicals and distribution of Neuquenaphis ON Nothofagus,
J. Chem. Ecol., 1999, 25, 5, 1043-1054, https://doi.org/10.1023/A:1020825707922
. [all data]
Rao, Bhattacharya, et al., 1999
Rao, B.R.R.; Bhattacharya, A.K.; Mallavarapu, G.R.; Ramesh, S.,
Volatile constituents of different parts of cornmint (Mentha arvensis L.),
Flavour Fragr. J., 1999, 14, 5, 262-264, https://doi.org/10.1002/(SICI)1099-1026(199909/10)14:5<262::AID-FFJ766>3.0.CO;2-6
. [all data]
Rustaiyan, Masoudi, et al., 1999
Rustaiyan, A.; Masoudi, S.; Monfared, A.; Komeilizadeh, H.,
Volatile constituents of three Salvia species grown wild in Iran,
Flavour Fragr. J., 1999, 14, 5, 276-278, https://doi.org/10.1002/(SICI)1099-1026(199909/10)14:5<276::AID-FFJ825>3.0.CO;2-Y
. [all data]
Rustaiyan and Nadji, 1999
Rustaiyan, A.; Nadji, K.,
Composition of the essential oils of Nepeta ispahanica Boiss. and Nepeta binaludensis Jamzad from Iran,
Flavour Fragr. J., 1999, 14, 1, 35-37, https://doi.org/10.1002/(SICI)1099-1026(199901/02)14:1<35::AID-FFJ776>3.0.CO;2-N
. [all data]
Sefidkon, Dabiri, et al., 1999
Sefidkon, F.; Dabiri, M.; Rahimi-Bidgoly, A.,
The effect of distillation methods and stage of plant growth on the essential oil content and composition of Thymus kotschyanus Boiss. Hohen,
Flavour Fragr. J., 1999, 14, 6, 405-408, https://doi.org/10.1002/(SICI)1099-1026(199911/12)14:6<405::AID-FFJ853>3.0.CO;2-M
. [all data]
Sefidkon and Khajavi, 1999
Sefidkon, F.; Khajavi, M.S.,
Chemical composition of the essential oils of two Salvia species from Iran: Salvia verticillata L. and Salvia santolinifolia Boiss.,
Flavour Fragr. J., 1999, 14, 2, 77-78, https://doi.org/10.1002/(SICI)1099-1026(199903/04)14:2<77::AID-FFJ726>3.0.CO;2-9
. [all data]
Sefidkon and Mirza, 1999
Sefidkon, F.; Mirza, M.,
Chemical composition of the essential oils of two Salvia species from Iran, Salvia virgata Jacq. and Salvia syriaca L.,
Flavour Fragr. J., 1999, 14, 1, 45-46, https://doi.org/10.1002/(SICI)1099-1026(199901/02)14:1<45::AID-FFJ774>3.0.CO;2-S
. [all data]
Shafiee, Javidnia, et al., 1999
Shafiee, A.; Javidnia, K.; Tabatabai, M.,
Volatile constituents and antimicrobial activity of zataria multiflora, population Iran,
Iran J. Chem. Chem. Eng., 1999, 18, 1, 1-5. [all data]
Sun and Petracek, 1999
Sun, D.; Petracek, P.D.,
Grapefruit gland oil composition is affected by wax application, storage temperature, and storage time,
J. Agric. Food Chem., 1999, 47, 5, 2067-2069, https://doi.org/10.1021/jf981064k
. [all data]
Tellez, Canel, et al., 1999
Tellez, M.R.; Canel, C.; Rimando, A.M.; Duke, S.O.,
Differential accumulation of isoprenoids in glanded and glandless Artemisia annua L,
Phytochemistry, 1999, 52, 6, 1035-1040, https://doi.org/10.1016/S0031-9422(99)00308-8
. [all data]
Viallon C., Verdier-Metz I., et al., 1999
Viallon C.; Verdier-Metz I.; Denoyer C.; Pradel P.; Coulon J.B.; Berdague J.L.,
Desorbed terpenes and sesquiterpenes from forages and cheeses,
J. Dairy Res., 1999, 66, 2, 319-326, https://doi.org/10.1017/S0022029999003520
. [all data]
Weyerstahl, Marschall, et al., 1999, 2
Weyerstahl, P.; Marschall, H.; Thefeld, K.; Rustaiyan, A.,
Constituents of the essential oil of Tanacetum (syn. Chrysanthemum) fruticulosum Ledeb. from Iran,
Flavour Fragr. J., 1999, 14, 2, 112-120, https://doi.org/10.1002/(SICI)1099-1026(199903/04)14:2<112::AID-FFJ786>3.0.CO;2-1
. [all data]
Zenkevich, Kosman, et al., 1999
Zenkevich, I.G.; Kosman, V.M.; Tkachenko, K.G.,
Some Features of Quantitative Analysis of Essential Oil's Components in High Performance Liquid Chromatography,
Rastitelnye Resursy (Plant resources), 1999, 35, 1, 128-137. [all data]
Zoghbi, Andrade, et al., 1999
Zoghbi, M.G.B.; Andrade, E.H.A.; Maia, J.G.S.,
The essential oil of Vitex angus-castus L. growing in the Amazon region,
Flavour Fragr. J., 1999, 14, 4, 211-213, https://doi.org/10.1002/(SICI)1099-1026(199907/08)14:4<211::AID-FFJ812>3.0.CO;2-W
. [all data]
Zoghbi, Andrade, et al., 1999, 2
Zoghbi, M.G.B.; Andrade, E.H.A.; Maia, J.G.S.,
Volatile constituents from leaves and flowers of Alpinia speciosa K. Schum. and A. purpurata (Viell.) Schum.,
Flavour Fragr. J., 1999, 14, 6, 411-414, https://doi.org/10.1002/(SICI)1099-1026(199911/12)14:6<411::AID-FFJ854>3.0.CO;2-U
. [all data]
Doneanu and Anitescu, 1998
Doneanu, C.; Anitescu, G.,
Supercritical carbon dioxide extraction of Angelica archangelica L. root oil,
J. Supercrit. Fluids, 1998, 12, 1, 59-67, https://doi.org/10.1016/S0896-8446(97)00040-5
. [all data]
El-Sakhawy, El-Tantawy, et al., 1998
El-Sakhawy, F.S.; El-Tantawy, M.E.; Ross, S.A.; El-Sohly, M.A.,
Composition and antimicrobial activity of the essential oil of Murraya exotica L.,
Flavour Fragr. J., 1998, 13, 1, 59-62, https://doi.org/10.1002/(SICI)1099-1026(199801/02)13:1<59::AID-FFJ693>3.0.CO;2-L
. [all data]
Jantan, Ahmad, et al., 1998
Jantan, I.; Ahmad, A.S.; Bakar, S.A.A.; Ahmad, A.R.; Trockenbrodt, M.; Chak, C.V.,
Constituents of the essential oil of Baeckea frutescens L. from Malaysia,
Flavour Fragr. J., 1998, 13, 4, 245-247, https://doi.org/10.1002/(SICI)1099-1026(1998070)13:4<245::AID-FFJ736>3.0.CO;2-J
. [all data]
Kökdil, Kurucu, et al., 1998
Kökdil, G.; Kurucu, S.; Yildiz, A.,
Essential oil composition of Nepeta nuda L. ssp. nuda,
Flavour Fragr. J., 1998, 13, 4, 233-234, https://doi.org/10.1002/(SICI)1099-1026(1998070)13:4<233::AID-FFJ730>3.0.CO;2-7
. [all data]
Maia, Zohhbi, et al., 1998
Maia, J.G.S.; Zohhbi, M.G.B.; Andrade, E.H.A.; Santos, A.S.; da Silva, M.H.L.; Luz, A.I.R.; Bastos, C.N.,
Constituents of the essential oil of Piper aduncum L. growing wild in the Amazon region,
Flavour Fragr. J., 1998, 13, 4, 269-272, https://doi.org/10.1002/(SICI)1099-1026(1998070)13:4<269::AID-FFJ744>3.0.CO;2-A
. [all data]
Milso, Mastelic, et al., 1998
Milso, M.; Mastelic, J.; Radonic, A.,
Free and glycosidically bound volatile compounds from cypress cones (Cupressus Sempervirens L.),
Croat. Chem. Acta, 1998, 71, 1, 139-145. [all data]
Poiana, Sicari, et al., 1998
Poiana, M.; Sicari, V.; Mincione, B.,
Supercritical carbon dioxide (SC-CO2) extraction of grapefruit flavedo,
Flavour Fragr. J., 1998, 13, 2, 125-130, https://doi.org/10.1002/(SICI)1099-1026(199803/04)13:2<125::AID-FFJ708>3.0.CO;2-#
. [all data]
Stashenko, Cervantes, et al., 1998
Stashenko, E.E.; Cervantes, M.; Combariza, Y.; Martínez, J.R.,
HRGC-FID-MSD Analysis of the Secondary Metabolites Obtained by Different Extraction Methods from Lepechinia schiedeana, and Evaluation of its Antioxidant Activity in vitro
in 20th International Symposium on Capillary Chromatography, 1998, 1-11. [all data]
Zollo, Biyiti, et al., 1998
Zollo, P.H.A.; Biyiti, L.; Tchoumbougnang, F.; Menut, C.; Lamaty, G.; Bouchet, Ph.,
Aromatic plants of tropical central Africa. Part XXXII. Chemical composition and antifungal activity of thirteen essential oils from aromatic plants of Cameroon,
Flavour Fragr. J., 1998, 13, 2, 107-114, https://doi.org/10.1002/(SICI)1099-1026(199803/04)13:2<107::AID-FFJ701>3.0.CO;2-G
. [all data]
Bos, Woerdenbag, et al., 1997
Bos, R.; Woerdenbag, H.J.; Hendriks, H.; Smit, H.F.; Wikström, H.V.; Scheffer, J.J.C.,
Composition of the essential oil from roots and rhizomes of Valeriana wallichii DC,
Flavour Fragr. J., 1997, 12, 2, 123-131, https://doi.org/10.1002/(SICI)1099-1026(199703)12:2<123::AID-FFJ613>3.0.CO;2-4
. [all data]
Bos, Woerdenbag, et al., 1997, 2
Bos, R.; Woerdenbag, H.J.; Hendriks, H.; Scheffer, J.J.C.,
Composition of the essential oils from underground parts of Valeriana officinalis L. s.l. and several closely related taxa,
Flavour Fragr. J., 1997, 12, 5, 359-370, https://doi.org/10.1002/(SICI)1099-1026(199709/10)12:5<359::AID-FFJ660>3.0.CO;2-G
. [all data]
Kökdil, Kurucu, et al., 1997
Kökdil, G.; Kurucu, S.; Topcu, G.,
Chemical constituents of the essential oils of Nepeta italica L. and Nepeta sulfuriflora P. H. Davis,
Flavour Fragr. J., 1997, 12, 1, 33-35, https://doi.org/10.1002/(SICI)1099-1026(199701)12:1<33::AID-FFJ609>3.0.CO;2-V
. [all data]
Mariaca, Berger, et al., 1997
Mariaca, R.G.; Berger, T.F.H.; Gauch, R.; Imhof, M.I.; Jeangros, B.; Bosset, J.O.,
Occurrence of volatile mono- and sesquiterpenoids in highland and lowland plant species as possible precursors for flavor compounds in milk and dairy products,
J. Agric. Food Chem., 1997, 45, 11, 4423-4434, https://doi.org/10.1021/jf970216t
. [all data]
Salgueiro, Vila, et al., 1997
Salgueiro, L.R.; Vila, R.; Tomi, F.; Figueiredo, A.C.; Barroso, J.G.; Cañigueral, S.; Casanova, J.; da Cunha, A.P.; Adzet, T.,
Variability of essential oils of Thymus caespititius from Portugal,
Phytochemistry, 1997, 45, 2, 307-311, https://doi.org/10.1016/S0031-9422(96)00872-2
. [all data]
Tellez, Estell, et al., 1997, 2
Tellez, M.R.; Estell, R.E.; Frederickson, E.L.; Havstad, K.M.,
Essntial oil of Flourensia cernua DC,
J. Essent. Oil Res., 1997, 9, 6, 619-624, https://doi.org/10.1080/10412905.1997.9700799
. [all data]
Zunino, Novillo-Newton, et al., 1997
Zunino, M.P.; Novillo-Newton, M.; Maestri, D.M.; Zygadlo, J.A.,
Composition of the essential oil of Baccharis crispa Spreng. and Baccharis salicifolia Pers. grown in Cordoba (Argentina),
Flavour Fragr. J., 1997, 12, 6, 405-407, https://doi.org/10.1002/(SICI)1099-1026(199711/12)12:6<405::AID-FFJ667>3.0.CO;2-R
. [all data]
Zygadlo, Ariza-Espinar, et al., 1997
Zygadlo, J.A.; Ariza-Espinar, L.; Velasco-Negueruela, A.; Perez-Alonso, M.J.,
Volatile constituents of Stevia achalensis hieronymus,
Flavour Fragr. J., 1997, 12, 4, 297-299, https://doi.org/10.1002/(SICI)1099-1026(199707)12:4<297::AID-FFJ625>3.0.CO;2-2
. [all data]
Ayedoun, Adeoti, et al., 1996
Ayedoun, A.M.; Adeoti, B.S.; Sossou, P.V.; Leclerq, P.A.,
Influence of fruit conservation methods on the essential oil composition of xylopia aethiopica (Dunal) A. Richard from Benin,
Flavour Fragr. J., 1996, 11, 4, 245-250, https://doi.org/10.1002/(SICI)1099-1026(199607)11:4<245::AID-FFJ583>3.0.CO;2-K
. [all data]
Chacko, Jayalekshmy, et al., 1996
Chacko, S.; Jayalekshmy, A.; Gopalakrishnan, M.; Narayanan, C.S.,
Roasting studies on black pepper (Piper nigrum L.),
Flavour Fragr. J., 1996, 11, 5, 305-310, https://doi.org/10.1002/(SICI)1099-1026(199609)11:5<305::AID-FFJ588>3.0.CO;2-1
. [all data]
Gawdzik, Mardarowicz, et al., 1996
Gawdzik, J.; Mardarowicz, M.; Suprynowicz, Z.; Kawka, S.; Wolski, T.,
Supercritical fluid extraction of essential oils from the fruits of Archangelica off. Hoffm. and their characterization by GC/MS,
J. Hi. Res. Chromatogr., 1996, 19, 4, 237-240, https://doi.org/10.1002/jhrc.1240190416
. [all data]
Malizia, Molli, et al., 1996
Malizia, R.A.; Molli, J.S.; Cardell, D.A.; Retamar, J.A.,
Volatile constituents of the essential oil of Nepeta cataria L. grown in Cordoba Province (Argentina),
J. Essent. Oil Res., 1996, 8, 5, 565-567, https://doi.org/10.1080/10412905.1996.9700691
. [all data]
Orav, Kailas, et al., 1996
Orav, A.; Kailas, T.; Liiv, M.,
Analysis of terpenoic composition of conifer needle oils by steam distillation/extraction, gas chromatography and gas chromatography-mass spectrometry,
Chromatographia, 1996, 43, 3/4, 215-219, https://doi.org/10.1007/BF02292955
. [all data]
Sagrero-Nieves and Bartley, 1996
Sagrero-Nieves, L.; Bartley, J.P.,
Volatile components from the leaves of heterotheca inuloides Cass.,
Flavour Fragr. J., 1996, 11, 1, 49-51, https://doi.org/10.1002/(SICI)1099-1026(199601)11:1<49::AID-FFJ538>3.0.CO;2-J
. [all data]
Sohounhloue, Dangou, et al., 1996
Sohounhloue, D.K.; Dangou, J.; Gnomhossou, B.; Garneau, F.-X.; Gagnon, H.; Jean, F.-I.,
Leaf oils of three Eucalyptus species from Benin: E. torelliana F. Muell., E. citriodora Hook. and E. tereticornis Smith,
J. Essent. Oil Res., 1996, 8, 1, 111-113, https://doi.org/10.1080/10412905.1996.9700571
. [all data]
Stashenko, Puertas, et al., 1996
Stashenko, E.E.; Puertas, M.A.; Combariza, M.Y.,
Volatile secondary metabolites from Spilanthes americana obtained by simultaneous steam distillation--solvent extraction and supercritical fluid extraction,
J. Chromatogr. A, 1996, 752, 1-2, 223-232, https://doi.org/10.1016/S0021-9673(96)00480-3
. [all data]
Thanh, Dung, et al., 1996
Thanh, L.; Dung, N.X.; Bighetti, A.; Casanova, J.; Leclercq, P.A.,
Combination of cCapillary GC, GC/MS and 13C-NMR for the Characterization of the Rhizome Oil of Piper betle L. (Piperaceae) from Vietnam,
Spectroscopy, 1996, 13, 2, 131-136, https://doi.org/10.1155/1997/397354
. [all data]
Wong and Lai, 1996
Wong, K.C.; Lai, F.Y.,
Volatile constituents from the fruits of four Syzygium species grown in Malaysia,
Flavour Fragr. J., 1996, 11, 1, 61-66, https://doi.org/10.1002/(SICI)1099-1026(199601)11:1<61::AID-FFJ539>3.0.CO;2-1
. [all data]
Larsen and Frisvad, 1995
Larsen, T.O.; Frisvad, J.C.,
Comparison of different methods for collection of volatile chemical markers from fungi,
J. Microbiol. Methods, 1995, 24, 2, 135-144, https://doi.org/10.1016/0167-7012(95)00063-1
. [all data]
Orav, Kuningas, et al., 1995
Orav, A.; Kuningas, K.; Kailas, T.,
Computerized capillary gas chromatographic identification and determination of Siberian fir oil constituents,
J. Chromatogr. A, 1995, 697, 1-2, 495-499, https://doi.org/10.1016/0021-9673(94)01059-N
. [all data]
Stashenko, Torres, et al., 1995
Stashenko, E.E.; Torres, W.; Morales, J.R.M.,
A study of the compositional variation of the essential oil of ylang-ylang (Cananga odorata Hook Fil. et Thomson, forma genuina) during flower development,
J. Hi. Res. Chromatogr., 1995, 18, 2, 101-104, https://doi.org/10.1002/jhrc.1240180206
. [all data]
Tirado, Stashenko, et al., 1995
Tirado, C.B.; Stashenko, E.E.; Combariza, M.Y.; Martinez, J.R.,
Comparative study of Colombian citrus oils by high-resolution gas chromatography and gas chromatography-mass spectrometry,
J. Chromatogr. A, 1995, 697, 1-2, 501-513, https://doi.org/10.1016/0021-9673(94)00955-9
. [all data]
Larsen and Frisvad, 1994
Larsen, T.O.; Frisvad, J.C.,
A simple method for collection of volatile metabolites from fungi based on diffusive sampling from Petri dishes,
J. Microbiol. Methods, 1994, 19, 4, 297-305, https://doi.org/10.1016/0167-7012(94)90032-9
. [all data]
Ramanoelina, Viano, et al., 1994
Ramanoelina, P.A.R.; Viano, J.; Bianchini, J.-P.; Gaydou, E.M.,
Occurrence of various chemotypes in Niaouli (Melaleuca quinquenervia) essential oils from Madagascar using multivariate statistical analysis,
J. Agric. Food Chem., 1994, 42, 5, 1177-1182, https://doi.org/10.1021/jf00041a024
. [all data]
Collin, Deslauriers, et al., 1993
Collin, G.J.; Deslauriers, H.; Pageau, N.; Gagnon, M.,
Essential oil of Tansy (Tanacetum vulgare L.) of Canadian origin,
J. Essent. Oil Res., 1993, 5, 6, 629-638, https://doi.org/10.1080/10412905.1993.9698296
. [all data]
Demarne and van der Walt, 1993
Demarne, F.-E.; van der Walt, J.J.A.,
Composition of the Essential Oil of Pelargonium citronellum (Geraniaceae),
J. Essent. Oil Res., 1993, 5, 3, 233-238, https://doi.org/10.1080/10412905.1993.9698214
. [all data]
Egolf and Jurs, 1993
Egolf, L.M.; Jurs, P.C.,
Quantitative structure-retention and structure-odor intensity relationships for a diverse group of odor-active compounds,
Anal. Chem., 1993, 65, 21, 3119-3126, https://doi.org/10.1021/ac00069a027
. [all data]
Gopalakrishnan, Menon, et al., 1993
Gopalakrishnan, M.; Menon, N.; Padmakumari, K.P.; Jayalekshmy, A.; Narayanan, C.S.,
GC Analysis and Odor Profiles of Four New Indian Genotypes of Piper nigrum L.,
J. Essent. Oil Res., 1993, 5, 3, 247-253, https://doi.org/10.1080/10412905.1993.9698217
. [all data]
Kaul, Singh, et al., 1993
Kaul, V.K.; Singh, B.; Sood, R.P.,
Volatile Constituents of the Essential Oil of Tanacetum longifolium Wall.,
J. Essent. Oil Res., 1993, 5, 6, 597-601, https://doi.org/10.1080/10412905.1993.9698290
. [all data]
Mallavarapu, Ramesh, et al., 1993
Mallavarapu, G.R.; Ramesh, S.; Kaul, P.N.; Battacharya, A.K.; Rao, B.R.R.,
The essential oil of Hyptis suaveolens (L.) Poit.,
J. Essent. Oil Res., 1993, 5, 3, 321-323, https://doi.org/10.1080/10412905.1993.9698230
. [all data]
Zenkevich and Kulikova, 1993
Zenkevich, I.G.; Kulikova, S.N.,
GC-MS Analysis of Products of Reactions of Unsaturated Compounds with Dimethyl Disulfide for Determination of Position of Double Bonds C=C,
Vestnik St. Petersburg University. Ser. phys-khim., 1993, 2, 59-69. [all data]
Ciccioli, Cecinato, et al., 1992
Ciccioli, P.; Cecinato, A.; Brancaleoni, E.; Frattoni, M.; Liberti, A.,
Use of carbon adsorption traps combined with high resolution gas chromatography - mass spectrometry for the analysis of polar and non-polar C4-C14 hydrocarbons involved in photochemical smog formation,
J. Hi. Res. Chromatogr., 1992, 15, 2, 75-84, https://doi.org/10.1002/jhrc.1240150205
. [all data]
King and Knight, 1992
King, J.R.; Knight, R.J.,
Volatile components of the leaves of various avocado cultivars,
J. Agric. Food Chem., 1992, 40, 7, 1182-1185, https://doi.org/10.1021/jf00019a020
. [all data]
Kollmannsberger, Nitz, et al., 1992
Kollmannsberger, H.; Nitz, S.; Drawert, F.,
UBer die Aromastoffzusammensetzung von Hochdruckextrakten. I. Pfeffer (Piper nigrum, Var. muntok),
Z. Lebensm. Unters Forsch., 1992, 194, 6, 545-551, https://doi.org/10.1007/BF01185481
. [all data]
Misharina, Golovnya, et al., 1991
Misharina, T.A.; Golovnya, R.V.; Charnomskii, V.V.,
Volatile components of boiled shrimp funchalia woodwardi and crab geryon maritae,
Zh. Anal. Khim., 1991, 46, 1421-1429. [all data]
Velasco-Negueruela, Pérez Alonso, et al., 1991
Velasco-Negueruela, A.; Pérez Alonso, M.J.; Burzaco, A.,
Aceites esenciales de tomillos ibéricos. VI. Contribución al conocimiento del aceite esencial de thymus capitellatus Hoffmanns. Link,
Anales Jard. Bot. Madrid, 1991, 49, 1, 77-81. [all data]
Jantan and Goh, 1990
Jantan, I.; Goh, S.H.,
The essential oils of Cinnamomum mollissimum as natural sources of safrole and benzyl benzoate,
J. Tropical Forest Sci., 1990, 2, 3, 252-259. [all data]
Ronse and De Pooter, 1990
Ronse, A.C.; De Pooter, H.L.,
Essential Oil Production by Belgian Artemisia alba (Turra) before and after Micropropagation,
J. Essent. Oil Res., 1990, 2, 5, 237-242, https://doi.org/10.1080/10412905.1990.9697873
. [all data]
Wyllie, Brophy, et al., 1990
Wyllie, S.G.; Brophy, J.J.; Sarafis, V.; Hobbs, M.,
Volatile Components of the Fruit of Pistacia Lentiscus,
J. Food. Sci., 1990, 55, 5, 1325-1326, https://doi.org/10.1111/j.1365-2621.1990.tb03926.x
. [all data]
Yang and Sugisawa, 1990
Yang, R.; Sugisawa, H.,
Citrus Suachi Hort. ex Shirai. Volatile components in Sudachi (Citrus Sudachi Hort. ex Shirai) juice,
Nippon Shokuhin Kogyo Gakkaishi, 1990, 37, 12, 946-952, https://doi.org/10.3136/nskkk1962.37.12_946
. [all data]
Brophy, Davies, et al., 1989
Brophy, J.J.; Davies, N.W.; Southwell, I.A.; Stiff, I.A.; Williams, L.R.,
Gas chromatographic quality control for oil of Melaleuca terpinen-4-ol type (Australian tea tree),
J. Agric. Food Chem., 1989, 37, 5, 1330-1335, https://doi.org/10.1021/jf00089a027
. [all data]
de Pooter, de Buyck, et al., 1989
de Pooter, H.L.; de Buyck, L.F.; Schamp, N.M.; Billiet, F.; De Bruyn, A.,
The volatile fraction of Otacanthus coeruleus Lindl. Containing the new copaene derivative β-copaen-4α-ol,
Flavour Fragr. J., 1989, 4, 2, 47-51, https://doi.org/10.1002/ffj.2730040202
. [all data]
Sugisawa, Yamamoto, et al., 1989
Sugisawa, H.; Yamamoto, M.; Tamura, H.; Takagi, N.,
The comparison of volatile components in peel oil from four species of navel orange,
Nippon Shokuhin Kogio Gakkaishi, 1989, 36, 6, 455-462, https://doi.org/10.3136/nskkk1962.36.6_455
. [all data]
Sugisawa, Yang, et al., 1989
Sugisawa, H.; Yang, R.H.; Kawabata, C.; Tamura, H.,
Volatile constituents in the peel oil of sudachi (Citrus sudachi),
Agric. Biol. Chem., 1989, 53, 6, 1721-1723, https://doi.org/10.1271/bbb1961.53.1721
. [all data]
de Pooter, Nicolai, et al., 1988
de Pooter, H.L.; Nicolai, B.; De Laet, J.; De Buyck, L.F.; Schamp, N.M.; Goetghebeur, P.,
The Essential Oils of Five Nepeta Species. A Preliminary Evaluation of their Use in Chemotaxonomy by Cluster Analysis,
Flavour Fragr. J., 1988, 3, 4, 155-159, https://doi.org/10.1002/ffj.2730030404
. [all data]
Wahab, Aboutabl, et al., 1987
Wahab, S.M.A.; Aboutabl, E.A.; El-Zalabani, S.M.; DePooter, H.L.; Al-Fallaha, B.,
The essential oil of olibanum,
Planta Medica, 1987, 53, 04, 382-384, https://doi.org/10.1055/s-2006-962745
. [all data]
Buttery, Flath, et al., 1986
Buttery, R.G.; Flath, R.A.; Mon, T.R.; Ling, L.C.,
Identification of germacrene D in walnut and fig leaf volatiles,
J. Agric. Food Chem., 1986, 34, 5, 820-822, https://doi.org/10.1021/jf00071a013
. [all data]
Nykanen, 1986
Nykanen, I.,
High Resolution Gas Chromatographic - Mass Spectrometric determination of the Flavour Composition of Wild Majoram (Origanum vulgare L.) Cultivated in Finland,
Z. Lebensm Unters Forsch, 1986, 183, 4, 267-272, https://doi.org/10.1007/BF01087742
. [all data]
Perry, Baxter, et al., 1986
Perry, N.B.; Baxter, A.J.; Brennan, N.J.; van Klink, J.W.,
Dalmatian Sage. PArt 1. Differing oil yields and compositions from flowering and non-flowering accessions,
Flavour Fragr. J., 1986, 11, 4, 231-238, https://doi.org/10.1002/(SICI)1099-1026(199607)11:4<231::AID-FFJ572>3.0.CO;2-0
. [all data]
de Pooter, de Buyck, et al., 1986
de Pooter, H.L.; de Buyck, L.F.; Schamp, N.M.; Aboutabl, E.; De Bruyn, A.; Husain, S.Z.,
The Volatile Fraction of Senecio glaucus subsp. coronopifolius,
Flavour Fragr. J., 1986, 1, 4-5, 159-163, https://doi.org/10.1002/ffj.2730010406
. [all data]
De Pooter, De Buyck, et al., 1986
De Pooter, H.L.; De Buyck, L.F.; Schamp, N.M.,
The Volatiles of Calamintha Nepeta Subsp. Glandulosa,
Phytochemistry, 1986, 25, 3, 691-694, https://doi.org/10.1016/0031-9422(86)88025-6
. [all data]
De Pooter and Schamp, 1986
De Pooter, H.L.; Schamp, N.M.,
Comparison of the Volatile Composition of Some Calamintha/Satureja Species,
Prog. Essnt. Oil. Res., 1986, 139-150. [all data]
Habu, Flath, et al., 1985
Habu, T.; Flath, R.A.; Mon, T.R.; Morton, J.F.,
Volatile components of Rooibos tea (Aspalathus linearis),
J. Agric. Food Chem., 1985, 33, 2, 249-254, https://doi.org/10.1021/jf00062a024
. [all data]
del Rosario, de Lumen, et al., 1984
del Rosario, R.; de Lumen, B.O.; Habu, T.; Flath, R.A.; Mon, T.R.; Teranishi, R.,
Comparison of headspace volatiles from winged beans and soybeans,
J. Agric. Food Chem., 1984, 32, 5, 1011-1015, https://doi.org/10.1021/jf00125a015
. [all data]
Flath, Mon, et al., 1983
Flath, R.A.; Mon, T.R.; Lorenz, G.; Whitten, C.J.; Mackley, J.W.,
Volatile components of Acacia sp. blossoms,
J. Agric. Food Chem., 1983, 31, 6, 1167-1170, https://doi.org/10.1021/jf00120a008
. [all data]
Heydanek and McGorrin, 1981
Heydanek, M.G.; McGorrin, R.J.,
Gas chromatography-mass spectroscopy investigations on the flavor chemistry of oat groats,
J. Agric. Food Chem., 1981, 29, 5, 950-954, https://doi.org/10.1021/jf00107a016
. [all data]
Shibamoto and Jennings, 1977
Shibamoto, T.; Jennings, W.G.,
The volatile composition of the leaf oil of California Juniper (J. californica Carr.)
in Proceedings of VII International Congress of Essential Oils, October 7-11, 1977, Kyoto, Japan, 1977, 413-418. [all data]
Donetzhuber, Johansson, et al., 1976
Donetzhuber, A.; Johansson, K.; Sandstroem, C.,
Gas phase characterization of wood, pulp, and paper,
Appl. Polymer Symp., 1976, 28, 889-901. [all data]
Albano, Lima, et al., 2012
Albano, S.M.; Lima, A.S.; Miguel, M.G.; Pedro, L.G.; Barroso, J.G.; Figueiredo, A.C.,
Antioxidant, anti-5-lipoxygenase and antiacetylcholinesterase activities of essential oils and decoction water of some aromatic plants,
Rec. Nat. Prod., 2012, 6, 1, 35-48. [all data]
Mondello, 2012
Mondello, L.,
HS-SPME-GCxGC-MS analysis of Yerba Mate (Ilex paraguariensis)
in Shimadzu GC-GC application compendium of comprehensive 2D GC, Vol. 1-5, Shimadzu Corp., 2012, 1-29. [all data]
Robinson, Adams, et al., 2012
Robinson, A.L.; Adams, D.O.; Boss, P.K.; Heymann, H.; Solomon, P.S.; Trengove, R.D.,
Influence of geographic origine on the sensory characteristics and wine composition of Vitus viniferas cv. Cabernet Sauvignon wines from Australia (Supplemental data),
Am. J. Enol. Vitic., 2012, 64, 4, 467-476, https://doi.org/10.5344/ajev.2012.12023
. [all data]
Sharopov, Sulaimonova, et al., 2012
Sharopov, F.S.; Sulaimonova, V.A.; Setzer, W.N.,
Composition of the essential oil of Ertemisia absinthium from Tajikistan,
Rec. Nat. Prod., 2012, 6, 2, 127-134. [all data]
da Silva, de Souza, et al., 2012
da Silva, A.C.; de Souza, P.E.; Machado, J. daC.; da Silva, B.M.; Pinto, J.E.B.P.,
Effectiveness of essential oils in the treatment of Colletotrichum truncatum-infected soybean seeds,
Tropical Plant Patology, 2012, 37, 5, 305-313, https://doi.org/10.1590/S1982-56762012000500001
. [all data]
Veres, Csupor-Loffler, et al., 2012
Veres, K.; Csupor-Loffler, B.; Lazar, A.; Holmann, J.,
Antifungal activity and composition of essential oils of Conyza canadensis herbs and roots,
The Sci. World. J., 2012, 2012, 1-5, https://doi.org/10.1100/2012/489646
. [all data]
VOC BinBase, 2012
VOC BinBase,
The volatile compound BinBase (VOC BinBase), 2012, retrieved from http://fiehnlab.ucdavis.edu/projects/VocBinBase and http://binbase.sourceforge.net. [all data]
Bai, Liu, et al., 2011
Bai, C.Q.; Liu, Z.L.; Liu, Q.Z.,
Nematicidal constituents from the essential oil of Chenopodium ambrosioides aerial parts,
E-Journal of Chemistry, 2011, 8, S1, s143-s148, https://doi.org/10.1155/2011/470862
. [all data]
Chaverri, Diaz, et al., 2011
Chaverri, C.; Diaz, C.; Cicco, J.F.,
Chemical analysis of essential oils from Ocotea gomezii W.C. Burger and Ocotea morae Gomez-Laur. (Lauraceae) collected at Reserva biologica Alberto M. Brenes in Costa Rica and their cytotoxic activity on Tumor cell lines,
J. Braz. Chem. Soc., 2011, 22, 4, s1-s4, https://doi.org/10.1590/S0103-50532011000400018
. [all data]
Chen and Li, 2011
Chen, S.; Li, X.,
Analysis of common volatile constituents between herbal pair Ephedra Sinica Stapf-Zingiber offoconale Rosc. and its single herb by GC-MS combined with AMWFA method, 2011, retrieved from http://www.webmedcentral.com. [all data]
Chu, Liu, et al., 2011
Chu, S.S.; Liu, S.L.; Liu, Q.Z.; Liu, Z.L.; Du, S.S.,
Composition and toxicity of Chinese Dracocephalum moldavica (Labiatae) essential oil against two grain storage insects,
J. Med. Plants Res., 2011, 5, 21, 5262-5267. [all data]
Fortes, Naves, et al., 2011
Fortes, G.A.C.; Naves, S.S.; Godoi, F.F.F.; Duarte, A.R.; Ferri, P.H.; Santos, S.C.,
Assessment of a maturity index in Jabuticaba fruit by the evaluation of phenolic compounds, essential oil components, sugar content and total acidity,
Amer. J. Food Technol., 2011, 6, 11, 974-984, https://doi.org/10.3923/ajft.2011.974.984
. [all data]
Karimi, Farmany, et al., 2011
Karimi, H.; Farmany, A.; Noorizadeh, H.,
Prediction of linear retention index of Teucrium chamaedrys volatiles in GCxGC-TOF/MS by linear model,
World Appl. Sci. J., 2011, 15, 8, 1086-1088. [all data]
Laribi, Kouki, et al., 2011
Laribi, B.; Kouki, K.; Sahli, A.; Mougou, A.; Marzouk, B.,
Essential oil fatty acids composition of a Tunisian caraway (Carum carvi L.) seed ecotype cultivated under water deficit,
Adv. Environ. Biol., 2011, 1-15, retrieved from http://www.thefreelibrary.com//print/PrintArticle.aspx?id=253057768. [all data]
Miyazaki, Plotto, et al., 2011
Miyazaki, T.; Plotto, A.; Goodner, K.; Gmitter F.G.,
Distribution of aroma volatile compounds in tangerine hybrids and proposed inheritance,
J. Sci. Food Agric., 2011, 91, 3, 449-460, https://doi.org/10.1002/jsfa.4205
. [all data]
Nance and Setzer, 2011
Nance, M.R.; Setzer, W.N.,
Volatile components of aroma hops (Humulus lupulus L.) commonly used in beer brewing,
J. of Brewing and Distilling, 2011, 2, 2, 16-22. [all data]
Skogerson, Wohlgemuth, et al., 2011
Skogerson, K.; Wohlgemuth, G.; Fiehn, O.,
VocBinNase, 2011, retrieved from http://fiehnlab.ucdavis.edu/projects//VocBinBase. [all data]
Wang, Liu, et al., 2011
Wang, C.F.; Liu, P.; Yang, K.; Zeng, Y.; Liu, Z.L.; Du, S.S.; Deng, Z.W.,
Chemical composition and toxicities of essential oil of Illicium fragesil fruits against Sitophilis zeamais,
African J. Biotechnol., 2011, 10, 79, 18179-18184. [all data]
Wang, Xu, et al., 2011
Wang, J.; Xu, L.; Yang, L.; Liu, Z.; Zhou, L.,
Composition, antibacterial and antioxidant activities of essential oils from Ligusticum sinense and L. jaholense (Unvelliferae) from China,
Rec. Nat. Prod., 2011, 5, 4, 314-318. [all data]
Di Giusto, Bessiere, et al., 2010
Di Giusto, B.; Bessiere, J.-M.; Gueroult, M.; Lim, L.B.L.; Marshall, D.J.; Hossaert-McKey, M.; Gaume, L.,
Flower-scent mimicry masks a deadly trap in the carnivorous plant Nepenthes raffesiana,
J. Ecology, 2010, 98, 4, 845-856, https://doi.org/10.1111/j.1365-2745.2010.01665.x
. [all data]
Liu, Chu, et al., 2010
Liu, Z.L.; Chu, S.S.; Liu, Q.R.,
Chemical composition and insecticidial activity against Sitophilus zeamais of the essential oils of Artemisia capillaris and Artemisia mongolica,
Molecules, 2010, 15, 4, 2600-2608, https://doi.org/10.3390/molecules15042600
. [all data]
Pontes, Silva, et al., 2010
Pontes, W.J.T.; Silva, J.M.O.; ds Camara, C.A.G.; Gondim-Junior, M.G.C.; Oliveira, J.V.,
Chemical composition and acaricidal activity of the essential oils from fruits and leaves of Protium bahianum Daly,
J. Essential Oil Res., 2010, 22, 3, 279-282, https://doi.org/10.1080/10412905.2010.9700324
. [all data]
Sharifiar, Yassa, et al., 2010
Sharifiar, F.; Yassa, N.; Mozaffarian, V.,
Bioactivity of major components from the seeds of Bunium persicum (Boiss.) Fedtch,
Pakistan J. Pharm. Sci., 2010, 23, 3, 300-304. [all data]
Bajpai, Al-Reza, et al., 2009
Bajpai, V.K.; Al-Reza, S.M.; Choi, U.L.; Lee, J.H.; Kang, S.C.,
Chemical composition, antibacterial and antioxidant activities of leaf essential oil and extracts of Metasequioa glyptostroboides Miki ex Hu,
Food Chem. Toxicol., 2009, 47, 8, 1876-1883, https://doi.org/10.1016/j.fct.2009.04.043
. [all data]
Courtois, Paine, et al., 2009
Courtois, E.A.; Paine, C.E.; Blandinieres, P.-A.; Stien, D.; Bessiere, J.-M.; Houel, E.; Baraloto, C.; Chave, J.,
Diversity of the volatile organic compounds emitted by 55 species of tropical trees: a survey in French Guiana,
J. Chem. Ecol., 2009, 35, 11, 1349-1362, https://doi.org/10.1007/s10886-009-9718-1
. [all data]
Delort and Jaquier, 2009
Delort, E.; Jaquier, A.,
Novel terpenyl esters from Australian finger lime (Citrus australasica) peel extract,
Flav. Fragr. J., 2009, 24, 3, 123-132, https://doi.org/10.1002/ffj.1922
. [all data]
Fan, Lu, et al., 2009
Fan, G.; Lu, W.; Yao, X.; Zhang, Y.; Wang, K.; Pan, S.,
effect of fermentation on free and bound volatile compounds of orange juice,
Flavour Fragr. J., 2009, 24, 5, 219-229, https://doi.org/10.1002/ffj.1931
. [all data]
HEuskin, Godin, et al., 2009
HEuskin, S.; Godin, B.; Leroy, P.; Quentin C.; Wathelet, J.-P.; Verheggen, F.; Haubruge, E.; Lognay, G.,
Fast gas chromatography characterization of purified semiochemicals from essential oils of Matricaria chamomilla L. (Asteraceae) and Nepeta cataria L. (Lamiaceae),
J. Chromatorg. A., 2009, 1216, 14, 2768-2775, https://doi.org/10.1016/j.chroma.2008.09.109
. [all data]
Huang, Qin, et al., 2009
Huang, B.; Qin, L.; Chu, Q.; Zhang, Q.; Gao, L.; Zheng, H.,
Comparison of headspace SPME with hydrodistillation and SFE for analysis of the volatile components of the roots of Valeriana officinalis var. latifolia,
Chromatographia, 2009, 69, 5/6, 489-496, https://doi.org/10.1365/s10337-008-0921-y
. [all data]
Kapoor, Singh, et al., 2009
Kapoor, I.; Singh, B.; Singh, G.; De Heluani, C.S.; De Lampasona, M.P.; Catalan, C.A.N.,
Chemistry and in vitro antioxidant activity of volatile oil and oleoresins of black pepper (Piper nigrum),
J. Agric. Food Chem., 2009, 57, 12, 5358-5364, https://doi.org/10.1021/jf900642x
. [all data]
Leela, Vipin, et al., 2009
Leela, N.K.; Vipin, T.M.; Shafeekh, K.M.; Priyanka, V.; Rema, J.,
Chemical composition of essential oils from aerial parts of Cinnamomum malabatrum (Burman f.) Bercht Presl.,
Flavor Fragr. J., 2009, 24, 1, 13-16, https://doi.org/10.1002/ffj.1910
. [all data]
Maggi, Bilek, et al., 2009
Maggi, F.; Bilek, T.; Lucarini, D.; Papa, F.; Sagratini, G.; Vittori, S.,
Melittis melissophyllum L. subsp. melissophylum (Lamiaceae) from central Italy: A new source of a mushrrom-like flavour,
Food Chem., 2009, 113, 1, 216-221, https://doi.org/10.1016/j.foodchem.2008.07.066
. [all data]
Mancini, Arnold, et al., 2009
Mancini, E.; Arnold, N.A.; De Martino, L.; De Feo, V.; Formisano, C.; Rigano, D.; Senatore, F.,
Chemical composition and phytotoxic effects of essential oils of Salvia hierosolymitana Boiss. and Salvia multicaulis Vahl. var. simplicifolia Boiss. growing wild in Lebanon,
Molecules, 2009, 14, 11, 4725-4736, https://doi.org/10.3390/molecules14114725
. [all data]
Mendes, Trindade, et al., 2009
Mendes, M.D.; Trindade, H.; Figueiredo, A.C.; Pedro, L.G.; Barroso, J.G.,
Chaerophyllum azoricun Trel. grown in the Azores archipelago, Portugal: evaluation of the genetic diversity using molecular markers and comparison with volatile oils profiles,
Flavour Fragr. J., 2009, 24, 5, 259-265, https://doi.org/10.1002/ffj.1939
. [all data]
Mendes, Trindade, et al., 2009, 2
Mendes, M.D.; Trindade, H.; Figueiredo, A.C.; Barroso, J.G.; Fontinha, S.S.; Pedro, L.G.,
Volatile and molecular characterization of two Portuguese endemic species: Angelica lignescens and Melanoselinium decipiens,
Biochen. Systematics Ecol., 2009, 37, 2, 98-105, https://doi.org/10.1016/j.bse.2008.12.006
. [all data]
Riahi, Pourbasheer, et al., 2009
Riahi, S.; Pourbasheer, E.; Ganjali, M.R.; Norouzi, P.,
Investigation of different linear and non-linear chemometric methods for modeling of retention index of essential oil components: Concerns to support vector mashine,
J. Hazard. Mat., 2009, 166, 2-3, 853-859, https://doi.org/10.1016/j.jhazmat.2008.11.097
. [all data]
Yang, Kim, et al., 2009
Yang, E.-J.; Kim, S.-S.; Oh, T.-H.; Baik, J.S.; Lee, N.H.; Hyun, C.-G.,
Essential oil of citrus fruit waste attenuates LPS-induced nitric oxide production and inhibits the growth of skin pathogens,
Int. J. Agriculture Biol., 2009, 791-794. [all data]
Yang, Yang, et al., 2009
Yang, Z.; Yang, W.; Peng, Q.; He, Q.; Feng, Y.; Luo, S.; Yu, Z.,
Volatile phytochemical composition of rhisome of ginger after extraction by headspace solid-phase microextraction, petrol ether extraction and steam distillation extraction,
Bangladesh J. Pharmacol., 2009, 4, 2, 136-143, https://doi.org/10.3329/bjp.v4i2.3232
. [all data]
Yu, Li, et al., 2009
Yu, L.-F.; Li, X.-R.; Liu, S.-Y.; Xu, G.-W.; Liang, Y.-Z.,
Comparative analysis of essential components between the herbal pair Radix Saposhnikoviae-Rhizoma seu Radix Notopterygii and its single herbs by GC-MS combined with a chemometric resolution method,
Anal. Methods, 2009, 1, 1, 45-51, https://doi.org/10.1039/b9ay00044e
. [all data]
Zellner, Amorim, et al., 2009
Zellner, B.D.; Amorim, A.C.L.; de Miranda A.L.P.; Alves, R.J.V.; Barbosa, J.P.; da Costa, G.L.; Rezende, C.M.,
Screening of the odor-activity and bioactiovity of the essential oils of leaves and flowers of Hyptis Passerina Mart. from the Brazilian Cerrado,
J. Braz. Chem. Soc., 2009, 20, 2, 322-332, https://doi.org/10.1590/S0103-50532009000200018
. [all data]
Costa, De Fina, et al., 2008
Costa, R.; De Fina, M.R.; Valentino, M.R.; Rustaiyan, A.; Dugo, P.; Dugo, G.; Mondello, L.,
An investigation on the volatile composition of some Artemisia species from Iran,
Flavour Fragr. J., 2008, 24, 2, 75-82, https://doi.org/10.1002/ffj.1919
. [all data]
Kannaste, Vongvanich, et al., 2008
Kannaste, A.; Vongvanich, N.; Borg-Karlson, A.-K.,
Infestation by a Nalepella species induces emissions of alpha- and beta-farnesenes, (-)-linalool and aromatic compounds in Norway spruce clones of different susceptibility to the large pine weevil,
Anthropod-Plant Interactions, 2008, 2, 1, 31-41, https://doi.org/10.1007/s11829-008-9029-4
. [all data]
Kilani, Ledauphin, et al., 2008
Kilani, S.; Ledauphin, J.; Bouhlel, I.; Ben Sghaier, M.; Boubaker, J.; Skandrani, I.; Mosrati, R.; Ghedira, K.; Barillier, D.; Chekir-Ghedira, L.,
Comparative study of Cyperus rotundus essential oil by a modified GC/MS analysis method. Evaluation of its antioxidantt, cytotoxic, and apoptoic effects,
Chem. Biodiversity, 2008, 5, 5, 729-742, https://doi.org/10.1002/cbdv.200890069
. [all data]
Kupcinskiene, Stikliene, et al., 2008
Kupcinskiene, E.; Stikliene, A.; Judzentiene, A.,
The essential oil guatitative composition in the needles of Pinus sylvestris L. growing along industrial transects,
Environ. Pollution, 2008, 155, 3, 481-491, https://doi.org/10.1016/j.envpol.2008.02.001
. [all data]
Ning, Zheng, et al., 2008
Ning, H.; Zheng, F.; Sun, B.; Xie, J.; Liu, Y.,
Solvent-free microwave extraction of essential oil from Zanthoxylum bungeanum Maxim.,
Food Environ. Ind. (Chinese), 2008, 34, 5, 179-184. [all data]
Nogueira, Marcelo-Curto, et al., 2008
Nogueira, T.; Marcelo-Curto, M.J.; Cristina Figueiredo, A.; Barroso, J.G.; Pedro, L.G.; Rubiolo, P.; Bicchi, C.,
Chemotaxonomy of Hypericum genus from Portugal: Geographical distribution and essential oils composition of Hypericum perfoliatum, Hypericum humifusum, Hypericum linarifolium and Hypericum pulchrum,
Biochem. Syst. Ecol., 2008, 36, 1, 40-50, https://doi.org/10.1016/j.bse.2007.07.004
. [all data]
Profitt, Schatz, et al., 2008
Profitt, M.; Schatz, B.; Bessiere, J.-M.; Chen, C.; Soler, C.; Hossaert-McKey, M.,
Signalling receptivity: comparison of the emission of volatile compounds by figs of Ficus hispida before, during and after the phase of receptivity to pollinators,
Symbiosis, 2008, 45, 1-10. [all data]
Qiao, Xie, et al., 2008
Qiao, Y.; Xie, B.J.; Zhang, Y.; Zhang, Y.; FAn, G.; Yao, X.L.; Pan, S.Y.,
Characterization of aroma active compounds in fruit juice and peel oil of Junchen sweet orange fruit (Citrus sinensis (L.) Osbeck) by GC-MS and GC-O,
Molecules, 2008, 13, 6, 1333-1344, https://doi.org/10.3390/molecules13061333
. [all data]
Santos, Costa, et al., 2008
Santos, P.O.; Costa, M. deJ.C.; Alves, J.A.B.; Nascimento, P.F.C.; de Melo, D.L.F.M.; Barbosa, A.M., Jr.; Trindade, R. de.C.; Blank, A.F.; Arrigoni-Blank, M.F.; Alves, P.B.; do Nascimento, M. da.P.F.,
Chemical composition and antimicrobial activity of the essential oil of Hyptis pectinata (L.) Poit.,
Quim. Nova., 2008, 31, 7, 1648-1652, https://doi.org/10.1590/S0100-40422008000700009
. [all data]
Silva, Doria, et al., 2008
Silva, W.L.; Doria, G.A.A.; Maia, R.T.; Nunes, R.S.; Carvalho, G.A.; Blank, A.F.; Alves, P.B.; Marcal, R.M.; Cavalcanti, S.C.H.,
Effects of essential oils on Aedes aegypti larvae: alternatives to environmentally safe insecticides,
Bioresource Technol., 2008, 99, 8, 3251-3255, https://doi.org/10.1016/j.biortech.2007.05.064
. [all data]
Xie, Sun, et al., 2008
Xie, J.; Sun, B.; Zheng, F.; Wang, S.,
Volatile flavor constituents in roasted pork of mini-pig,
Food Chem., 2008, 109, 3, 506-514, https://doi.org/10.1016/j.foodchem.2007.12.074
. [all data]
Zachariah, Leela, et al., 2008
Zachariah, T.J.; Leela, N.K.; Maya, K.M.; Rema, J.; Mathew, P.A.; Vipin, T.M.; Krishnamoorthy, B.,
Chemical composition of leaf oils of Myristica beddomeii (King), Myristica fragrans (Houtt.) and Myristica malabarica (Lamk.),
J. Spices Arom. Crops, 2008, 17, 1, 10-15. [all data]
Agabriel, Cornu, et al., 2007
Agabriel, C.; Cornu, A.; Journal, C.; Sibra, C.; Groller, C.; MArtin, B.,
Tanker milk variability according to farm feeding practices: vitamins A and E, carotenoids, color, and terpenoids,
J. Dairy Sci., 2007, 90, 10, 4884-4896, https://doi.org/10.3168/jds.2007-0171
. [all data]
Albuquerque M.R.J.R., Costa S.M.O., et al., 2007
Albuquerque M.R.J.R.; Costa S.M.O.; Bandeira P.N.; Santiago G.M.P.; Andrade-Neto M.; Silveira E.R.; Pessoa O.D.L.,
Nematicidal and larvicidal activities of the essential oils from aerial parts of Pectis oligocephala and Pectis apodocephala Baker,
An. Acad. Bras. Cienc., 2007, 79, 209-213. [all data]
Albuquerque, Vasconcelos Silva, et al., 2007
Albuquerque, R.L.; Vasconcelos Silva, M.G.; Machado, M.I.L.; Matos, F.J.A.; Morais, S.M.; Neto, J.S.,
Chemical composition and antioxidant activity of Plectranthus grandis and P. ornatus essential oils from north-eastern Brazil,
Flavour Fragr. J., 2007, 22, 1, 24-26, https://doi.org/10.1002/ffj.1730
. [all data]
Barra, Baldovini, et al., 2007
Barra, A.; Baldovini, N.; Loiseau, A.-M.; Albino, L.; Lesecq, C.; Cuvelier, L.L.,
Chemical analysis of French beans (Phaseolus vulgaris L.) by headspace solid phase microextraction (HS-SPME) and simultaneous distillation/extraction (SDE),
Food Chem., 2007, 101, 3, 1279-1284, https://doi.org/10.1016/j.foodchem.2005.12.027
. [all data]
Barra A., Coroneo V., et al., 2007
Barra A.; Coroneo V.; Dessi S.; Cabras P.; Angioni A.,
Characterization of the volatile constituents in the essential oil of Pistacia lentiscus L. from different origins and its antifungal and antioxidant activity,
J. Agric. Food Chem., 2007, 55, 17, 7093-7098, https://doi.org/10.1021/jf071129w
. [all data]
Cheriti, Saad, et al., 2007
Cheriti, A.; Saad, A.; Belboukhari, N.; Ghezali, S.,
The essential oil composition of Bubonium graveolens (Forssk.) Maire from the algerian Sahara,
Flavour Fragr. J., 2007, 22, 4, 286-288, https://doi.org/10.1002/ffj.1794
. [all data]
Chokeprasert P., Charles A.L., et al., 2007
Chokeprasert P.; Charles A.L.; Sue K.H.; Huang T.C.,
Volatile components of the leaves, fruits and seeds of wampee [Clausena lansium (Lour.) Skeels],
J. Food Comp. Anal., 2007, 20, 1, 52-56, https://doi.org/10.1016/j.jfca.2006.07.002
. [all data]
Cole, Haber, et al., 2007
Cole, R.A.; Haber, W.A.; Setzer, W.N.,
Chemical composition of essential oils of seven species of Eugenia from Monteverde, Costa Rica,
Biochem. Syst. Ecol., 2007, 35, 12, 877-886, https://doi.org/10.1016/j.bse.2007.06.013
. [all data]
Díaz-Maroto, Castillo, et al., 2007
Díaz-Maroto, M.C.; Castillo, N.; Castro-Vázquez, L.; González-Viñas, M.A.; Pérez-Coello, M.S.,
Volatile composition and olfactory profile of pennyroyal (Mentha pulegium L.) plants,
Flavour Fragr. J., 2007, 22, 2, 114-118, https://doi.org/10.1002/ffj.1766
. [all data]
Duschatzky, Almeida, et al., 2007
Duschatzky, C.B.; Almeida, N.V.; Possetto, M.; Michis, F.; Scappini, E.; Lampasona, M.P.; Shuff, C.,
Essential oil composition of Heterothalamus alienus (Spreng.) Kuntze (Romerillo) from Argentina. Effect of harvesting period on the essential oil composition,
Flavour Fragr. J., 2007, 22, 1, 39-41, https://doi.org/10.1002/ffj.1747
. [all data]
Eason and Setzer, 2007
Eason, H.M.; Setzer, W.N.,
BArk essential oil composition of Cedrela tinduzii C. DC. (Meliaceae) from Monteverde, Costa Rica,
Rec. NAt. Prod., 2007, 1, 2-3, 24-27. [all data]
Ferreira, Meireles de Sousa, et al., 2007
Ferreira, N.J.; Meireles de Sousa, I.G.; Luís, T.C.; Currais, A.J.M.; Figueiredo, C.; Cost, M.M.; Lima, A.S.B.; Santos, P.A.G.; Barroso, J.G.; Pedro, L.G.; Scheffer, J.J.C.,
Pittosporum undulatum Vent. grown in Portugal: secretory structures, seasonal variation and enantiomeric composition of its essential oil,
Flavour Fragr. J., 2007, 22, 1, 1-9, https://doi.org/10.1002/ffj.1748
. [all data]
Formisano, Mignola, et al., 2007
Formisano, C.; Mignola, E.; Rigano, D.; Senatore, F.; Bellone, G.; Bruno, M.; Rosselli, S.,
Chemical composition and antimicrobial activity of the essential oil from aerial parts of Micromeria fruticulosa (Bertol.) Grande (Lamiaceae) growing wild in Southern Italy,
Flavour Fragr. J., 2007, 22, 4, 289-292, https://doi.org/10.1002/ffj.1795
. [all data]
Hashemi, Abolghasemi, et al., 2007
Hashemi, P.; Abolghasemi, M.M.; Fakhari, A.R.; Ebrahimi, S.N.; Ahmadi, S.,
Hydrodistillation-Solvent Microextraction and GC-MS Identification of Volatile Components of Artemisia aucheri,
Chromatographia, 2007, 66, 3-4, 283-286, https://doi.org/10.1365/s10337-007-0289-4
. [all data]
Kamatou, Viljoen, et al., 2007
Kamatou, G.P.P.; Viljoen, A.M.; Figueiredo, A.C.; Tilney, P.M.; Van Zyl, R.L.; Barroso, J.G.; Pedro, L.G.; Van Vuuren, S.F.,
Trichomes, essential oil composition and biological activities of Salvia albanicus Benth. and S. dolomitica Codd, two species from the Cape region of Soith Africa,
South African J. Botany, 2007, 73, 1, 102-108, https://doi.org/10.1016/j.sajb.2006.08.001
. [all data]
Liu, Song, et al., 2007
Liu, L.; Song, G.; Hu, Y.,
GC?MS Analysis of the Essential Oils of Piper nigrum L. and Piper longum L.,
Chromatographia, 2007, 66, 9-10, 785-790, https://doi.org/10.1365/s10337-007-0408-2
. [all data]
Meekijjaroenroj, Bessière, et al., 2007
Meekijjaroenroj, A.; Bessière, J.-M.; Anstett, M.-C.,
Chemistry of floral scents in four Licuala species (Arecaceae),
Flavour Fragr. J., 2007, 22, 4, 300-310, https://doi.org/10.1002/ffj.1797
. [all data]
Merle, Verdeguer, et al., 2007
Merle, H.; Verdeguer, M.; Blázquez, M.A.; Boira, H.,
Chemical composition of the essential oils from Eriocephalus africanus L. var. africanus populations growing in Spain,
Flavour Fragr. J., 2007, 22, 6, 461-464, https://doi.org/10.1002/ffj.1821
. [all data]
Mockute, Bernotiene, et al., 2007
Mockute, D.; Bernotiene, G.; Judzentiene, A.,
The essential oil of Ground Ivy (Glechoma hederaceae L.) growing wild in Eastern Lithuania,
J. Essent. Oil Res., 2007, 19, 5, 449-451, https://doi.org/10.1080/10412905.2007.9699948
. [all data]
Moriarity, Bansal, et al., 2007
Moriarity, D.M.; Bansal, A.; Cole, R.A.; Takaku, S.; Haber, W.A.; Setzer, W.N.,
Selective cytotoxic activities of leaf essential oils from Monteverde Costa Rica,
Natural Product Communications, 2007, 2, 12, 1263-1268. [all data]
Moronkola, Ogunwande, et al., 2007
Moronkola, D.O.; Ogunwande, I.A.; Walker, T.M.; Setzer, W.N.; Oyewole, I.O.,
Identification of the main volatile compounds in the leaf and flower of Tithonia diversifolia (Hemsl) Gray,
J. Nat. Med., 2007, 61, 1, 63-66, https://doi.org/10.1007/s11418-006-0019-5
. [all data]
Mu, Wang, et al., 2007
Mu, R.; Wang, X.; Liu, S.; Yuan, X.; Wang, S.; Fan, Z.,
Rapid Determination of Volatile Compounds in Toona sinensis (A. Juss.) Roem. by MAE-HS-SPME Followed by GC-MS,
Chromatographia, 2007, 65, 7-8, 463-467, https://doi.org/10.1365/s10337-007-0183-0
. [all data]
Nivinsliene, Butkiene, et al., 2007
Nivinsliene, O.; Butkiene, R.; Gudalevic, A.; Mockute, D.; Meskauskiene, V.; Grigaliunaite, B.,
Influence of urban environment on chemical composition of Tilia cordata essential oil,
Chemija, 2007, 18, 1, 44-49. [all data]
Ozer H., Sokmen M., et al., 2007
Ozer H.; Sokmen M.; Gulluce M.; Adiguzel A.; Sahin F.; Sokmen A.; Kilic H.; Baris O.,
Chemical Composition and Antimicrobial and Antioxidant Activities of the Essential Oil and Methanol Extract of Hippomarathrum microcarpum (Bieb.) from Turkey,
J. Agric. Food Chem., 2007, 55, 3, 937-942, https://doi.org/10.1021/jf0624244
. [all data]
Proffit, 2007
Proffit, M.,
Mediation chimique et structuration des communautes d'hymenopteres parasites du mutualisme figuier / pollinisateur (These pour obtenir le grade de Docteur de l'Universite Montpellier II) (Dissertation), 2007. [all data]
Radusiene, Judzentiene, et al., 2007
Radusiene, J.; Judzentiene, A.; Peciulyte, D.; Janulis, V.,
Essential Oil Composition and Antimicrobial Assay of Acorus calamus Leaves from Different Wild Populations,
Plant Genetic Resources: Characterization and Utilization, 2007, 5, 1, 37-44, https://doi.org/10.1017/S1479262107390928
. [all data]
Rao, Maia, et al., 2007
Rao, V.S.; Maia, J.L.; Oliveira, F.A.; Lemos, T.L.G.; Chaves, M.H.; Santos, F.A.,
Composition and antinociceptive activity of the essential oil from Protium heptaphyllum resin,
Natural Product Communications, 2007, 2, 12, 1199-1202. [all data]
Rodrigues, Antunes, et al., 2007
Rodrigues, F.S.L.M.; Antunes, L.C.S.; Figueiredo, A.C.; Costa, M.M.; Pereira, J.D.S.; Colaço, R.D.R.; Miranda, H.H.S.; Barroso, J.G.; Pedro, L.G.; Scheffer, J.J.C.,
Composition of the leaf, flower and fruit volatile oils of Pittosporum tobira (Thunb.) W. T. Aiton grown in three locations in Portugal,
Flavour Fragr. J., 2007, 22, 4, 311-316, https://doi.org/10.1002/ffj.1798
. [all data]
Salamci, Kordali, et al., 2007
Salamci, E.; Kordali, S.; Kotan, R.; Cakir, A.; Kaya, Y.,
Chemical compositions, antimicrobial and herbicidal effects of essential oils isolated from Turkish Tanacetum aucheranum and Tanacetum chiliophyllum var. chiliophyllum,
Biochem. Syst. Ecol., 2007, 35, 9, 569-581, https://doi.org/10.1016/j.bse.2007.03.012
. [all data]
Serrano, Cornu, et al., 2007
Serrano, E.; Cornu, A.; Kondjoyan, N.; Figueredo, G.; Agabriel, J.; Micol, D.,
Terpene accumulation in muscle and fatty tissues of calves supplement with essential oils,
J. Animal Feed Sci., 2007, 16, 168-179. [all data]
Setzer, Stokes, et al., 2007
Setzer, W.N.; Stokes, S.L.; Penton, A.F.; Takaku, S.; Haber, W.A.; Hansell, E.; Caffrey, C.R.; McKerrow, J.H.,
Cruzain inhibitory activity of leaf essential oils of neotropical Lauraceae and essential oil components,
Natural Product Communications, 2007, 2, 12, 1203-1210. [all data]
Sharififar, Mozaffarian, et al., 2007
Sharififar, F.; Mozaffarian, V.; Moradkhani, S.,
Comparison of antioxidant and free radical scavenging activities of the essential oils from flowers and fruits of Otostegia persica Boiss.,
Pakistan J. Biol. Sci., 2007, 10, 21, 3895-3899, https://doi.org/10.3923/pjbs.2007.3895.3899
. [all data]
Suschke, Sporer, et al., 2007
Suschke, U.; Sporer, F.; Schneele, J.; Geiss, H.K.; Reichling, J.,
Antibacterial and Cytotoxic activity of Nepeta cataria L., Nepeta cataria var. citriodora (Beck.) Balb. and Melissa officinalis L. essential oils,
Natural Product Communications, 2007, 2, 12, 1277-1286. [all data]
Takaku, Haber, et al., 2007
Takaku, S.; Haber, W.A.; Setzer, W.N.,
Leaf essential oil composition of 10 species of Ocotea (Lauraceae) from Monteverde, Costa Rica,
Biochem. Syst. Ecol., 2007, 35, 8, 525-532, https://doi.org/10.1016/j.bse.2007.02.003
. [all data]
Yu, Huang, et al., 2007
Yu, Y.; Huang, T.; Yang, B.; Liu, X.; Duan, G.,
Development of gas chromatography-mass spectrometry with microwave distillation and simultaneous solid-phase microextraction for rapid determination of volatile constituents in ginger,
J. Pharm. Biomed. Anal., 2007, 43, 1, 24-31, https://doi.org/10.1016/j.jpba.2006.06.037
. [all data]
Albuquerque, Canuto, et al., 2006
Albuquerque, M.R.J.R.; Canuto, K.M.; Pessoa, O.D.L.; Nunes, E.P.; Nascimento, R.F.; Silveira, E.R.,
Essential oil composition of Verbesina diversifolia DC,
Flavour Fragr. J., 2006, 21, 4, 634-636, https://doi.org/10.1002/ffj.1632
. [all data]
Baris, Güllüce, et al., 2006
Baris, Ö.; Güllüce, M.; Sahin, F.; Özer, H.; Kilic, H.; Özkan, H.; Sökmen, M.; Özbek, T.,
Biological Activities of the Essential Oil and Methanol Extract of Achillea biebersteinii Afan. (Asteraceae),
Turk. J. Biol., 2006, 30, 65-73. [all data]
Chemat, Lucchesi, et al., 2006
Chemat, F.; Lucchesi, M.E.; Smadja, J.; Favretto, L.; Colnaghi, G.; Visinoni, F.,
Microwave accelerated steam distillation of essential oil from lavender: A rapid, clean and environmentally friendly approach,
Anal. Chim. Acta., 2006, 555, 1, 157-160, https://doi.org/10.1016/j.aca.2005.08.071
. [all data]
Deng, Xu, et al., 2006
Deng, C.; Xu, X.; Yao, N.; Li, N.; Zhang, X.,
Rapid determination of essential oil compounds in Artemisia Selengensis Turcz by gas chromatography-mass spectrometry with microwave distillation and simultaneous solid-phase microextraction,
Anal. Chim. Acta., 2006, 556, 2, 289-294, https://doi.org/10.1016/j.aca.2005.09.038
. [all data]
Figueiredo A.C., Barroso J.G., et al., 2006
Figueiredo A.C.; Barroso J.G.; Pedro L.G.; Fontinha S.S.; Sim-Sim M.; Sergio C.; Luis L.; Scheffers J.J.C.,
Asterella africana (Mont.) A. Evans grown on Madeira and in mainland Portugal: morphological data and composition of the essential oil,
Flavour Fragr. J., 2006, 21, 3, 534-538, https://doi.org/10.1002/ffj.1611
. [all data]
Formisano C., Senatore F., et al., 2006
Formisano C.; Senatore F.; Bruno M.; Bellone G.,
Chemical composition and antimicrobial activity of the essential oil of Phlomis ferruginea Ten. (Lamiaceae) growing wild in Southern Italy,
Flavour Fragr. J., 2006, 21, 5, 848-851, https://doi.org/10.1002/ffj.1740
. [all data]
Iriti, Colnaghi, et al., 2006
Iriti, M.; Colnaghi, G.; Chemat, F.; Smadja, J.; Faoro, F.; Visinoni, F.A.,
Histo-cytochemistry and scanning electron microscopy of lavender glandular trichomes following conventional and microwave-assisted hydrodistillation of essential oils: a comparative study,
Flavour Fragr. J., 2006, 21, 4, 704-712, https://doi.org/10.1002/ffj.1692
. [all data]
Jordan, Martinez, et al., 2006
Jordan, M.J.; Martinez, R.M.; Goodner, K.L.; Baldwin, E.A.; Sotomayor, J.A.,
Seasonal variation of Thymus hyemalis Lange and Spanish Thymus vulgaris L. essential oils composition,
Ind. Crops Prod., 2006, 24, 3, 253-263, https://doi.org/10.1016/j.indcrop.2006.06.011
. [all data]
Judzentiene and Buzelyte, 2006
Judzentiene, A.; Buzelyte, J.,
Chemical composition of essential oils of Artemisia vulgaris L. (mugwort) from North Lithuania,
Chemija, 2006, 17, 1, 12-15. [all data]
Li, Deng, et al., 2006
Li, N.; Deng, C.; Li, Y.; Ye, H.; Zhang, X.,
Gas chromatography-mass spectrometry following microwave distillation and headspace solid-phase microextraction for fast analysis of essential oil in dry traditional Chinese medicine,
J. Chromatogr. A, 2006, 1133, 1-2, 29-34, https://doi.org/10.1016/j.chroma.2006.08.046
. [all data]
de Lima, Maia, et al., 2006
de Lima, M.G.A.; Maia, I.C.C.; de Sousa, M.D.; de Morais, S.M.; Freitas, S.M.,
Effect of stalk and leaf extracts from euphorbiaceae species on Aedes aegypti (Diptera, culicidae) larvae,
Rev. Inst. Med. trop. S. Paulo, 2006, 48, 4, 211-214, https://doi.org/10.1590/S0036-46652006000400007
. [all data]
Lorenzo, Loayza, et al., 2006
Lorenzo, D.; Loayza, I.; Dellacassa, E.,
Composition and chiral characterization of the essential oil of Buddleja tucumanensis from Bolivia,
Flavour Fragr. J., 2006, 21, 1, 95-98, https://doi.org/10.1002/ffj.1526
. [all data]
Martinez, Madrid, et al., 2006
Martinez, S.; Madrid, J.; Hernández, F.; Megias, M.D.; Sotomayor, J.A.; Jordan, M.J.,
Effect of thyme essential oils (Thymus hyemalis and Thymus zygis) and Monensin on in Vitro Ruminal degradation and volatile fatty acid production,
J. Agric. Food Chem., 2006, 54, 18, 6598-6602, https://doi.org/10.1021/jf060985p
. [all data]
Mockute, Bernotiene, et al., 2006
Mockute, D.; Bernotiene, G.; Judzentiene, A.,
Germacrene D chemotype of essential oils of Leonurus cardiaca L. growing wild in Vilnus district (Lithuania),
J. Essent. Oil Res., 2006, 18, 5, 566-568, https://doi.org/10.1080/10412905.2006.9699169
. [all data]
Navickiene, Morandim, et al., 2006
Navickiene, H.M.D.; Morandim, A.A.; Alécio, A.C.; Regasini, L.O.; Bergamo, D.C.B.; Telascrea, M.; Cavalheiro, A.J.; Lopes, M.N.; Bolzani, V.S.; Furlan, M.; Marques, M.O.M.; Young, M.C.M.; Kato, M.J.,
Composition and antifungal activity of essential oils from Piper aduncum, Piper arboreum and Piper tuberculatum,
Quim. Nova, 2006, 29, 3, 467-470, https://doi.org/10.1590/S0100-40422006000300012
. [all data]
Santos, Nunes, et al., 2006
Santos, R.P.; Nunes, E.P.; Nascimento, R.F.; Santiago, G.M.P.; Menezes, G.H.A.; Silveira, E.R.; Pessoa, O.D.L.,
Chemical Composition and Larvicidal Activity of the Essential Oils of Cordia leucomalloides and Cordia curassavica from the Northeast of Brazil,
J. Braz. Chem. Soc., 2006, 17, 5, 1027-1030, https://doi.org/10.1590/S0103-50532006000500030
. [all data]
Schmidt, Noletto, et al., 2006
Schmidt, J.M.; Noletto, J.A.; Vogler, B.; Setzer, W.N.,
Abaco Bush Medicine: Chemical composition of the essential oils of four aromatic medicinal plants from Abaco Island, Bahamas,
J. Herbs, Spices Medicinal Plants, 2006, 12, 3, 43-65, https://doi.org/10.1300/J044v12n03_04
. [all data]
Senatore, Apostolides Arnold, et al., 2006
Senatore, F.; Apostolides Arnold, N.; Piozzi, F.; Formisano, C.,
Chemical composition of the essential oil of Salvia microstegia Boiss. et Balansa growing wild in Lebanon,
J. Chromatogr. A, 2006, 1108, 2, 276-278, https://doi.org/10.1016/j.chroma.2006.01.066
. [all data]
Singh, Marimuthu, et al., 2006
Singh, G.; Marimuthu, P.; de Heluani, C.S.; Catalan, C.A.N.,
Antioxidant and biocidal activities of Carum nigrum (seed) essential oil, oleoresin, and their selected components,
J. Agric. Food Chem., 2006, 54, 1, 174-181, https://doi.org/10.1021/jf0518610
. [all data]
Singh G., Maurya S., et al., 2006
Singh G.; Maurya S.; de Lampasona M.P.; Catalan C.A.N.,
Studies on essential oils, Part 41. Chemical composition, antifungal, antioxidant and sprout suppressant activities of coriander (Coriandrum sativum) essential oil and its oleoresin,
Flavour Fragr. J., 2006, 21, 3, 472-479, https://doi.org/10.1002/ffj.1608
. [all data]
Srivastava, Mallavarapu, et al., 2006
Srivastava, S.; Mallavarapu, G.R.; Rai, S.K.; Singh, D.; Mishra, R.; Pandey-Rai, S.; Kumar, S.,
Composition of the essential oils of the leaves and flowers of Rhus mysurensis Heyne ex Wight Arn growing in the Aravalli mountain range at New Delhi,
Flavour Fragr. J., 2006, 21, 2, 228-229, https://doi.org/10.1002/ffj.1561
. [all data]
Tognolini, Barocelli, et al., 2006
Tognolini, M.; Barocelli, E.; Ballabeni, V.; Bruni, R.; Bianchi, A.; Chiavarini, M.; Impicciatore, M.,
Comparative screening of plant essential oils: Phenylpropanoid moiety as basic core for antiplatelet activity,
Life Sciences, 2006, 78, 13, 1419-1432, https://doi.org/10.1016/j.lfs.2005.07.020
. [all data]
Tuberoso, Barra, et al., 2006
Tuberoso, C.I.G.; Barra, A.; Angioni, A.; Sarritzu, E.; Pirisi, F.M.,
Chemical Composition of Volatiles in Sardinian Myrtle (Myrtus communis L.) Alcoholic Extracts and Essential Oils,
J. Agric. Food Chem., 2006, 54, 4, 1420-1426, https://doi.org/10.1021/jf052425g
. [all data]
Xie, Sun, et al., 2006
Xie, J.; Sun, B.; Yu, M.,
Constituents of top fragrance from fresh flowers of Robinia Pseudoacacia L. occurring in China,
Flavour Fragr. J., 2006, 21, 5, 798-800, https://doi.org/10.1002/ffj.1720
. [all data]
Al-Burtamani, Fatope, et al., 2005
Al-Burtamani, S.K.S.; Fatope, M.O.; Marwah, R.G.; Onifade, A.K.; Al-Saidi, S.H.,
Chemical composition, antibacterial and antifungal activities of the essential oil of Haplophyllum tuberculatum from Oman,
J. Ethnopharmacol., 2005, 96, 1-2, 107-112, https://doi.org/10.1016/j.jep.2004.08.039
. [all data]
Belhattab, Larous, et al., 2005
Belhattab, R.; Larous, L.; Figueiredo, A.C.; Santos, P.A.G.; Barroso, J.G.; Pedro, L.G.,
Origanum glandulosum Desf. grown wild in Algeria: essential oil composition and glycosidic bound volatiles,
Flavour Fragr. J., 2005, 20, 2, 209-212, https://doi.org/10.1002/ffj.1387
. [all data]
Blunden, Aneja, et al., 2005
Blunden, J.; Aneja, V.P.; Lonneman, W.A.,
Characterization of non-methane volatile organic compounds at swine facilities in eastern North Carolina,
Atm. Environ., 2005, 39, 36, 6707-6718, https://doi.org/10.1016/j.atmosenv.2005.03.053
. [all data]
Butkienë, Nivinskienë, et al., 2005
Butkienë, R.; Nivinskienë, O.; Mockutë, D.,
α-Pinene chemotype of leaf (needle) essential oils of Juniperus communis L. growing wild in Vilnius district,
Chemija, 2005, 16, 1, 53-60. [all data]
Cysne, Canuto, et al., 2005
Cysne, J.B.; Canuto, K.M.; Pessoa, O.D.L.; Nunes, E.P.; Silveira, E.R.,
Leaf essential oils of four Piper species from the State of Ceará - Northeast of Brazil,
J. Braz. Chem. Soc., 2005, 16, 6B, 1378-1381, https://doi.org/10.1590/S0103-50532005000800012
. [all data]
Deng, Yao, et al., 2005
Deng, C.; Yao, N.; Wang, A.; Zhang, X.,
Determination of essential oil in a traditional Chinese medicine, Fructus amomi by pressurized hot water extraction followed by liquid-phase microextraction and gas chromatography-mass spectrometry,
Anal. Chim. Acta., 2005, 536, 1-2, 237-244, https://doi.org/10.1016/j.aca.2004.12.044
. [all data]
Eyres, Dufour, et al., 2005
Eyres, G.; Dufour, J.-P.; Hallifax, G.; Sotheeswaran, S.; Marriott, P.J.,
Identification of character-impact odorants in coriander and wild coriander leaves using gas chromatography-olfactometry (GCO) and comprehensive two-dimensional gas chromatography-time-of-flight mass spectrometry (GC×GC-TOFMS),
J. Sep. Sci., 2005, 28, 9-10, 1061-1074, https://doi.org/10.1002/jssc.200500012
. [all data]
Faleio, Miguel, et al., 2005
Faleio, L.; Miguel, G.; Gomes, S.; Costa, L.; Venancio, F.; Teixeira, A.; Figueiredo, A.C.; Barroso, J.G.; Pedro, L.G.,
Antibacterial and Antioxidant Activities of Essential Oils Isolated from Thymbra capitata L. (Cav.) and Origanum vulgare L.,
J. Agric. Food Chem., 2005, 53, 21, 8162-8168, https://doi.org/10.1021/jf0510079
. [all data]
Figueiredo, Sim-Sim, et al., 2005
Figueiredo, A.C.; Sim-Sim, M.; Costa, M.M.; Barroso, J.G.; Pedro, L.G.; Esquível, M.G.; Gutierres, F.; Lobo, C.; Fontinha, S.,
Comparison of the essential oil composition of four Plagiochila species: P. bifaria, P. maderensis, P. retrorsa and P. stricta,
Flavour Fragr. J., 2005, 20, 6, 703-709, https://doi.org/10.1002/ffj.1627
. [all data]
Hamm, Bleton, et al., 2005
Hamm, S.; Bleton, J.; Connan, J.; Tchapla, A.,
A chemical investigation by headspace SPME and GC-MS of volatile and semi-volatile terpenes in various olibanum samples,
Phytochemistry, 2005, 66, 12, 1499-1514, https://doi.org/10.1016/j.phytochem.2005.04.025
. [all data]
Himanen, Vuorinen, et al., 2005
Himanen, S.; Vuorinen, T.; Tuovinen, T.; Holopainen, J.K.,
Effects of Cyclamen Mite (Phytonemus pallidus) and Leaf Beetle (Galerucella tenella) Damage on Volatile Emission from Strawberry (Fragaria ´ ananassa Duch.) Plants and Orientation of Predatory Mites (Neoseiulus cucumeris, N. californicus, and Euseius finlandicus),
J. Agric. Food Chem., 2005, 53, 8624-8630. [all data]
Iraqi, Vermeulen, et al., 2005
Iraqi, R.; Vermeulen, C.; Benzekri, A.; Bouseta, A.; Collin, S.,
Screening for key odorants in Moroccan green olives by gas chromatography-olfactometry/aroma extract dilution analysis,
J. Agric. Food Chem., 2005, 53, 4, 1179-1184, https://doi.org/10.1021/jf040349w
. [all data]
Judzentiene and Mockute, 2005
Judzentiene, A.; Mockute, D.,
The inflorescence and leaf essential oils of Tanacetum vulgare L. var. vulgare growing wild in Lithuania,
Biochem. Syst. Ecol., 2005, 33, 5, 487-498, https://doi.org/10.1016/j.bse.2004.11.003
. [all data]
Kordali, Kotan, et al., 2005
Kordali, S.; Kotan, R.; Mavi, A.; Cakir, A.; Ala, A.; Yildirim, A.,
Determination of the chemical composition and antioxidant activity of the essential oil of Artemisia dracunculus and of the antifungal and antibacterial activities of Turkish Artemisia absinthium, A. dracunculus, Artemisia santonicum, and Artemisia spicigera essential oils,
J. Agric. Food Chem., 2005, 53, 9452-9458. [all data]
Koutsoudaki, Krsek, et al., 2005
Koutsoudaki, C.; Krsek, M.; Rodger, A.,
Chemical composition and antibacterial activity of the essential oil and the gum of pistacia lentiscus Var. chia,
J. Agric. Food Chem., 2005, 53, 20, 7681-7685, https://doi.org/10.1021/jf050639s
. [all data]
Nivinskienë, Butkienë, et al., 2005
Nivinskienë, O.; Butkienë, R.; Mockutë, D.,
Chemical composition of seed (fruit) essential oils of Angelica archangelica L. growing wild in Lithuania,
Chemija, 2005, 16, 3-4, 51-54. [all data]
Novak, Draxler, et al., 2005
Novak, J.; Draxler, L.; Göhler, I.; Franz, C.M.,
Essential oil composition of Vitex agnus-castus - comparison of accessions and different plant organs,
Flavour Fragr. J., 2005, 20, 2, 186-192, https://doi.org/10.1002/ffj.1404
. [all data]
Omidbaigi and Bastan, 2005
Omidbaigi, R.; Bastan, M.R.,
Essential oil content and composition of marjoram cultivated in north of Iran,
JEOBP, 2005, 8, 1, 56-60. [all data]
Özer, Sahín, et al., 2005
Özer, H.; Sahín, F.; Kilic, H.; Güllüce, M.,
Essential oil composition of Hyssopus officinalis L. subsp. angustifolius (Bieb.) Arcangeli from Turkey,
Flavour Fragr. J., 2005, 20, 1, 42-44, https://doi.org/10.1002/ffj.1421
. [all data]
Pino, Marbot, et al., 2005, 2
Pino, J.A.; Marbot, R.; Rosado, A.; Vázquez, C.,
Volatile constituents of Malay rose apple [Syzygium malaccense (L.) Merr. Perry],
Flavour Fragr. J., 2005, 20, 98-100. [all data]
Radudienë, Judpintienë, et al., 2005
Radudienë, J.; Judpintienë, A.; Peèiulytë, D.; Janulis, V.,
Chemical composition of essential oil and antimicrobial activity of Origanum vulgare,
Biologija, 2005, 4, 53-58. [all data]
Singh, Maurya, et al., 2005
Singh, G.; Maurya, S.; Catalan, C.; de Lampasona, M.P.,
Studies on essential oils, Part 42: chemical, antifungal, antioxidant and sprout suppressant studies on ginger essential oil and its oleoresin,
Flavour Fragr. J., 2005, 20, 1, 1-6, https://doi.org/10.1002/ffj.1373
. [all data]
Steinhaus and Schieberle, 2005
Steinhaus, M.; Schieberle, P.,
Characterization of odorants causing an atypical aroma in white pepper powder (Piper nigrum L.) based on quantitative measurements and orthonasal breakthrough thresholds,
J. Agric. Food Chem., 2005, 53, 15, 6049-6055, https://doi.org/10.1021/jf0506030
. [all data]
Touafek, Nacer, et al., 2005
Touafek, O.; Nacer, A.; Kabouche, A.; Kabouche, Z.,
Analysis of the Essential Oil of Algerian Hypericum perfoliatum (L),
Flavour Fragr. J., 2005, 20, 6, 669-670, https://doi.org/10.1002/ffj.1545
. [all data]
Albuquerque, Souza, et al., 2004
Albuquerque, M.R.J.R.; Souza, E.B.; Lins, M.U.D.S.; Nogueira, N.A.P.; Lemos, T.L.G.; Silveira, E.R.; Pessoa, O.D.L.,
Composition and antimicrobial activity of the essential oil from aerial parts of Baccharis trinervis (Lam.) Pers.,
Arkivoc, 2004, 6, 6, 59-65, https://doi.org/10.3998/ark.5550190.0005.608
. [all data]
de Andrade, Bezerra, et al., 2004
de Andrade, I.L.; Bezerra, J.N.S.; Lima, M.A.A.; de Faria, R.A.P.G.; Lima, M.A.S.; Andrade-Neto, M.,
Chemical composition and insecticidal activity of essential oils from Vanillosmopsis pohlii baker against Bemisia argentifolii,
J. Agric. Food Chem., 2004, 52, 19, 5879-5881, https://doi.org/10.1021/jf049788l
. [all data]
Barros-Filho, Nunes, et al., 2004
Barros-Filho, B.A.; Nunes, F.M.; de Oliveira, M.C.F.; Mafezoli, J.; Andrade-Neto, M.; Silveira, E.R.; Pirani, J.R.,
Volatile constituents from Esenbeckia almawillia (Rutaceae),
Biochem. Syst. Ecol., 2004, 32, 9, 817-821, https://doi.org/10.1016/j.bse.2004.02.003
. [all data]
Butkienë, Nivinskienë, et al., 2004
Butkienë, R.; Nivinskienë, O.; Mockutë, D.,
Chemical composition of unripe and ripe berry essential oils of Juniperus communis L. growing wild in Vilnius district,
Chemija, 2004, 15, 4, 57-63. [all data]
Cavalcanti, de Morais, et al., 2004
Cavalcanti, E.S.B.; de Morais, S.M.; Lima, M.A.A.; Santana, E.W.P.,
Larvicidal activity of essential oils from Brazilian plants against Aedes aegypti L.,
Mem. Inst. Oswaldo Cruz., 2004, 99, 5, 541-544, https://doi.org/10.1590/S0074-02762004000500015
. [all data]
Couladis, Özcan, et al., 2004
Couladis, M.; Özcan, M.; Tzakou, O.; Akgül, A.,
Menengic (Pistacia terebinthus L.) agacinin degisik organlarinda ucucu yag bilesimi, Bitkisel Ilac Hammaddeleri Toplantisi, Bildiriler, 29-31 Mayis 2002, 2004, 6. [all data]
Deng, Li, et al., 2004
Deng, C.; Li, N.; Zhang, X.,
Rapid determination of essential oil in Acorus tatarinowii Schott. by pressurized hot water extraction followed by solid-phase microextraction and gas chromatography-mass spectrometry,
J. Chromatogr. A, 2004, 1059, 1-2, 149-155, https://doi.org/10.1016/j.chroma.2004.10.005
. [all data]
El-Shazily, Hafez, et al., 2004
El-Shazily, A.M.; Hafez, S.S.; Wink, M.,
Comparative study of the essential oils and extracts of Achillea fragrantissima (Forssk.) Sch. Bip. and Achillea santolina L. (Asteraceae) from Egypt,
Pharmazie, 2004, 59, 226-230. [all data]
El-Shazly and Hussein, 2004
El-Shazly, A.M.; Hussein, K.T.,
Chemical analysis and biological activities of the essential oil of Teucrium leucocladum Boiss. (Lamiaceae),
Biochem. Syst. Ecol., 2004, 32, 7, 665-674, https://doi.org/10.1016/j.bse.2003.12.009
. [all data]
Garcia-Estaban, Ansorena, et al., 2004
Garcia-Estaban, M.; Ansorena, D.; Astiasaran, I.; Martin, D.; Ruiz, J.,
Comparison of simultaneous distillation extraction (SDE) and solid-phase microextraction (SPME) for the analysis of volatile compounds in dry-cured ham,
J. Sci. Food Agric., 2004, 84, 11, 1364-1370, https://doi.org/10.1002/jsfa.1826
. [all data]
Garcia-Estaban, Ansorena, et al., 2004, 2
Garcia-Estaban, M.; Ansorena, D.; Astiasarán, I.; Ruiz, J.,
Study of the effect of different fiber coatings and extraction conditions on dry cured ham volatile compounds extracted by solid-phase microextraction (SPME),
Talanta, 2004, 64, 2, 458-466, https://doi.org/10.1016/j.talanta.2004.03.007
. [all data]
Hafez and Abdel-Salam, 2004
Hafez, S.S.; Abdel-Salam, H.A.,
chemical composition and antimicrobial activity of the volatile constituents of thuja occidentalis L. growing in Egipt,
Alexandria J. Pharm. Sci., 2004, 18, 1, 41-47. [all data]
Hamm, Bleton, et al., 2004
Hamm, S.; Bleton, J.; Tchapla, A.,
Headspace solid phase microextraction for screening for the presence of resins in Egyptian archaeological samples,
J. Sep. Sci., 2004, 27, 3, 235-243, https://doi.org/10.1002/jssc.200301611
. [all data]
Judpentienë and Mockutë, 2004
Judpentienë, A.; Mockutë, D.,
Chemical composition of essential oils produced by pink flower inflorescences of wild Achillea millefolium L.,
Chemija, 2004, 15, 28-32. [all data]
Judpentienë and Mockutë, 2004, 2
Judpentienë, A.; Mockutë, D.,
Chemical composition of essential oils of Artemisia absinthium L. (wormwood) growing wild in Vilnius,
Chemija, 2004, 15, 4, 64-68. [all data]
Letchamo, Ward, et al., 2004
Letchamo, W.; Ward, W.; Heard, B.; Heard, D.,
Essential oil of Valeriana officinalis L. cultivars and their antimicrobial activity as influenced by harvesting time under commercial organic cultivation,
J. Agric. Food Chem., 2004, 52, 12, 3915-3919, https://doi.org/10.1021/jf0353990
. [all data]
Lo Cantore, Iacobellis, et al., 2004
Lo Cantore, P.; Iacobellis, N.S.; de Marco, A.; Capasso, F.; Senatore, F.,
Antibacterial activity of Coriandrum sativum L. and Foeniculum vulgare Miller Var. vulgare (Miller) essential oils,
J. Agric. Food Chem., 2004, 52, 26, 7862-7866, https://doi.org/10.1021/jf0493122
. [all data]
Miguel, Simões, et al., 2004
Miguel, G.; Simões, M.; Figueiredo, A.C.; Barroso, J.G.; Pedro, L.G.; Carvalho, L.,
Composition and antioxidant activities of the essential oils of Thymus caespititius, Thymus camphoratus and Thymus mastichina,
Food Chem., 2004, 86, 2, 183-188, https://doi.org/10.1016/j.foodchem.2003.08.031
. [all data]
Mockutë, Bernotienë, et al., 2004
Mockutë, D.; Bernotienë, G.; Judbentienë, A.,
Chemical composition of essential oils of Origanum vulgare L. growing in Lithuania,
Biologija, 2004, 4, 44-49. [all data]
Mockutë, Judbentienë, et al., 2004
Mockutë, D.; Judbentienë, A.; Bernotienë, G.,
Volatile constituents of cultivated Origanum vulgare L. inflorescences and leaves,
Chemija, 2004, 15, 1, 33-37. [all data]
Moretti, Madonia, et al., 2004
Moretti, V.M.; Madonia, G.; Diaferia, C.; Mentasti, T.; Paleari, M.A.; Panseri, S.; Pirone, G.; Gandini, G.,
Chemical and microniological parameters and sensory attributes of a typical Sicilian salami ripened in different conditions,
Meat Sci., 2004, 66, 4, 845-854, https://doi.org/10.1016/j.meatsci.2003.08.006
. [all data]
Senatore, Apostolides Arnold, et al., 2004
Senatore, F.; Apostolides Arnold, N.; Piozzi, F.,
Chemical composition of the essential oil of Salvia multicaulis Vahl. var. simplicifolia Boiss. growing wild in Lebanon,
J. Chromatogr. A, 2004, 1052, 1-2, 237-240, https://doi.org/10.1016/j.chroma.2004.08.095
. [all data]
Silva, Matos, et al., 2004
Silva, M.G. deV.; Matos, F.J. de.A.; Lopes, P.R.O.; Silva, F.O.; Holanda, M.T.,
Composition of Essential Oils from Three Ocimum Species Obtained by Steam and Microwave Distillation and Supercritical CO2 Extraction,
ARKIVOS, 2004, 6, 6, 66-71, https://doi.org/10.3998/ark.5550190.0005.609
. [all data]
Singh, Marimuthu, et al., 2004
Singh, G.; Marimuthu, P.; Catalan, C.; deLampasona, M.P.,
Chemical, antioxidant and antifungal activities of volatile oil of black pepper and its acetone extract,
J. Sci. Food Agric., 2004, 84, 14, 1878-1884, https://doi.org/10.1002/jsfa.1863
. [all data]
Singh, Maurya, et al., 2004
Singh, G.; Maurya, S.; Catalan, C.; de Lampasona, M.P.,
Chemical constituents, antifungal and antioxidative effects of ajwain essential oil and Its acetone extract,
J. Agric. Food Chem., 2004, 52, 11, 3292-3296, https://doi.org/10.1021/jf035211c
. [all data]
Sotomayor, Martínez, et al., 2004
Sotomayor, J.A.; Martínez, R.M.; García, A.J.; Jordán, M.J.,
Thymus zygis Subsp. Gracilis: watering level effect on phytomass production and essential oil quality,
J. Agric. Food Chem., 2004, 52, 17, 5418-5424, https://doi.org/10.1021/jf0496245
. [all data]
Tepe, Donmez, et al., 2004
Tepe, B.; Donmez, E.; Unlu, M.; Candan, F.; Daferera, D.; Vardar-Unlu, G.; Polissiou, M.; Sokmen, A.,
Antimicrobial and antioxidative activities of the essential oils and methanol extracts of Salvia cryptantha (Montbret et Aucher ex Benth.) and Salvia multicaulis (Vahl),
Food Chem., 2004, 84, 4, 519-525, https://doi.org/10.1016/S0308-8146(03)00267-X
. [all data]
Touafek, Nacer, et al., 2004
Touafek, O.; Nacer, A.; Kabouce, A.; Kabouche, Z.; Bruneau, C.,
Chemical composition of the essential oil of Rosmarinus officinalis cultivated in the Algerian sahara,
Chem. Nat. Compd. (Engl. Transl.), 2004, 40, 1, 28-29, https://doi.org/10.1023/B:CONC.0000025460.78222.69
. [all data]
Vinogradov, 2004
Vinogradov, B.A.,
Production, composition, properties and application of essential oils, 2004, retrieved from http://viness.narod.ru. [all data]
Buettner, Mestres, et al., 2003
Buettner, A.; Mestres, M.; Fischer, A.; Guasch, J.; Schieberle, P.,
Evaluation of the most odour-active compounds in the peel oil of clementines ( citrus reticulata blanco cv. clementine),
Eur. Food Res. Technol., 2003, 216, 11-14. [all data]
Faleiro, Miguel, et al., 2003
Faleiro, M.L.; Miguel, M.G.; Ladeiro, F.; Venancio, F.; Tavares, R.; Brito, J.C.; Figueiredo, A.C.; Barroso, J.G.; Pedro, L.G.,
Antimicrobial activity of essential oils isolated from Portuguese endemic species of Thymus,
Lett. Appl. Microbiol., 2003, 36, 1, 35-40, https://doi.org/10.1046/j.1472-765X.2003.01259.x
. [all data]
Güllüce, Sökmen, et al., 2003
Güllüce, M.; Sökmen, M.; Daferera, D.; Agar, G.; Özkan, H.; Kartal, N.; Polissiou, M.; Sökmen, A.; Sahín, F.,
In vitro antibacterial, antifungal, and antioxidant activities of the essential oil and methanol extracts of herbal parts and callus cultures of Satureja hortensis L.,
J. Agric. Food Chem., 2003, 51, 14, 3958-3965, https://doi.org/10.1021/jf0340308
. [all data]
Hamm, Lesellier, et al., 2003
Hamm, S.; Lesellier, E.; Bleton, J.; Tchapla, A.,
Optimization of headspace solid phase microextraction for gas chromatography/mass spectrometry analysis of widely different volatility and polarity terpenoids in olibanum,
J. Chromatogr. A, 2003, 1018, 1, 73-83, https://doi.org/10.1016/j.chroma.2003.08.027
. [all data]
Jordán, Margaría, et al., 2003
Jordán, M.J.; Margaría, C.A.; Shaw, P.E.; Goodner, K.L.,
Volatile components and aroma active compounds in aqueous essence and fresh pink guava fruid puree (Psidium guajava L.) by GC-MS and multidimensional GC/GC-O,
J. Agric. Food Chem., 2003, 51, 5, 1421-1426, https://doi.org/10.1021/jf020765l
. [all data]
Jordán, Martínez, et al., 2003
Jordán, M.J.; Martínez, R.M.; Cases, M.A.; Sotomayor. J.A.,
Watering level effect on Thymus hyemalis lange essential oil yield and composition,
J. Agric. Food Chem., 2003, 51, 18, 5420-5427, https://doi.org/10.1021/jf034335m
. [all data]
Mockute, Bernotiene, et al., 2003
Mockute, D.; Bernotiene, G.; Judzentiene, A.,
Volatile compounds of the aerial parts of wild St. John's wort (Hypericum perforatum L.) plants,
Chemija, 2003, 14, 3, 108-111. [all data]
Mockute and Judzentiene, 2003, 2
Mockute, D.; Judzentiene, A.,
The myrtenol chemotype of essential oil of Tanacetum vulgare L. var. vulgare (tansy) growing wild in the Vilnius region,
Chemija, 2003, 14, 2, 103-107. [all data]
Mockute, Nivinskiene, et al., 2003
Mockute, D.; Nivinskiene, O.; Bernotiene, G.; Butkiene, R.,
The cis-thujone chemotype of Salvia officinalis L. essential oils,
Chemija, 2003, 14, 4, 216-220. [all data]
Silva, Matos, et al., 2003
Silva, M.G.V.; Matos, F.J.A.; Machado, M.I.L.; Craveiro, A.A.,
Essential oils of Ociumum basilicum L., O. basilicum. var. minimum L. and O. basilicum. var. purpurascens Benth. grown in north-eastern Brazil,
Flavour Fragr. J., 2003, 18, 1, 13-14, https://doi.org/10.1002/ffj.1134
. [all data]
Singh, Singh, et al., 2003
Singh, G.; Singh, O.P.; de Lampasona, M.P.; Catalán, C.A.N.,
Studies on essential oils. Part 35: chemical and biocidal investigations on Tagetes erecta leaf volatile oil,
Flavour Fragr. J., 2003, 18, 1, 62-65, https://doi.org/10.1002/ffj.1158
. [all data]
Usai, Atzei, et al., 2003
Usai, M.; Atzei, A.; Pintore, G.; Casanova, I.,
Composition and variability of the essential oil of Sardinian Thymus herba-barona Loisel,
Flavour Fragr. J., 2003, 18, 1, 21-25, https://doi.org/10.1002/ffj.1137
. [all data]
Veres, Varga, et al., 2003
Veres, K.; Varga, E.; Dobos, Á.; Hajdú, Zs.; Máthé, I.; Németh, É.; Szabó, K.,
Investigation of the composition and stability of the essential oils of origanum vulgare ssp. vulgare L. and O. vulgare ssp. hirtum (Link) letswaart,
Chromatographia, 2003, 57, 1/2, 95-98, https://doi.org/10.1007/BF02497483
. [all data]
Jordán, Margaría, et al., 2002
Jordán, M.J.; Margaría, C.A.; Shaw, P.E.; Goodner, K.L.,
Aroma active components in aqueous kiwi fruit essence and kiwi fruit puree by GC-MS and multidimensional GC/GC-O,
J. Agric. Food Chem., 2002, 50, 19, 5386-5390, https://doi.org/10.1021/jf020297f
. [all data]
Kilic, 2002
Kilic, A.,
Volatile compounds of buds, flowers and fruits of bay (Laurus nobilis L.) and their odour contribution,
Proc. ICNP-2002 - Trabzon/Turkiye, 2002, 338-341. [all data]
Li, Wu, et al., 2002
Li, C.; Wu, H.; Yang, L.; ren, Y.,
Study of the composition of ginger oil from Laifeng,
Flavour Fragr. Cosmetics, 2002, 5, 15-17. [all data]
Mockute and Judzentiene, 2002
Mockute, D.; Judzentiene, A.,
Chemotypes of the essential oils of Achillea millefolium L. ssp. millefolium growing wild in Eastern Lithuania,
Chemija, 2002, 13, 3, 168-173. [all data]
Mockute and Judzentiene, 2002, 2
Mockute, D.; Judzentiene, A.,
Chemical composition of the essential oils of Achillea millefolium L. ssp. millefolium (yarrow) growing wild in Vilnius,
Chemija, 2002, 13, 2, 97-102. [all data]
Morteza-Semnani and Vahedi, 2002
Morteza-Semnani, K.; Vahedi, M.,
Volatile constituents of Iranian Hypericum perforatum L.,
Proceedings of ICNP-2002 - Trabzon/Turkiye, 2002, 342-344. [all data]
Nogueira and Romano, 2002
Nogueira, J.M.F.; Romano, A.,
Essential oils from micropropagated plants of Lavandula viridis,
Phytochem. Anal., 2002, 13, 1, 4-7, https://doi.org/10.1002/pca.609
. [all data]
Pessoa, Morais, et al., 2002
Pessoa, L.M.; Morais, S.M.; Bevilaqua, C.M.L.; Luciano, J.H.S.,
Anthelmintic activity of essential oil of Ocimum gratissimum Linn. and eugenol against Haemonchus contortus,
Vet. Parasitol., 2002, 109, 1-2, 59-63, https://doi.org/10.1016/S0304-4017(02)00253-4
. [all data]
Viana, Andrade-Neto, et al., 2002
Viana, F.A.; Andrade-Neto, M.; Pouliquen, Y.B.M.; Lucien, V.G.,
Chemical composition of the essential oil from roots of Philodendron acutatum Schott.,
J. Essent. Oil Res., 2002, 14, 3, 172-174, https://doi.org/10.1080/10412905.2002.9699814
. [all data]
Viana, Andrade-Neto, et al., 2002, 2
Viana, F.A.; Andrade-Neto, M.; Pouliquen, Y.B.M.; Uchoa, D.E.A.; Sobral, M.M.S.Z.; de Morais, S.M.,
Essential oil of Siparuna guianensis aublet from the Amazon region of Brazil,
J. Essent. Oil Res., 2002, 14, 1, 60-62, https://doi.org/10.1080/10412905.2002.9699765
. [all data]
Ansorena, Gimeno, et al., 2001
Ansorena, D.; Gimeno, O.; Astiasarán, I.; Bello, J.,
Analysis of volatile compounds by GC-MS of a dry fermented sausage: chorizo de Pamplona,
Food Res. Int., 2001, 34, 1, 67-75, https://doi.org/10.1016/S0963-9969(00)00133-2
. [all data]
Aparicio, Romero, et al., 2001
Aparicio, R.; Romero, M.; Rojas, L.B.; Khouri, N.; Usubillaga, A.,
Composition of the essential oil of four species of Ruilopezia from the Venezuelan Andes,
Flavour Fragr. J., 2001, 16, 3, 172-174, https://doi.org/10.1002/ffj.973
. [all data]
Ferreira, Costantin, et al., 2001
Ferreira, M.J.P.; Costantin, M.B.; Sartorelli, P.; Rodrigues, G.V.; Limberger, R.; Henriques, A.T.; Kato, M.J.; Emerenciano, V.P.,
Computer-aided method for identification of components in essential oils by 13C NMR spectroscopy,
Anal. Chim. Acta., 2001, 447, 1-2, 125-134, https://doi.org/10.1016/S0003-2670(01)01204-1
. [all data]
Figueiredo, Miguel, et al., 2001
Figueiredo, A.C.; Miguel, M.G.; Duarte, A.M.F.; Barroso, J.G.; Pedro, L.G.,
Essential oil composition of Thymus lotocephallus G. López R. Morales, collected during flowering and vegetative phases,
Flavour Fragr. J., 2001, 16, 6, 417-421, https://doi.org/10.1002/ffj.1028
. [all data]
Luo and Agnew, 2001
Luo, J.; Agnew, M.P.,
Gas characteristics before and after biofiltration treating odorous emissions from animal rendering processes,
Environ. Technol., 2001, 22, 9, 1091-1103, https://doi.org/10.1080/09593332208618220
. [all data]
Petrakis, Tsitsimpikou, et al., 2001
Petrakis, P.V.; Tsitsimpikou, C.; Tzakou, O.; Couladis, M.; Vagias, C.; Roussis, V.,
Needle volatiles from five Pinus species growing in Greece,
Flavour Fragr. J., 2001, 16, 4, 249-252, https://doi.org/10.1002/ffj.990
. [all data]
van Ruth, Grossmann, et al., 2001
van Ruth, S.M.; Grossmann, I.; Geary, M.; Delahunty, C.M.,
Interactions between artificial saliva and 20 aroma compounds in water and oil model systems,
J. Agric. Food Chem., 2001, 49, 5, 2409-2413, https://doi.org/10.1021/jf001510f
. [all data]
Usubillaga, Aparicio, et al., 2001
Usubillaga, A.; Aparicio, R.; Romero, M.; Rojas, L.B.; Khouri, N.,
Volatile constituents from the leaves of four Libanothamus species from the Venezuelan Andes,
Flavour Fragr. J., 2001, 16, 3, 209-211, https://doi.org/10.1002/ffj.981
. [all data]
Andrade, Maia, et al., 2000
Andrade, E.H.A.; Maia, J.G.S.; Zoghbi, M.G.B.,
Aroma volatile constituents of Brazilian varieties of mango fruit,
J. Food Comp. Anal., 2000, 13, 1, 27-33, https://doi.org/10.1006/jfca.1999.0841
. [all data]
Ansorena, Astiasarán, et al., 2000
Ansorena, D.; Astiasarán, I.; Bello, J.,
Influence of the simultaneous addition of the protease flavourzyme and the lipase novozyme 677BG on dry fermented sausage compounds extracted by SDE and analyzed by GC-MS,
J. Agric. Food Chem., 2000, 48, 6, 2395-2400, https://doi.org/10.1021/jf990931y
. [all data]
Betts, 2000
Betts, T.J.,
Solid phase microextraction of volatile constituents from individual fresh Eucalyptis leaves of three species,
Planta Medica, 2000, 66, 2, 193-195, https://doi.org/10.1055/s-0029-1243133
. [all data]
Dorman, Figueiredo, et al., 2000
Dorman, H.J.D.; Figueiredo, A.C.; Barroso, J.G.; Deans, S.G.,
In vitro evaluation of antioxidant activity of essential oils and their components,
Flavour Fragr. J., 2000, 15, 1, 12-16, https://doi.org/10.1002/(SICI)1099-1026(200001/02)15:1<12::AID-FFJ858>3.0.CO;2-V
. [all data]
Juliani, Biurrun, et al., 2000
Juliani, H.R., Jr.; Biurrun, F.; Koroch, A.R.; Juliani, H.R.; Zygadlo, J.A.,
Chemical constituents of the essential oil of Lippia laxibracteata (Verbenaceae),
Planta Med., 2000, 66, 6, 567-568, https://doi.org/10.1055/s-2000-8612
. [all data]
Muselli, Bighelli, et al., 2000
Muselli, A.; Bighelli, A.; Hoi, T.M.; Thao, N.T.P.; Thai, T.H.; Casanova, J.,
Dihydroperillaldehydes from Enhydra fluctuans Lour. essential oil,
Flavour Fragr. J., 2000, 15, 5, 299-302, https://doi.org/10.1002/1099-1026(200009/10)15:5<299::AID-FFJ911>3.0.CO;2-I
. [all data]
da Silva, Pedro, et al., 2000
da Silva, J.A.; Pedro, L.G.; Santos, P.A.G.; Figueiredo, A.C.; Barroso, J.G.; Tenreiro, R.P.; Ribeiro, C.A.; Deans, S.G.; Looman, A.; Scheffer, J.J.C.,
Essential oils from seven populations of Juniperus brevifolia (Seub.) Antoine, an endemic species of the Azores,
Flavour Fragr. J., 2000, 15, 1, 31-39, https://doi.org/10.1002/(SICI)1099-1026(200001/02)15:1<31::AID-FFJ862>3.0.CO;2-C
. [all data]
Velásquez, Toro, et al., 2000
Velásquez, J.; Toro, M.E.; Encinas, O.; Rojas, L.; Usubillaga, A.,
Chemical composition of the essential oils of exudates from Pinus oocarpa Schiede,
Flavour Fragr. J., 2000, 15, 6, 432-433, https://doi.org/10.1002/1099-1026(200011/12)15:6<432::AID-FFJ934>3.0.CO;2-9
. [all data]
Pedro, da Silva, et al., 1999
Pedro, L.G.; da Silva, J.A.; Barroso, J.G.; Figueiredo, A.C.; Deans, S.G.; Looman, A.; Scheffer, J.J.C.,
Composition of the essential oil fo Chaerophyllum azoricum Trel., an endemic species of the Azores archipelago,
Flavour Fragr. J., 1999, 14, 5, 287-289, https://doi.org/10.1002/(SICI)1099-1026(199909/10)14:5<287::AID-FFJ827>3.0.CO;2-O
. [all data]
Santos, Figueiredo, et al., 1999
Santos, P.A.; Figueiredo, A.C.; Barroso, J.G.; Pedro, L.G.; Scheffer, J.J.C.,
Composition of the essential oil of Hypericum foliosum Aiton from five Azorean islands,
Flavour Fragr. J., 1999, 14, 5, 283-286, https://doi.org/10.1002/(SICI)1099-1026(199909/10)14:5<283::AID-FFJ826>3.0.CO;2-2
. [all data]
Weyerstahl, Marschall, et al., 1999, 3
Weyerstahl, P.; Marschall, H.; Splittgerber, U.; Son, P.T.; Giang, P.M.; Kaul, V.K.,
Constituents of the essential oil from the fruits of Zanthoxylum rhetsoides Drake from Vietnam and from the aerial parts of Zanthoxylum alatum Roxb. from India,
Flavour Fragr. J., 1999, 14, 4, 225-229, https://doi.org/10.1002/(SICI)1099-1026(199907/08)14:4<225::AID-FFJ818>3.0.CO;2-1
. [all data]
Yen and Lin, 1999
Yen, G.-C.; Lin, H.-T.,
Changes in volatile flavor components of guava juice with high-pressure treatment and heat processing and during storage,
J. Agric. Food Chem., 1999, 47, 5, 2082-2087, https://doi.org/10.1021/jf9810057
. [all data]
Baratta, Dorman, et al., 1998
Baratta, M.T.; Dorman, H.J.; Deans, S.G.; Figueiredo, A.C.; Barroso, J.G.; Ruberto, G.,
Antimicrobial and antioxidant properties of some commercial essential oils,
Flavour Fragr. J., 1998, 13, 4, 235-244, https://doi.org/10.1002/(SICI)1099-1026(1998070)13:4<235::AID-FFJ733>3.0.CO;2-T
. [all data]
Guyot, Bouseta, et al., 1998
Guyot, C.; Bouseta, A.; Scheirman, V.; Collin, S.,
Floral origin markers of chestnut and lime tree honeys,
J. Agric. Food Chem., 1998, 46, 2, 625-633, https://doi.org/10.1021/jf970510l
. [all data]
Kökdil, 1998
Kökdil, G.,
Composition of the essential oil of Clinopodium vulgare L. ssp. arundanum (Boiss.) Nyman collected from two different localities in Turkey,
Flavour Fragr. J., 1998, 13, 3, 170-172, https://doi.org/10.1002/(SICI)1099-1026(199805/06)13:3<170::AID-FFJ721>3.0.CO;2-H
. [all data]
Pichette, Garneau, et al., 1998
Pichette, A.; Garneau, F.-X.; Jean, F.-I.; Riedl, B.; Girarg, M.,
Chemical differences between the wood extracts pf Jack pine (pinus banksiana(. blacj spruce (Picea mariana) and balsam for (Abies balsamea) from eastern Canada,
J. Wood Chem. Technol., 1998, 18, 4, 427-438, https://doi.org/10.1080/02773819809349590
. [all data]
Sanda, Koba, et al., 1998
Sanda, K.; Koba, K.; Nambo, P.; Gaset, A.,
Chemical investigation of Ocimum species growing in Togo,
Flavour Fragr. J., 1998, 13, 4, 226-232, https://doi.org/10.1002/(SICI)1099-1026(1998070)13:4<226::AID-FFJ717>3.0.CO;2-H
. [all data]
da Silva, Figueiredo, et al., 1998
da Silva, J.A.; Figueiredo, A.C.; Barroso, J.G.; Pedro, L.G.; Gomes, M.A.; Fontinha, S.S.; Scheffer, J.J.C.,
Composition of the essential oil of Melanoselinum decipiens (Schrad. Wendl.) Hoffm., an endemic species of the Madeira and Azores archipelagos,
Flavour Fragr. J., 1998, 13, 2, 90-92, https://doi.org/10.1002/(SICI)1099-1026(199803/04)13:2<90::AID-FFJ700>3.0.CO;2-D
. [all data]
Weyerstahl, Marschall, et al., 1998
Weyerstahl, P.; Marschall, H.; Thefeld, K.; Subba, G.C.,
Constituents of the essential oil from the rhizomes of Hedychium gardnerianum Roscoe,
Flavour Fragr. J., 1998, 13, 6, 377-388, https://doi.org/10.1002/(SICI)1099-1026(199811/12)13:6<377::AID-FFJ755>3.0.CO;2-F
. [all data]
Yusuf, Begum, et al., 1998
Yusuf, M.; Begum, J.; Mondello, L.; Stagno d'Alcontres, I.S.,
Studies on the essential oil bearing plants of Bangladesh. Part VI. Composition of the oil of Ocimum gratissimum L.,
Flavour Fragr. J., 1998, 13, 3, 163-166, https://doi.org/10.1002/(SICI)1099-1026(199805/06)13:3<163::AID-FFJ714>3.0.CO;2-1
. [all data]
Anitescu, Doneanu, et al., 1997
Anitescu, G.; Doneanu, C.; Radulescu, V.,
Isolation of Coriander oil: comparison between steam distillation and supercritical CO2 extraction,
Flavour Fragr. J., 1997, 12, 3, 173-176, https://doi.org/10.1002/(SICI)1099-1026(199705)12:3<173::AID-FFJ630>3.0.CO;2-1
. [all data]
Figueiredo, Barroso, et al., 1997
Figueiredo, A.C.; Barroso, J.G.; Pedro, L.G.; Fontinha, S.S.; Looman, A.; Scheffer, J.J.C.,
Composition of the essential oil of Monizia edulis Lowe, an endemic species of the Madeira Archipelago,
Flavour Fragr. J., 1997, 12, 1, 29-31, https://doi.org/10.1002/(SICI)1099-1026(199701)12:1<29::AID-FFJ607>3.0.CO;2-K
. [all data]
Flanagan, Streete, et al., 1997
Flanagan, R.J.; Streete, P.J.; Ramsey, J.D.,
Volatile Substance Abuse, UNODC Technical Series, No 5, United Nations, Office on Drugs and Crime, Vienna International Centre, PO Box 500, A-1400 Vienna, Austria, 1997, 56, retrieved from http://www.odccp.org/pdf/technicalseries1997-01-011.pdf. [all data]
Gaspar, Palma, et al., 1997
Gaspar, H.; Palma, F.M.S.B.; de la Torre, M.C.; Rodríguez, B.; Barroso, J.G.; Figueiredo, A.C.,
Composition of the essential oil of Teucrium haenseleri Boiss.,
Flavour Fragr. J., 1997, 12, 5, 355-357, https://doi.org/10.1002/(SICI)1099-1026(199709/10)12:5<355::AID-FFJ656>3.0.CO;2-B
. [all data]
Isidorov, Zenkevich, et al., 1997
Isidorov, V.; Zenkevich, I.; Sacharevich, T.,
Calculation of Gas Chromatographic Retention Indices for Monoterpenes and Terpenoids from Their Physico-Chemical Constants,
Chem. Anal. (Warsaw), 1997, 42, 627-634. [all data]
Weyerstahl, Marschall, et al., 1997
Weyerstahl, P.; Marschall, H.; Seelmann, I.; Kaul, V.K.,
Constituents of the flower essential oil of Ageratina adenophora (Spreng.) K. et R. from India,
Flavour Fragr. J., 1997, 12, 6, 387-396, https://doi.org/10.1002/(SICI)1099-1026(199711/12)12:6<387::AID-FFJ677>3.0.CO;2-F
. [all data]
Weyerstahl, Marschall, et al., 1997, 2
Weyerstahl, P.; Marschall, H.; Seelmann, I.; Rustaiyan, A.,
Constituents of the essential oil of Achillea eriophora DC,
Flavour Fragr. J., 1997, 12, 2, 71-78, https://doi.org/10.1002/(SICI)1099-1026(199703)12:2<71::AID-FFJ620>3.0.CO;2-E
. [all data]
Barroso, Figueiredo, et al., 1996
Barroso, J.G.; Figueiredo, A.C.; Pedro, L.G.; Antunes, T.; Sevinate-Pinto, I.; Fontinha, S.S.; Scheffer, J.J.C.,
Composition of the essential oil of teucrium heterophyllum L'Her. Grown on Madiera,
Flavour Fragr. J., 1996, 11, 2, 129-132, https://doi.org/10.1002/(SICI)1099-1026(199603)11:2<129::AID-FFJ550>3.0.CO;2-Z
. [all data]
Dung, Thanh, et al., 1996
Dung, N.X.; Thanh, L.; Khoi, T.T.; Leclercq, P.A.,
Compositional analysis of the leaf, stem and rhizome oils of Piper lolot C. DC. from Vietnam,
J. Essent. Oil Res., 1996, 8, 6, 649-652, https://doi.org/10.1080/10412905.1996.9701034
. [all data]
Mateo and Zumalacárregui, 1996
Mateo, J.; Zumalacárregui, J.M.,
Volatile compounds in chorizo and their changes during ripening,
Meat Sci., 1996, 44, 4, 255-273, https://doi.org/10.1016/S0309-1740(96)00028-9
. [all data]
Zenkevich, 1996
Zenkevich, I.G.,
Analytical Parameters of Components of Essential Oils for their Chromatographic and Chromato-Mass Spectral Identification. Mono- and Sesquiterpenes,
Rastitelnye Resursy (Plant resources), 1996, 34, 1-2, 48-58. [all data]
Sagrero-Nieves and Bartley, 1995
Sagrero-Nieves, L.; Bartley, J.P.,
Volatile Constituents from the Leaves of Chenopodium ambrosioides L.,
J. Essent. Oil Res., 1995, 7, 2, 221-223, https://doi.org/10.1080/10412905.1995.9698506
. [all data]
Ciccioli, Cecinato, et al., 1994
Ciccioli, P.; Cecinato, A.; Brancaleoni, E.; Brachetti, A.; Frattoni, M.; Sparapani, R.,
Composition and Distribution of Polar and Non-Polar VOCs in Urban, Rural, Forest and Remote Areas,
Eur Commission EUR, 1994, 549-568. [all data]
Ciccioli, Brancaleoni, et al., 1993
Ciccioli, P.; Brancaleoni, E.; Cecinato, A.; Sparapani, R.; Frattoni, M.,
Identification and determination of biogenic and anthropogenic volatile organic compounds in forest areas of Northern and Southern Europe and a remote site of the Himalaya region by high-resolution gas chromatography-mass spectrometry,
J. Chromatogr., 1993, 643, 1-2, 55-69, https://doi.org/10.1016/0021-9673(93)80541-F
. [all data]
Strete, Ruprah, et al., 1992
Strete, P.J.; Ruprah, M.; Ramsey, J.D.; Flanagan, R.J.,
Detection and identification of volatile substances by headspace capillary gas chromatography to aid the diagnosis of acute poisoning,
Analyst, 1992, 117, 7, 1111-1127, https://doi.org/10.1039/an9921701111
. [all data]
De Pooter, Vermeesch, et al., 1989
De Pooter, H.L.; Vermeesch, J.; Schamp, N.M.,
The Essential Oils of Tanacetum vulgare L. and Tanacetum parthenium (L.) Schultz-Bip,
J. Essent. Oil Res., 1989, 1, 1, 9-13, https://doi.org/10.1080/10412905.1989.9699438
. [all data]
MacLeod and Snyder, 1988
MacLeod, A.J.; Snyder, C.H.,
Volatile components of mango preserved by deep freezing,
J. Agric. Food Chem., 1988, 36, 1, 137-139, https://doi.org/10.1021/jf00079a035
. [all data]
Schultz, Flath, et al., 1988
Schultz, T.H.; Flath, R.A.; Stern, D.J.; Mon, T.R.; Teranishi, R.; McKenna Kruse, S.; Butlder, B.; Howard, W.E.,
Coyote estrous urine volatiles,
J. Chem. Ecol., 1988, 14, 2, 701-712, https://doi.org/10.1007/BF01013917
. [all data]
Takeoka, Flath, et al., 1988
Takeoka, G.R.; Flath, R.A.; Güntert, M.; Jennings, W.,
Nectarine volatiles: vacuum steam distillation versus headspace sampling,
J. Agric. Food Chem., 1988, 36, 3, 553-560, https://doi.org/10.1021/jf00081a037
. [all data]
De Pooter and Schamp, 1987
De Pooter, H.L.; Schamp, N.M.,
The Essential Oil of Mentha X villosa nm. alopecuroides,
Flavour Fragr. J., 1987, 2, 4, 163-165, https://doi.org/10.1002/ffj.2730020405
. [all data]
Shibamoto, 1987
Shibamoto, T.,
Retention Indices in Essential Oil Analysis
in Capillary Gas Chromatography in Essential Oil Analysis, Sandra, P.; Bicchi, C., ed(s)., Hutchig Verlag, Heidelberg, New York, 1987, 259-274. [all data]
Ramsey and Flanagan, 1982
Ramsey, J.D.; Flanagan, R.J.,
Detection and Identification of Volatile Organic Compounds in Blood by Headspace Gas Chromatography as an Aid to the Diagnosis of Solvent Abuse,
J. Chromatogr., 1982, 240, 2, 423-444, https://doi.org/10.1016/S0021-9673(00)99622-5
. [all data]
Swigar and Silverstein, 1981
Swigar, A.A.; Silverstein, R.M.,
Monoterpenes, Aldrich Chemical Company, Milwaukee, WI, USA, 1981, 130. [all data]
Feng, Cui, et al., 2011
Feng, T.; Cui, J.-J.; Xiao, Z.-B.; Tian, H.-X.; Yi, F.-P.; Ma, X.,
Chemical composition od essential oil from the peel of Chinese Torreya grandis Frt,
Org. Chem. International, 2011, 2011, 1-5, https://doi.org/10.1155/2011/187372
. [all data]
Tsai, Huang, et al., 2011
Tsai, S.-Y.; Huang, S.-J.; Chyau, C.-C.; Tsai, C.-H.; Weng, C.-C.; Mau, J.-L.,
Composition and antioxidant properties of essential oils from Curcuma rhisome,
Asian J. of Arts Sciences, 2011, 2, 1, 57-66. [all data]
Zeng, Xie, et al., 2011
Zeng, Z.; Xie, R.; Zhang, T.; Zhang, H.; Chen, J.Y.,
Analysis of volatile compositions of Magnolia biondii Pamp by steam distillation and Headspace solid phase micro-extraction,
J. Oleo Sci., 2011, 60, 12, 591-596, https://doi.org/10.5650/jos.60.591
. [all data]
Rochat, Egger, et al., 2009
Rochat, S.; Egger, J.; Chaintreau, A.,
Strategy for the identification of key odorants: application to shrimp aroma,
J. Chromatogr. A, 2009, 1216, 36, 6424-6432, https://doi.org/10.1016/j.chroma.2009.07.014
. [all data]
Beck, Higbee, et al., 2008
Beck, J.J.; Higbee, B.S.; Marrill, G.B.; Roitman, J.N.,
Comparison of volatile emissions from undamaged and mechanically damaged almonds,
J, Sci. Food Argic., 2008, 88, 8, 1363-1368, https://doi.org/10.1002/jsfa.3224
. [all data]
Hymete, Rohloff, et al., 2007
Hymete, A.; Rohloff, J.; Iversen, T.-H.; Kjosen, H.,
Volatile constituents of the roots of Echinops kebericho Mesfin,
Flavour Fragr. J., 2007, 22, 1, 35-38, https://doi.org/10.1002/ffj.1746
. [all data]
Kurose, Okamura, et al., 2007
Kurose, K.; Okamura, D.; Yatagai, M.,
Composition of the essential oils from the leaves of nine Pinus species and the cones of three of Pinus species,
Flavour Fragr. J., 2007, 22, 1, 10-20, https://doi.org/10.1002/ffj.1609
. [all data]
Nebesny, Budryn, et al., 2007
Nebesny, E.; Budryn, G.; Kula, J.; Majda, T.,
The effect of roasting method on headspace composition of robusta coffee bean aroma,
Eur. Food Res. Technol., 2007, 225, 1, 9-19, https://doi.org/10.1007/s00217-006-0375-0
. [all data]
Povolo, Contarini, et al., 2007
Povolo, M.; Contarini, G.; Mele, M.; Secchiari, P.,
Study on the influence of pasture on volatile fraction of Ewes' dairy products by solid-phase microextraction and gas chromatography-mass spectrometry,
J. Dairy Sci., 2007, 90, 2, 556-569, https://doi.org/10.3168/jds.S0022-0302(07)71539-4
. [all data]
Singh, Kumar, et al., 2007
Singh, B.; Kumar, R.; Bhandari, S.; Pathania, S.; Lal, B.,
Volatile constituents of natural Boswellia serrata oleo-gum-resin and commercial samples,
Flavour Fragr. J., 2007, 22, 2, 145-147, https://doi.org/10.1002/ffj.1772
. [all data]
Wei A. and Shibamoto T., 2007
Wei A.; Shibamoto T.,
Antioxidant activities and volatile constituents of various essential oils,
J. Agric. Food Chem., 2007, 55, 5, 1737-1742, https://doi.org/10.1021/jf062959x
. [all data]
Choi H.S., 2006
Choi H.S.,
Lipolytic effects of citrus peel oils and their components,
J. Agric. Food Chem., 2006, 54, 9, 3254-3258, https://doi.org/10.1021/jf052409j
. [all data]
Mendivil, Rodrigues, et al., 2006
Mendivil, E.A.S.; Rodrigues, J.F.; Espinosa, M.E.; Fajardo, J.A.G.; Vosques, E.N.O.,
Chemical Composition and Fungicidal Activity of the Essential Oil of Thymus vulgaris against Alternaria citri,
e-Gnosis, 2006, 4, 1-7, retrieved from http://www.e-gnosis.udg.mx. [all data]
Babu and Kaul, 2005
Babu, K.G.D.; Kaul, V.K.,
Variation in essential oil composition of rose-scented geranium (Pelargonium sp.) distilled by different distillation techniques,
Flavour Fragr. J., 2005, 20, 2, 222-231, https://doi.org/10.1002/ffj.1414
. [all data]
Bezic, Skocibusic, et al., 2005
Bezic, N.; Skocibusic, M.; Dunkic, V.,
Phytochemical Composition and Antimicrobial Activityof Satureja montana L. and Satureja cunefolia Ten. Essential Oils,
Acta Bot. Croat., 2005, 64, 2, 313-322. [all data]
Gauvin and Smadja, 2005
Gauvin, A.; Smadja, J.,
Essential oil composition of four Psiadia species from Reunion Island: A chemotaxonomic study,
Biochem. Syst. Ecol., 2005, 33, 7, 705-714, https://doi.org/10.1016/j.bse.2004.12.013
. [all data]
Jirovetz, Buchbauer, et al., 2005, 2
Jirovetz, L.; Buchbauer, G.; Ngassoum, M.B.; Parmentier, M.,
Chemical composition and olfactory characterization of essential oils of fruits and seeds of African pear (Dacryodes edulis (G. Don) H. J. Lam) from Cameroon,
Flavour Fragr. J., 2005, 20, 2, 215-218, https://doi.org/10.1002/ffj.1324
. [all data]
Jirovetz, Buchbauer, et al., 2005, 3
Jirovetz, L.; Buchbauer, G.; Stoyanova, A.; Balinova, A.; Guangjiun, Z.; Xihan, M.,
Solid phase microextraction/gas chromatographic and olfactory analysis of the scent and fixative properties of the essential oil of Rosa damascena L. from China,
Flavour Fragr. J., 2005, 20, 1, 7-12, https://doi.org/10.1002/ffj.1375
. [all data]
Kulisic, Radonic, et al., 2005
Kulisic, T.; Radonic, A.; Milos, M.,
Inhibition of Lard Oxidation by Fractions of Different Essential Oil,
Grasas y Aceites, 2005, 56, 4, 284-291, https://doi.org/10.3989/gya.2005.v56.i4.94
. [all data]
Njoroge, Koaze, et al., 2005, 2
Njoroge, S.M.; Koaze, H.; Mwaniki, M.; Minh Tu, N.T.; Sawamura, M.,
Essential oils of Kenyan Citrus fruits: volatile components of two varieties of mandarins (Citrus reticulata) and a tangelo (C. paradisi × C. tangerina),
Flavour Fragr. J., 2005, 20, 1, 74-79, https://doi.org/10.1002/ffj.1376
. [all data]
Njoroge, Koaze, et al., 2005, 3
Njoroge, S.M.; Koaze, H.; Karanja, P.N.; Sawamura, M.,
Essential oil constituents of three varieties of Kenyan sweet oranges (Citrus sinensis),
Flavour Fragr. J., 2005, 20, 1, 80-85, https://doi.org/10.1002/ffj.1377
. [all data]
Qian and Wang, 2005
Qian, M.C.; Wang, Y.,
Seasonal Variations of Volatile Composition and Odor Activity Value of Marion (Rubus spp. hyb) and Thornless Evergreen (R.laciniatus L.) Blackberries,
J. Food. Sci., 2005, 70, 1, c13-c20, https://doi.org/10.1111/j.1365-2621.2005.tb09013.x
. [all data]
Chida, Sone, et al., 2004
Chida, M.; Sone, Y.; Tamura, H.,
Aroma characteristics of stored tobacco cut leaves analyzed by a high vacuum distillation and canister system,
J. Agric. Food Chem., 2004, 52, 26, 7918-7924, https://doi.org/10.1021/jf049223p
. [all data]
Choi, 2004, 2
Choi, H.-S.,
Aroma evaluation of an aquatic herb, changpo (Acorus calamus Var. angustatus Bess), by AEDA and SPME,
J. Agric. Food Chem., 2004, 52, 26, 8099-8104, https://doi.org/10.1021/jf040239p
. [all data]
Jiang and Kubota, 2004
Jiang, L.; Kubota, K.,
Differences in the volatile components and their odor characteristics of green and ripe fruits and dried pericarp of Japanese pepper (Xanthoxylum piperitum DC.),
J. Agric. Food Chem., 2004, 52, 13, 4197-4203, https://doi.org/10.1021/jf030663a
. [all data]
Lourens, Reddy, et al., 2004
Lourens, A.C.U.; Reddy, D.; Baser, K.H.C.; Viljoen, A.M.; Van Vuuren, S.F.,
In vitro Biological Activity and Essential Oil Composition of Four Indigenous South Africal Helichrysum Species,
J. Ethnopharmacol., 2004, 95, 2-3, 253-258, https://doi.org/10.1016/j.jep.2004.07.027
. [all data]
Palá-Paúl, Brophy, et al., 2004
Palá-Paúl, J.; Brophy, J.J.; Goldsack, R.J.; Fontaniella, B.,
Analysis of the volatile components of Lavandula canariensis (L.) Mill., a Canary Islands endemic species, growing in Australia,
Biochem. Syst. Ecol., 2004, 32, 1, 55-62, https://doi.org/10.1016/S0305-1978(03)00177-7
. [all data]
Dunlop, Bignell, et al., 2003
Dunlop, P.J.; Bignell, C.M.; Hibbert, D.B.; Brooker, M.I.H.,
Use of gas chromatograms of the essential leaf oils of the genus Eucalyptus for taxonomic purposes: E. subser. Euglobulares (Blakely),
Flavour Fragr. J., 2003, 18, 2, 162-169, https://doi.org/10.1002/ffj.1190
. [all data]
Mastelic and Jerkovic, 2003
Mastelic, J.; Jerkovic, I.,
Application of co-distillation with superheated pentane vapour to the isolation of unstable essential oils,
Flavour Fragr. J., 2003, 18, 6, 521-526, https://doi.org/10.1002/ffj.1261
. [all data]
Mau, Lai, et al., 2003
Mau, J.-L.; Lai, E.Y.C.; Wang, N.-P.; Chen, C.-C.; Chang, C.-H.; Chyau, C.-C.,
Composition and antioxidant activity of the essential oil from Curcuma zedoaria,
Food Chem., 2003, 82, 4, 583-591, https://doi.org/10.1016/S0308-8146(03)00014-1
. [all data]
Suleimenov, Atazharova, et al., 2003
Suleimenov, E.M.; Atazharova, G.A.; Demirchi, B.; Baser, K.H.C.; Adekenov, S.M.,
Essential oil composition of Artemisia Lercheana and A. Sieversiana of Kazakhstan flora
in Recent problems of development of new medicines of natural origin, Proceedings of symposium, St.Petersburg - Pushkin, 2003, 382-385. [all data]
Galindo-Cuspinera, Lubran, et al., 2002
Galindo-Cuspinera, V.; Lubran, M.B.; Rankin, S.A.,
Comparison of volatile compounds in water- and oil-soluble annatto (Bixa orellana L.) extracts,
J. Agric. Food Chem., 2002, 50, 7, 2010-2015, https://doi.org/10.1021/jf011325h
. [all data]
Góra, Lis, et al., 2002
Góra, J.; Lis, A.; Kula, J.; Staniszewska, M.; Woloszyn, A.,
Chemical composition variability of essential oils in the ontogenesis of some plants,
Flavour Fragr. J., 2002, 17, 6, 445-451, https://doi.org/10.1002/ffj.1126
. [all data]
Kasali, Winterhalter, et al., 2002
Kasali, A.A.; Winterhalter, P.; Adio, A.M.; Knapp, H.; Bonnlander, B.,
Chromenes in Ageratum conyzoides L.,
Flavour Fragr. J., 2002, 17, 4, 247-250, https://doi.org/10.1002/ffj.1099
. [all data]
Tu, Onishi, et al., 2002
Tu, N.T.M.; Onishi, Y.; Choi, H.-S.; Kondo, Y.; Bassore, S.M.; Ukeda, H.; Sawamura, M.,
Characteristic odor components of Citrus sphaerocarpa Tanaka (Kabosu) cold-pressed peel oil,
J. Agric. Food Chem., 2002, 50, 10, 2908-2913, https://doi.org/10.1021/jf011578a
. [all data]
Tu, Thanh, et al., 2002
Tu, N.T.M.; Thanh, L.X.; Une, A.; Ukeda, H.; Sawamura, M.,
Volatile constituents of Vietnamese pummelo, orange, tangerine and lime peel oils,
Flavour Fragr. J., 2002, 17, 3, 169-174, https://doi.org/10.1002/ffj.1076
. [all data]
Umano, Hagi, et al., 2002
Umano, K.; Hagi, Y.; Shibamoto, T.,
Volatile chemicals identified in extracts from newly hybrid citrus, dekopon (Shiranuhi mandarin Suppl. J.),
J. Agric. Food Chem., 2002, 50, 19, 5355-5359, https://doi.org/10.1021/jf0203951
. [all data]
Bendall, 2001
Bendall, J.G.,
Aroma compounds of fresh milk from New Zealand cows fed different diets,
J. Agric. Food Chem., 2001, 49, 10, 4825-4832, https://doi.org/10.1021/jf010334n
. [all data]
Christoph, 2001
Christoph, F.,
Chemische Zuzammensetzung und antimikrobielle Eigenschaften der ätherischen Öle von Leptospermum scoparium J. R. et G. Forst. und anderer Teebaumöle der Gattungen Kunzea, Leptospermum und Melaleuca unter besonderer Berücksichtigung von Handelsölen, Dissertation, University of Hamburg, Germany, 2001, 196. [all data]
Jiang and Kubota, 2001
Jiang, L.; Kubota, K.,
Formation by mechanical stimulus of the flavor compounds in young leaves of Japanese pepper (Xanthoxylum piperitum DC.),
J. Agric. Food Chem., 2001, 49, 3, 1353-1357, https://doi.org/10.1021/jf001166m
. [all data]
Miyazawa, Kurose, et al., 2001
Miyazawa, M.; Kurose, K.; Itoh, A.; Hiraoka, N.,
Comparison of the essential oils of Glehnia littoralis from Northern and Southern Japan,
J. Agric. Food Chem., 2001, 49, 11, 5433-5436, https://doi.org/10.1021/jf010219c
. [all data]
Vernin, Lageot, et al., 2001
Vernin, G.; Lageot, C.; Gaydou, E.M.; Parkanyi, C.,
Analysis of the essential oil of Lippia graveolens HBK from El Salvador,
Flavour Fragr. J., 2001, 16, 3, 219-226, https://doi.org/10.1002/ffj.984
. [all data]
Buttery, Light, et al., 2000
Buttery, R.G.; Light, D.M.; Nam, Y.; Merrill, G.B.; Roitman, J.N.,
Volatile components of green walnut husks,
J. Agric. Food Chem., 2000, 48, 7, 2858-2861, https://doi.org/10.1021/jf000288b
. [all data]
Chagonda, Makanda, et al., 2000, 2
Chagonda, L.S.; Makanda, C.; Chalchat, J.-C.,
The essential oils of wild and cultivated Cymbopogon validus (Stapf) Stapf ex Burtt Davy and Elionurus muticus (Spreng.) Kunth from Zimbabwe,
Flavour Fragr. J., 2000, 15, 2, 100-104, https://doi.org/10.1002/(SICI)1099-1026(200003/04)15:2<100::AID-FFJ874>3.0.CO;2-Y
. [all data]
Franco and Shibamoto, 2000
Franco, M.R.B.; Shibamoto, T.,
Volatile composition of some Brazilian fruits: umbu-caja (Spondias citherea), camu-camu (Myrciaria dubia), araca-boi (Eugenia stipitata), and cupuacu (Theobroma grandiflorum),
J. Agric. Food Chem., 2000, 48, 4, 1263-1265, https://doi.org/10.1021/jf9900074
. [all data]
Korány, Mednyánszky, et al., 2000
Korány, K.; Mednyánszky, Zs.; Amtmann, M.,
Preliminary results of a recognition method visualizing the aroma and fragrance features,
Acta Aliment., 2000, 29, 2, 187-198, https://doi.org/10.1556/AAlim.29.2000.2.9
. [all data]
Umano, Hagi, et al., 2000
Umano, K.; Hagi, Y.; Nakahara, K.; Shoji, A.; Shibamoto, T.,
Volatile chemicals identified in extracts from leaves of Japanese mugwort (Artemisia princeps Pamp.),
J. Agric. Food Chem., 2000, 48, 8, 3463-3469, https://doi.org/10.1021/jf0001738
. [all data]
Dunlop, Bignell, et al., 1999
Dunlop, P.J.; Bignell, C.M.; Brooker, M.I.H.; Brophy, J.J.; Hibbert, D.B.,
Use of gas chromatograms of essential leaf oils to compare eight taxa of genus Angophora (Myrtaceae): possible relationships to the genus Eucalyptus,
Biochem. Syst. Ecol., 1999, 27, 8, 815-830, https://doi.org/10.1016/S0305-1978(99)00022-8
. [all data]
Kaya, Baser, et al., 1999
Kaya, A.; Baser, K.H.C.; Koca, F.,
Essential oils of Acinos troodi (Post) Leblebici subsp. vardaranus Leblebici and subsp. grandiflorus Hartvig Strid,
Flavour Fragr. J., 1999, 14, 1, 50-54, https://doi.org/10.1002/(SICI)1099-1026(199901/02)14:1<50::AID-FFJ783>3.0.CO;2-7
. [all data]
Kaya, Baser, et al., 1999, 2
Kaya, A.; Baser, K.H.C.; Demirci, B.; Koca, F.,
The essential oil of Acinos alpinus (L.) Moench growing in Turkey,
Flavour Fragr. J., 1999, 14, 1, 55-59, https://doi.org/10.1002/(SICI)1099-1026(199901/02)14:1<55::AID-FFJ784>3.0.CO;2-Q
. [all data]
Kaya, Baser, et al., 1999, 3
Kaya, A.; Baser, K.H.C.; Tümen, G.; Koca, F.,
The essential oil of Acinos suaveolens (Sm.) G. Don fil. Acinos arvensis (Lam.) Dandy and Acinos rotundifolius Pers. growing wild in Turkey,
Flavour Fragr. J., 1999, 14, 1, 60-64, https://doi.org/10.1002/(SICI)1099-1026(199901/02)14:1<60::AID-FFJ785>3.0.CO;2-0
. [all data]
Ngassoum, Yonkeu, et al., 1999
Ngassoum, M.B.; Yonkeu, S.; Jirovetz, L.; Buchbauer, G.; Schmaus, G.; Hammerschmidt, F.-J.H.,
Chemical composition of essential oils of Lantana camara leaves and flowers from Cameroon and Madagascar,
Flavour Fragr. J., 1999, 14, 4, 245-250, https://doi.org/10.1002/(SICI)1099-1026(199907/08)14:4<245::AID-FFJ819>3.0.CO;2-X
. [all data]
Onocha, Ekundayo, et al., 1999
Onocha, P.A.; Ekundayo, O.; Oyelola, O.; Laakso, I.,
Essential oils of Dacryodes edulis (G. Don) H. J. Lam (African pear),
Flavour Fragr. J., 1999, 14, 2, 135-139, https://doi.org/10.1002/(SICI)1099-1026(199903/04)14:2<135::AID-FFJ788>3.0.CO;2-L
. [all data]
Bignell, Dunlop, et al., 1998
Bignell, C.M.; Dunlop, P.J.; Brophy, J.J.,
Volatile leaf oils of some South-Western and Southern Australian species of the genus Eucalyptus (Series 1). Part XIX,
Flavour Fragr. J., 1998, 13, 2, 131-139, https://doi.org/10.1002/(SICI)1099-1026(199803/04)13:2<131::AID-FFJ710>3.0.CO;2-X
. [all data]
Chisowa, Hall, et al., 1998
Chisowa, E.H.; Hall, D.R.; Farman, D.I.,
Volatile constituents of the essential oil of Cymbopogon citratus Stapf gown in Zambia,
Flavour Fragr. J., 1998, 13, 1, 29-30, https://doi.org/10.1002/(SICI)1099-1026(199801/02)13:1<29::AID-FFJ682>3.0.CO;2-S
. [all data]
Molleken U., Sinnwell V., et al., 1998
Molleken U.; Sinnwell V.; Kubeczka K.H.,
TThe essential oil composition of fruits from Smyrnium perfoliatum,
Phytochemistry, 1998, 47, 6, 1079-1083, https://doi.org/10.1016/S0031-9422(98)80076-9
. [all data]
Mölleken, Sinnwell, et al., 1998
Mölleken, U.; Sinnwell, V.; Kubeczka, K.-H.,
Essential oil composition of Smyrnium olusatrum,
Phytochemistry, 1998, 49, 6, 1709-1714, https://doi.org/10.1016/S0031-9422(98)00195-2
. [all data]
Tümen, Baser, et al., 1998
Tümen, G.; Baser, K.H.C.; Demirci, B.; Ermin, N.,
The essential oils of Satureja coerulea Janka and Thymus aznavourii Velen.,
Flavour Fragr. J., 1998, 13, 1, 65-67, https://doi.org/10.1002/(SICI)1099-1026(199801/02)13:1<65::AID-FFJ695>3.0.CO;2-Q
. [all data]
Awano, Ichikawa, et al., 1997
Awano, K.; Ichikawa, Y.; Tokuda, K.; Kuraoka, M.,
Volatile components of the flowers of two Calanthe species,
Flavour Fragr. J., 1997, 12, 5, 327-330, https://doi.org/10.1002/(SICI)1099-1026(199709/10)12:5<327::AID-FFJ661>3.0.CO;2-M
. [all data]
Baser, Kirimer, et al., 1997
Baser, K.H.C.; Kirimer, N.; Duman, H.,
Composition of the essential oil of Micromeria dolichodontha P. H. Davis,
Flavour Fragr. J., 1997, 12, 4, 289-291, https://doi.org/10.1002/(SICI)1099-1026(199707)12:4<289::AID-FFJ640>3.0.CO;2-A
. [all data]
Bignell, Dunlop, et al., 1997
Bignell, C.M.; Dunlop, P.J.; Brophy, J.J.; Fookes, C.J.R.,
Volatile leaf oils of some South-Western and Southern Australian species of the genus Eucalyptus (Series I). Part XIV: Subgenus Monocalyptus,
Flavour Fragr. J., 1997, 12, 3, 177-183, https://doi.org/10.1002/(SICI)1099-1026(199705)12:3<177::AID-FFJ626>3.0.CO;2-9
. [all data]
Bignell, Dunlop, et al., 1997, 2
Bignell, C.M.; Dunlop, P.J.; Brophy, J.J.,
Volatile leaf oils of some South-Western and Southern Australian species of the genus Eucalyptus (Series I). Part XV: Subgenus symphyomyrtus, section bisectaria, series levispermae,
Flavour Fragr. J., 1997, 12, 3, 185-193, https://doi.org/10.1002/(SICI)1099-1026(199705)12:3<185::AID-FFJ627>3.0.CO;2-B
. [all data]
Bignell, Dunlop, et al., 1997, 3
Bignell, C.M.; Dunlop, P.J.; Brophy, J.J.,
Volatile leaf oils of some South-Western and Southern Australian species of the genus Eucalyptus (Series I). Part XVI: Subgenus symphyomyrtus, section bisectaria, series cneorifoliae, series porantherae and series falcatae,
Flavour Fragr. J., 1997, 12, 261-267. [all data]
Bignell, Dunlop, et al., 1997, 4
Bignell, C.M.; Dunlop, P.J.; Brophy, J.J.,
Volatile leaf oils of some South-Western and Southern Australian species of the genus Eucalyptus (Series I). Part XVII: Subgenus symphyomyrtus (i) section bisectaria, series calycogonae and (ii) section dumaria, series dumosae, series rigentes and series ovulares,
Flavour Fragr. J., 1997, 12, 269-275. [all data]
Bignell, Dunlop, et al., 1997, 5
Bignell, C.M.; Dunlop, P.J.; Brophy, J.J.,
Volatile leaf oils of some Queensland and Norther Australian species of the genus Eucalyptus (Series II) Part II. Subgenera (a) Blakella, (b) Corymbia, (c) Unnamed, (d) Idiogenes, (e) Monocalyptus and (f) Symphyomyrtus,
Flavour Fragr. J., 1997, 12, 4, 277-284, https://doi.org/10.1002/(SICI)1099-1026(199707)12:4<277::AID-FFJ642>3.0.CO;2-B
. [all data]
Bignell, Dunlop, et al., 1997, 6
Bignell, C.M.; Dunlop, P.J.; Brophy, J.J.,
Volatile leaf oils of some south-western and southern Australian speices of the genus Eucalyptus (Series I). Part XVIII. A. Subgenus monocalyptus. B. Subgenus Symphyomyrtus: (i) section Guilfoyleanae; (ii) section bisectaria, series accedentes, series occidentales, series levispermae, series loxophlebae, series macrocarpae, series orbifoliae, series calycogonae; (iii) section dumaria, series incrassatae and series ovulares,
Flavour Fragr. J., 1997, 12, 423-432. [all data]
Lebossé, Ducruet, et al., 1997
Lebossé, R.; Ducruet, V.; Feigenbaum, A.,
Interactions between reactive aroma compounds from model citrus juice with polypropylene packaging film,
J. Agric. Food Chem., 1997, 45, 8, 2836-2842, https://doi.org/10.1021/jf960957e
. [all data]
Brophy, Goldsack, et al., 1996
Brophy, J.J.; Goldsack, R.J.; Bean, A.R.; Forster, P.I.; Fookes, C.J.R.,
The leaf essential oils of the genus Syncarpia ten. (Myrtaceae),
Flavour Fragr. J., 1996, 11, 6, 361-366, https://doi.org/10.1002/(SICI)1099-1026(199611)11:6<361::AID-FFJ591>3.0.CO;2-T
. [all data]
Christensen and Reineccius, 1995
Christensen, K.R.; Reineccius, G.A.,
Aroma extract dilution analysis of aged cheddar cheese,
J. Food Sci., 1995, 60, 2, 218-220, https://doi.org/10.1111/j.1365-2621.1995.tb05641.x
. [all data]
Togari, Kobayashi, et al., 1995
Togari, N.; Kobayashi, A.; Aishima, T.,
Pattern recognition applied to gas chromatographic profiles of volatile components in three tea categories,
Food Res. Int., 1995, 28, 5, 495-502, https://doi.org/10.1016/0963-9969(95)00029-1
. [all data]
Sagrero-Nieves, Bartley, et al., 1994
Sagrero-Nieves, L.; Bartley, J.P.; Provis-Schwede, A.,
Supercritical Fluid Extraction of the Volatile Constituents from Tamarind (Tamarindus indica L.),
J. Essent. Oil Res., 1994, 6, 5, 547-548, https://doi.org/10.1080/10412905.1994.9698449
. [all data]
Shimoda, Shiratsuchi, et al., 1993
Shimoda, M.; Shiratsuchi, H.; Minegishi, Y.; Osajima, Y.,
Flavor deterioration of nonfermented coarse-cut sausage during storage. Flavor as a factor of quality for nonfermented sausage. 2,
J. Agric. Food Chem., 1993, 41, 6, 946-950, https://doi.org/10.1021/jf00030a021
. [all data]
Chyau, Chen, et al., 1992
Chyau, C.-C.; Chen, S.-Y.; Wu, C.-M.,
Differences of volatile and nonvolatile constituents between mature and ripe guave (Psidium guajava Linn) fruits,
J. Agric. Food Chem., 1992, 40, 5, 846-849, https://doi.org/10.1021/jf00017a028
. [all data]
Kawakami and Kobayashi, 1991
Kawakami, M.; Kobayashi, A.,
Volatitle constituents of greem mate and roasted mate,
J. Agric. Food Chem., 1991, 39, 7, 1275-1279, https://doi.org/10.1021/jf00007a016
. [all data]
Takeoka and Butter, 1989
Takeoka, G.; Butter, R.G.,
Volatile constituents of pineapple (Ananas Comosus [L.] Merr.)
in Flavor Chemistry. Trends and Developments, Teranishi,R.; Buttery,R.G.; Shahidi,F., ed(s)., American Chemical Society, Washington, DC, 1989, 223-237. [all data]
MacLeod and Snyder, 1985
MacLeod, A.J.; Snyder, C.H.,
Volatile components of two cultivars of mango from Florida,
J. Agric. Food Chem., 1985, 33, 3, 380-384, https://doi.org/10.1021/jf00063a015
. [all data]
Buttery and Kamm, 1980
Buttery, R.G.; Kamm, J.A.,
Volatile components of alfalfa: possible insect host plant attractants,
J. Agric. Food Chem., 1980, 28, 5, 978-981, https://doi.org/10.1021/jf60231a014
. [all data]
Stancher and Pertoldi, 1967
Stancher, B.; Pertoldi, M.G.,
Characterization of commercial materials used in synthetic essential oil production. Identification and gas-chromatographic determination of impurities,
Rassegna chimica, 1967, 19, 3, 99-109. [all data]
Wang, Tian, et al., 2013
Wang, G.-J.; Tian, L.; Fan, Y.-M.; Qi, M.-L.,
Headspace single drop microextraction gas chromatography mass spectrometry for the analysis of volatile compounds from herba Asari,
J. Anal. Methods in Chemistry, 2013, 1-6. [all data]
Akin, Saracoglu, et al., 2012
Akin, M.; Saracoglu, H.T.; Demirci, B.; Baser, K.H.C.,
Chemical composition and antibacterial activity of essential oils from different parts of Buplerum rotundifolium L.,
Rec. Nat. Prod., 2012, 6, 3, 316-320. [all data]
Prompona, Kandylis, et al., 2012
Prompona, K.-D.; Kandylis, P.; Tsakiris, A.; Kanellaki, M.; Kourkoutas, Y.,
Application of alternative technologies for elimination of artificial colorings in alcoholic beverages produced by Citrus medica and potential impact on human health,
Food Nutrition Sci., 2012, 3, 07, 959-969, https://doi.org/10.4236/fns.2012.37127
. [all data]
Demirci, Temel, et al., 2011
Demirci, B.; Temel, H.E.; Portakai, T.; Kirmizibekmez, H.; Demirci, F.; Baser, K.H.C.,
Inhibitory effect of Calamintha neleta subsp. glandulosa essential oil on lipoxygenase,
Turk. J. Biochem., 2011, 36, 4, 290-295. [all data]
Noorizadeh, Farmany, et al., 2011
Noorizadeh, H.; Farmany, A.; Noorizadeh, M.,
Quantitative structure-retention relationships analysis of retention index of essential oils,
Quim. Nova, 2011, 34, 2, 242-249, https://doi.org/10.1590/S0100-40422011000200014
. [all data]
Povolo, Cabassi, et al., 2011
Povolo, M.; Cabassi, G.; Profaizer, M.; Lanteri, S.,
Study on the use of evolved gas analysis FT-IR (EGA FT-IR) for the evaluation of cheese volatile fraction,
The Open Food Sci. J., 2011, 5, 1, 10-16, https://doi.org/10.2174/1874256401105010010
. [all data]
Noorizadeh and Farmany, 2010
Noorizadeh, H.; Farmany, A.,
Exploration of linear and nonlinear modeling techniques to predict of retention index of essential oils,
J. Chin. Chem. Soc., 2010, 1268-1277. [all data]
Polatoglu, Demirci, et al., 2010
Polatoglu, K.; Demirci, F.; Demirci, B.; Goren, N.; Baser, K.H.C.,
Antimicrobial activity and essential oil composition of a new T. argyrophyllum (C. Koch) Tvzel var. argyrophyllium chemotype,
J. Oleo Sci., 2010, 59, 6, 307-313, https://doi.org/10.5650/jos.59.307
. [all data]
Baser, Demirci, et al., 2009
Baser, K.H.C.; Demirci, B.; Kurkcuoglu, M.; Satin, F.; Tumen, G.,
Comparative morphological and phytochemical charactertization of Salvia cadmica and S. smyrnaea,
Pak. J. Bot., 2009, 41, 4, 1545-1555. [all data]
Gyawali and Kim, 2009
Gyawali, R.; Kim, K.-S.,
Volatile organic compounds of medicinal values from Nepalese Acorus calamus L.,
Kathmandu Univ. J. Sci. Eng. Technol., 2009, 5, II, 51-65. [all data]
Harraca, Syed, et al., 2009
Harraca, V.; Syed, Z.; Guerin, P.M.,
Olfactory and behavioural responces of tsetse flies, Glossina spp., to rumen metabolites,
J. Comp. Physiol. A, 2009, 195, 9, 815-824, https://doi.org/10.1007/s00359-009-0459-y
. [all data]
Wedge, Klun, et al., 2009
Wedge, D.E.; Klun, J.A.; Tabanca, N.; Demirci, B.; Ozek, T.; Baser, K.H.C.; Liu, Z.; Zhang, S.; Cantrell, C.L.; Zhang, J.,
Bioactivity-guided fractionation and GC/MS fingerprinting of Amgelica sinensis and Angelica archangelica root components for antifungal and mosquito deterrent activity,
J. Agric. Food Chem., 2009, 57, 2, 464-470, https://doi.org/10.1021/jf802820d
. [all data]
Berard, Bianchi, et al., 2007
Berard, J.; Bianchi, F.; Careri, M.; Chatel, A.; Mangia, A.; Musci, M.,
Characterization of the volatile fraction and of free fatty acids of Fontina Valle d'Aosta, a protected designation of origin Italian cheese,
Food Chem., 2007, 105, 1, 293-300, https://doi.org/10.1016/j.foodchem.2006.11.041
. [all data]
Kaya, Benirci, et al., 2007
Kaya, A.; Benirci, B.; Baser, K.H.C.,
Micromorphology of glandular trichomes of Nepeta congesta Fisch. Mey. var. congesta (LAmiaceae) and chemical analysis of the essential oils,
South African J. Botany, 2007, 73, 1, 29-34, https://doi.org/10.1016/j.sajb.2006.05.004
. [all data]
Narain, Galvao, et al., 2007
Narain, N.; Galvao, M.S.; Madruga, M.S.,
Volatile compounds captured through purge and trap technique in caja-umbu (Spondias sp.) fruits during maturation,
Food Chem., 2007, 102, 3, 726-731, https://doi.org/10.1016/j.foodchem.2006.06.003
. [all data]
Seo, Kim, et al., 2007
Seo, H.-Y.; Kim, J.-H.; Song, H.-P.; Kim, D.-H.; Byun, M.-W.; Kwon, J.-H.; Kima, K.-S.,
Effects of gamma irradiation on the yields of volatile extracts of Angelica gigas Nakai,
Radiat. Phys. Chem., 2007, 76, 11-12, 1869-1874, https://doi.org/10.1016/j.radphyschem.2007.03.020
. [all data]
Tabanca, Demirci, et al., 2007
Tabanca, N.; Demirci, F.; Demirci, B.; Wedge, D.E.; Baser, K.H.C.,
Composition, enantiomeric distribution, and antimicrobial activity of Tanacetum argenteum subsp. ?abellifolium essential oil,
J. Pharm. Biomed. Anal., 2007, 45, 5, 714-719, https://doi.org/10.1016/j.jpba.2007.08.006
. [all data]
Tabanca N., Demirci B., et al., 2007
Tabanca N.; Demirci B.; Crockett S.L.; Baser K.H.C.; Wedge D.E.,
Chemical composition and antifungal activity of Arnica longifolia, Aster hesperius, and Chrysothamnus nauseosus essential oils,
J. Agric. Food Chem., 2007, 55, 21, 8430-8435, https://doi.org/10.1021/jf071379c
. [all data]
Vichi, Guadayol, et al., 2007
Vichi, S.; Guadayol, J.M.; Caixach, J.; López-Tamames, E.; Buxaderas, S.,
Analytical, Nutritional, and Clinical Methods. Comparative study of different extraction techniques for the analysis of virgin olive oil aroma,
Food Chem., 2007, 105, 3, 1171-1178, https://doi.org/10.1016/j.foodchem.2007.02.018
. [all data]
Baser K.H.C., Ozek G., et al., 2006
Baser K.H.C.; Ozek G.; Ozek T.; Duran A.,
Composition of the essential oil of Centaurea huber-morathii Wagenitz isolated from seeds by microdistillation,
Flavour Fragr. J., 2006, 21, 3, 568-570, https://doi.org/10.1002/ffj.1620
. [all data]
Baser, Özek, et al., 2006
Baser, K.H.C.; Özek, G.; Özek, T.; Duran, A.; Duman, H.,
Composition of the essential oils of Rhabdosciadium oligocarpum (Post ex Boiss.) Hedge et Lamond and Rhabdosciadium microcalycinum Hand.-Mazz.,
Flavour Fragr. J., 2006, 21, 4, 650-655, https://doi.org/10.1002/ffj.1639
. [all data]
Demirci B., Baser K.H.C., et al., 2006
Demirci B.; Baser K.H.C.; Tabanca N.; Wedge D.E.,
Characterization of volatile constituents of Haplopappus greenei and studies on the antifungal activity against phytopathogens,
J. Agric. Food Chem., 2006, 54, 8, 3146-3150, https://doi.org/10.1021/jf053222v
. [all data]
Erdurak, Coskun, et al., 2006
Erdurak, C.S.; Coskun, M.; Demirci, B.; Baser, K.H.C.,
Composition of the essential oil of fruits and roots of Ferulago isaurica Pesmen and F. syriaca Boiss. (Umbelliferae) from Turkey,
Flavour Fragr. J., 2006, 21, 1, 118-121, https://doi.org/10.1002/ffj.1540
. [all data]
Iscan, Kirimer, et al., 2006
Iscan, G.; Kirimer, N.; Kurkcuoglu, M.; Arabaci, T.; Kupeli, E.; Baser, K.H.C.,
Biological Activity and Composition of the Essential Oils of Achillea schischkinii Sosn. and Achillea aleppica DC. subsp. aleppica,
J. Agric. Food Chem., 2006, 54, 1, 170-173, https://doi.org/10.1021/jf051644z
. [all data]
Kürkçüoglu, Hüsnü Can Baser, et al., 2006
Kürkçüoglu, M.; Hüsnü Can Baser, K.; Iscan, G.; Malyer, H.; Kaynak, G.,
Composition and anticandidal activity of the essential oil of Chaerophyllum byzantinum Boiss.,
Flavour Fragr. J., 2006, 21, 1, 115-117, https://doi.org/10.1002/ffj.1539
. [all data]
Suleimenov Y.M., Atazhanova G.A., et al., 2006
Suleimenov Y.M.; Atazhanova G.A.; Ozek T.; Demirci B.; Kulyyasov A.T.; Adekenov S.M.; Baser K.H.C.,
Essential oil composition of three species of Achillea from Kazakhstan,
Chem. Nat. Compd. (Engl. Transl.), 2006, 37, 5, 447-450, https://doi.org/10.1023/A:1014471326724
. [all data]
Tabanca, Demirci, et al., 2006
Tabanca, N.; Demirci, B.; Ozek, T.; Kirimer, N.; Can Baser, K.H.; Bedir, E.; Khan, I.A.; Wedge, D.E.,
Gas chromatographic-mass spectrometric analysis of essential oils from Pimpinella species gathered from Central and Northern Turkey,
J. Chromatogr. A, 2006, 1117, 2, 194-205, https://doi.org/10.1016/j.chroma.2006.03.075
. [all data]
Tabanca, Demirci, et al., 2006, 2
Tabanca, N.; Demirci, B.; Can Baser, K.H.; Aytac, Z.; Ekici, M.; Khan, S.I.; Jacob, M.R.; Wedge, D.E.,
Chemical Composition and Antifungal Activity of Salvia macrochlamys and Salvia recognita Essential Oils,
J. Agric. Food Chem., 2006, 54, 18, 6593-6597, https://doi.org/10.1021/jf0608773
. [all data]
Tosun, Kürkcüoglu, et al., 2006
Tosun, A.; Kürkcüoglu, M.; Dogan, E.; Duman, H.; Baser, K.H.C.,
Essential oil composition of Seseli petraeum M. Bieb. and Seseli andronakii Woron. growing in Turkey,
Flavour Fragr. J., 2006, 21, 2, 257-259, https://doi.org/10.1002/ffj.1572
. [all data]
Vichi, Guadayol, et al., 2006
Vichi, S.; Guadayol, J.M.; Caixach, J.; López-Tamames, E.; Buxaderas, S.,
Monoterpene and sesquiterpene hydrocarbons of virgin olive oil by headspace solid-phase microextraction coupled to gas chromatography/mass spectrometry,
J. Chromatogr. A, 2006, 1125, 1, 117-123, https://doi.org/10.1016/j.chroma.2006.05.029
. [all data]
Demirci, Demirci, et al., 2005
Demirci, B.; Demirci, F.; Baser, K.H.C.,
Headspace-SPME and hydrodistillation of two fragrant Artemisia sp.,
Flavour Fragr. J., 2005, 20, 4, 395-398, https://doi.org/10.1002/ffj.1426
. [all data]
Demirci, Demirci, et al., 2005, 2
Demirci, B.; Demirci, F.; Dönmez, A.A.; Franz, G.; Paper, D.H.; Baser, K.H.C.,
Effects of Salvia essential oils on the chorioallantoic membrane (CAM) assay,
Pharm. Biol., 2005, 43, 8, 666-671, https://doi.org/10.1080/13880200500383397
. [all data]
Giuseppe, Manuela, et al., 2005
Giuseppe, Z.; Manuela, G.; Marta, B.; Vincenzo, G.,
Application of artificial neural network on mono- and sesquiterpenes compounds determined by headspace solid-phase microextraction-gas chromatography-mass spectrometry for the Piedmont ricotta cheese traceability,
J. Chromatogr. A, 2005, 1071, 1-2, 247-253, https://doi.org/10.1016/j.chroma.2004.11.083
. [all data]
Kosar, Özek, et al., 2005
Kosar, M.; Özek, T.; Göger, F.; Kürkcüoglu, M.; Hüsnü Can Baser, K.,
Comparison of Microwave-Assisted Hydrodistillation and Hydrodistillation Methods for the Analysis of Volatile Secondary Metabolites,
Pharm. Biol., 2005, 43, 6, 491-495, https://doi.org/10.1080/13880200500220136
. [all data]
Sezik E., Kocakulak E., et al., 2005
Sezik E.; Kocakulak E.; Baser K.H.C.; Ozek T.,
Composition of the essential oils of Juniperus oxycedrus subsp macrocarpa from Turkey,
Chem. Nat. Compd. (Engl. Transl.), 2005, 41, 3, 352-354, https://doi.org/10.1007/s10600-005-0149-0
. [all data]
Tabanca, Demirci, et al., 2005
Tabanca, N.; Demirci, B.; Kirimer, N.; Baser, K.H.C.; Bedir, E.; Khand, I.A.; Wedge, D.E.,
Gas chromatographic-mass spectrometric analysis of essential oils from Pimpinella aurea, Pimpinella corymbosa, Pimpinella peregrina and Pimpinella puberula gathered from Eastern and Southern Turkey,
J. Chromatogr. A, 2005, 1097, 1-2, 192-198, https://doi.org/10.1016/j.chroma.2005.10.047
. [all data]
Viljoen, Subramoney, et al., 2005
Viljoen, A.M.; Subramoney, S.; van Vuuren, S.F.; Baser, K.H.C.; Demirci, B.,
The composition, geographical variation and antimicrobial activity of Lippia javanica (Verbenaceae) leaf essential oils,
J. Ethnopharmacol., 2005, 96, 1-2, 271-277, https://doi.org/10.1016/j.jep.2004.09.017
. [all data]
Baser, Özek, et al., 2004
Baser, K.H.C.; Özek, T.; Kirimer, N.; Deliorman, D.; Ergun, F.,
Composition of the essential oils of Galium aparine L. and Galium odoratum (L.) Scop. from Turkey,
J. Essent. Oil Res., 2004, 16, 4, 305-307, https://doi.org/10.1080/10412905.2004.9698728
. [all data]
Demirci, Paper, et al., 2004
Demirci, F.; Paper, D.H.; Franz, G.; Hüsnü Can Baser, K.,
Investigation of the origanum onites L. essential oil using the Chorioallantoic Membrane (CAM) assay,
J. Agric. Food Chem., 2004, 52, 2, 251-254, https://doi.org/10.1021/jf034850k
. [all data]
Kivcak, Akay, et al., 2004
Kivcak, B.; Akay, S.; Demirci, B.; Baser, K.H.C.,
Chemical composition of essential oils from leaves and twigs of Pistacia lentiscus, Pistacia lentiscus var. chia, and Pistacia terebinthus from Turkey,
Pharm. Biol, 2004, 42, 4-5, 360-366, https://doi.org/10.1080/13880200490519677
. [all data]
Demirci, Baser, et al., 2003
Demirci, B.; Baser, K.H.C.; Yildiz, B.; Bahcecioglu, Z.,
Composition of the essential oils of six endemic Salvia spp. from Turkey,
Flavour Fragr. J., 2003, 18, 2, 116-121, https://doi.org/10.1002/ffj.1173
. [all data]
Demirci, Demirci, et al., 2003
Demirci, B.; Demirci, F.; Baser, K.H.C.,
Composition of the essential oil of Cotinus coggygria Scop. from Turkey,
Flavour Fragr. J., 2003, 18, 1, 43-44, https://doi.org/10.1002/ffj.1149
. [all data]
Kaya, Demirci, et al., 2003
Kaya, A.; Demirci, B.; Baser, K.H.C.,
The essential oil of Seseli tortuosum L. growing in Turkey,
Flavour Fragr. J., 2003, 18, 2, 159-161, https://doi.org/10.1002/ffj.1162
. [all data]
Kürkcüoglu, Demirci, et al., 2003
Kürkcüoglu, M.; Demirci, B.; Tabanca, N.; Özek, T.; Baser, K.H.C.,
The essential oil of Achillea falcata L.,
Flavour Fragr. J., 2003, 18, 3, 192-194, https://doi.org/10.1002/ffj.1176
. [all data]
Tasdemir, Demirci, et al., 2003
Tasdemir, D.; Demirci, B.; Demirci, F.; Dönmez, A.A.; Baser, K.H.C.; Rüedi, P.,
Analysis of the Volatile Components of Five Turkish Rhododendron Species by Headspace Solid-Phase Microextraction and GC-MS (HS-SPME-GC-MS),
Z. Naturforsch., 2003, 58c, 797-803. [all data]
Tunaher, Kirimer, et al., 2003
Tunaher, Z.; Kirimer, N.; Baser, K.H.C.,
Wood essential oils of Juniperus foetidissima Willd.,
Holzforschung, 2003, 57, 140-144. [all data]
Viljoen, van Vuuren, et al., 2003
Viljoen, A.; van Vuuren, S.; Ernst, E.; Klepser, M.; Demirci, B.; Baser, H.; van Wyk, B.-E.,
Osmitopsis asteriscoides (Asteraceae)-the antimicrobial activity and essential oil composition of a Cape-Dutch remedy,
J. Ethnopharmacol., 2003, 88, 2-3, 137-143, https://doi.org/10.1016/S0378-8741(03)00191-0
. [all data]
Baser, Demirci, et al., 2002
Baser, K.H.C.; Demirci, B.; Kirimer, N.; Satil, F.; Tumen, G.,
The essential oils of Thymus migricus and T. fedtschenkoi var. handelii from Turkey,
Flavour Fragr. J., 2002, 17, 1, 41-45, https://doi.org/10.1002/ffj.1036
. [all data]
Baser, Demirei, et al., 2002
Baser, K.H.C.; Demirei, B.; Özek, T.; Akalin, E.; Özhatay, N.,
Micro-distilled volatile compounds from Ferulago species growing in Western Turkey,
Pharm. Biol., 2002, 40, 6, 466-471, https://doi.org/10.1076/phbi.40.6.466.8439
. [all data]
Baser, Nuriddinov, et al., 2002
Baser, K.H.C.; Nuriddinov, H.R.; Ozek, T.; Demirci, A.B.; Azcan, N.; Nigmatullaev, A.M.,
Essential oil of Arischrada korolkowii from the Chatkal mountains of Uzbekistan,
Chem. Nat. Compd. (Engl. Transl.), 2002, 38, 1, 51-53, https://doi.org/10.1023/A:1015729731464
. [all data]
Demirci, Baser, et al., 2002
Demirci, B.; Baser, K.H.C.; Tümen, G.,
Composition of the essential oil of Salvia aramiensis Rech. fil. growing in Turkey,
Flavour Fragr. J., 2002, 17, 1, 23-25, https://doi.org/10.1002/ffj.1027
. [all data]
Hüsnü Can Baser, Demirci, et al., 2002
Hüsnü Can Baser, K.; Demirci, B.; Femirci, F.; Kocak, S.; Akinci, C.; Malyer, H.; Güleryüz, G.,
Composition and antimicrobial activity of the essential oil of Achellea multifida,
Planta Medica, 2002, 68, 10, 941-943, https://doi.org/10.1055/s-2002-34923
. [all data]
Paroul, Rota, et al., 2002
Paroul, N.; Rota, L.; Frizzo, C.; Atti dos Santos, A.C.; Moyna, P.; Gower, A.E.; Serafini, L.A.,
Chemical composition of the volatiles of Angelica root obtained by hydrodistillation and supercritical CO2 extraction,
J. Essent. Oil Res., 2002, 14, 4, 282-285, https://doi.org/10.1080/10412905.2002.9699855
. [all data]
Tunalier, Kirimer, et al., 2002
Tunalier, Z.; Kirimer, N.; Baser, K.H.C.,
The composition of essential oils from various parts of Juniperus foetidissima,
Chem. Nat. Compd. (Engl. Transl.), 2002, 38, 1, 43-47, https://doi.org/10.1023/A:1015725630556
. [all data]
Baser, Demirci, et al., 2001
Baser, K.H.C.; Demirci, B.; Tabanca, N.; Özek, T.; Gören, N.,
Composition of the essential oils of Tanacetum armenum (DC.) Schultz Bip., T. balsamita L., T. chiliophyllum (Fisch. Mey.) Schultz Bip. var. chiliophyllum and T. haradjani (Rech. fil.) Grierson and the enantiomeric distribution of camphor and carvone,
Flavour Fragr. J., 2001, 16, 3, 195-200, https://doi.org/10.1002/ffj.977
. [all data]
Buettner and Schieberle, 2001
Buettner, A.; Schieberle, P.,
Application of a comparative aroma extract dilution analysis to monitor changes in orange juice aroma compounds during processing,
Am. Chem. Soc. Symp. Ser., 2001, 782, 33-45. [all data]
Gören, Demirci, et al., 2001
Gören, N.; Demirci, B.; Baser, K.H.C.,
Composition of the essential oils of Tanacetum spp. from Turkey,
Flavour Fragr. J., 2001, 16, 3, 191-194, https://doi.org/10.1002/ffj.976
. [all data]
Kaya, Demirci, et al., 2001
Kaya, A.; Demirci, B.; Baser, K.H.C.,
The composition of the essential oil of Stachys iberica subsp. stenostachya growing in Turkey,
Chem. Nat. Compd. (Engl. Transl.), 2001, 37, 4, 326-328, https://doi.org/10.1023/A:1013762200024
. [all data]
Kirimer N., Tabanea N., et al., 2001
Kirimer N.; Tabanea N.; Demirci B.; Baser K.H.C.; Duman H.; Aytac Z.,
The essential oil of a new Sideritis species: Sideritis ozturkii Aytac and Aksoy,
Chem. Nat. Compd. (Engl. Transl.), 2001, 37, 3, 234-237, https://doi.org/10.1023/A:1012561806033
. [all data]
Özcan, Akgül, et al., 2001
Özcan, M.; Akgül, A.; Bascr, K.H.C.; Özck, T.; Tabanca, N.,
Essential oil composition of sea fennel (Crithmum maritimum) form Turkey,
Nahrung/Food, 2001, 45, 5, 353-356, https://doi.org/10.1002/1521-3803(20011001)45:5<353::AID-FOOD353>3.0.CO;2-4
. [all data]
Saglam, Gozler, et al., 2001
Saglam, H.; Gozler, T.; Kivcak, B.; Demirci, B.; Baser, K.H.C.,
Volatile compounds from Haplophyllum myrtifolium,
Chem. Nat. Compd. (Engl. Transl.), 2001, 37, 5, 442-444, https://doi.org/10.1023/A:1014467225815
. [all data]
Tabanca N., Demirci F., et al., 2001
Tabanca N.; Demirci F.; Ozek T.; Tumen G.; Baser K.H.C.,
Composition and antimicrobial activity of the essential oil of Origanum x dolichosiphon P. H. Davis,
Chem. Nat. Compd. (Engl. Transl.), 2001, 37, 3, 238-241, https://doi.org/10.1023/A:1012513922871
. [all data]
Tabanca, Kirimer, et al., 2001
Tabanca, N.; Kirimer, N.; Can Baser, K.H.,
The composition of essential oils from two varieties of Sideritis erythrantha var. erythrantha and var. cedretorum,
Turk. J. Chem., 2001, 25, 201-208. [all data]
Tabanca, Kirimer, et al., 2001, 2
Tabanca, N.; Kirimer, N.; Demirci, B.; Demirci, F.; Can Baser, K.H.,
Composition and antimicrobial activity of the essential oils of Micromeria cristata subsp. phrygia and the enantiomeric distribution of borneol,
J. Agric. Food Chem., 2001, 49, 9, 4300-4303, https://doi.org/10.1021/jf0105034
. [all data]
Tucker, Maciarello, et al., 2001
Tucker, A.O.; Maciarello, M.J.; Alkire, B.H.,
Essential oil of Aeollanthus suaveolens Mart. ex Spreng. (Lamiaceae),
J. Essent. Oil Res., 2001, 13, 3, 198-199, https://doi.org/10.1080/10412905.2001.9699662
. [all data]
Ahmed, Choudhary, et al., 2000
Ahmed, A.; Choudhary, M.I.; Farooq, A.; Demirci, B.; Demirci, F.; Baser, K.H.C.,
Essential oil constituents of the spice Cinnamomum tamala (Ham.) Nees Eberm.,
Flavour Fragr. J., 2000, 15, 6, 388-390, https://doi.org/10.1002/1099-1026(200011/12)15:6<388::AID-FFJ928>3.0.CO;2-F
. [all data]
Baser, Özek, et al., 2000, 2
Baser, K.H.C.; Özek, T.; Demirci, B.; Duman, H.,
Composition of the essential oil of Glaucosciadium cordifolium (Boiss.) Burtt et Davis from Turkey,
Flavour Fragr. J., 2000, 15, 1, 45-46, https://doi.org/10.1002/(SICI)1099-1026(200001/02)15:1<45::AID-FFJ867>3.0.CO;2-L
. [all data]
Baser, Özek, et al., 2000, 3
Baser, K.H.C.; Özek, T.; Demirci, B.; Duman, H.,
Composition of the essential oil of Prangos heyniae H. Duman et M. F. Watson, a new endemic from Turkey,
Flavour Fragr. J., 2000, 15, 1, 47-49, https://doi.org/10.1002/(SICI)1099-1026(200001/02)15:1<47::AID-FFJ869>3.0.CO;2-9
. [all data]
Kirimer, Tabanca, et al., 2000
Kirimer, N.; Tabanca, N.; Özek, T.; Tümen, G.; Baser, K.H.C.,
Essential oils of annual Sideritis species growing in Turkey,
Pharm. Biol., 2000, 38, 2, 106-111, https://doi.org/10.1076/1388-0209(200004)3821-1FT106
. [all data]
Bagci, Baser, et al., 1999
Bagci, E.; Baser, K.H.C.; Kürkcüoglu, M.; Babac, T.; Celik, S.,
Study of the essential oil composition of two subspecies of Abies cilicica (Ant. et Kotschy) Carr. from Turkey,
Flavour Fragr. J., 1999, 14, 1, 47-49, https://doi.org/10.1002/(SICI)1099-1026(199901/02)14:1<47::AID-FFJ782>3.0.CO;2-R
. [all data]
Kirimer, Tabanca, et al., 1999
Kirimer, N.; Tabanca, N.; Ozek, T.; Basher, K.H.C.; Tumen, G.,
Composition of essential oils from two endemic Sideritis species of Turkey,
Chem. Natural Comp., 1999, 35, 1, 61-64, https://doi.org/10.1007/BF02238211
. [all data]
Jakobsen, Hansen, et al., 1998
Jakobsen, H.B.; Hansen, M.; Christensen, M.R.; Brockhoff, P.B.; Olsen, C.E.,
Aroma volatiles of blanched green peas (Pisum sativum L.),
J. Agric. Food Chem., 1998, 46, 9, 3727-3734, https://doi.org/10.1021/jf980026y
. [all data]
Reddy, Angers, et al., 1998
Reddy, M.V.B.; Angers, P.; Gosselin, A.; Arul, J.,
Characterization and use of essential oil from Thymus vulgaris against Botrytis cinerea and Rhizopus stolonifer in strawberry fruits,
Phytochemistry, 1998, 47, 8, 1515-1520, https://doi.org/10.1016/S0031-9422(97)00795-4
. [all data]
Vernin, Lageot, et al., 1998
Vernin, G.; Lageot, C.; Parkanyi, C.,
GC-MS(EI, PCI, NCI, SIM, ITMS) Data Bank Analysis of Flavors and Fragrances. Kovats indices
in Instrumental Methods on Food and Beverage Analysis, D. Wetzel, G. Charalambous, ed(s)., Elsevier Sci. B.V., Amsterdam, 1998, 245-301. [all data]
Kerrola, Galambosi, et al., 1994
Kerrola, K.; Galambosi, B.; Kallio, H.,
Volatile components and odor intensity of four phenotypes of hyssop (Hyssopus officinalis L.),
J. Agric. Food Chem., 1994, 42, 3, 776-781, https://doi.org/10.1021/jf00039a035
. [all data]
Kerrola and Kallio, 1994
Kerrola, K.M.; Kallio, H.P.,
Extraction of volatile compounds of angelica (Angelica archangelica L.) root by liquid carbon dioxide,
J. Agric. Food Chem., 1994, 42, 10, 2235-2245, https://doi.org/10.1021/jf00046a030
. [all data]
Luning, de Rijk, et al., 1994
Luning, P.A.; de Rijk, T.; Wichers, H.J.; Roozen, J.P.,
Gas chromatography, mass spectrometry, and sniffing port analyses of volatile compounds of fresh bell peppers (Capsicum annuum) at different ripening stages,
J. Agric. Food Chem., 1994, 42, 4, 977-983, https://doi.org/10.1021/jf00040a027
. [all data]
Kerrola and Kallio, 1993
Kerrola, K.; Kallio, H.,
Volatile compounds and odor characteristics of carbon dioxide extract of coriander (Coriandrum sativum L.) fruits,
J. Agric. Food Chem., 1993, 41, 5, 785-790, https://doi.org/10.1021/jf00029a021
. [all data]
Vernin, 1991
Vernin, G.,
Volatile constituents of the essential oil of Santolina chamaecyparissus L.,
J. Essent. Oil Res., 1991, 3, 1, 49-53, https://doi.org/10.1080/10412905.1991.9697907
. [all data]